Gentoo Forums
Gentoo Forums
Gentoo Forums
Quick Search: in
Unable to build pykde4
View unanswered posts
View posts from last 24 hours

 
Reply to topic    Gentoo Forums Forum Index Desktop Environments
View previous topic :: View next topic  
Author Message
vorgas
n00b
n00b


Joined: 02 Nov 2005
Posts: 48

PostPosted: Mon Sep 30, 2013 1:38 am    Post subject: Unable to build pykde4 Reply with quote

Topic explains problem.

I have searched through the forums and following advice there tried setting
Code:
 PYTHON_TARGETS="python2_7"
PYTHON_SINGLE_TARGET="python2_7"
USE_PYTHON="2.7"

I used eselect python to set the python engine to 2.7. I ran python-updater multiple times.
When that failed, I removed python 3.2 entirely. It still fails.
Relevant info follows...

# emerge --info '=kde-base/pykde4-4.11.1::gentoo'
Code:

Portage 2.2.7 (default/linux/amd64/13.0/desktop/kde, gcc-4.7.3,
glibc-2.15-r3, 3.10.7-gentoo-r1 x86_64)
=================================================================
                        System Settings
=================================================================
System uname: Linux-3.10.7-gentoo-r1-x86_64-AMD_FX-tm-6100_Six-Core_Processor-with-gentoo-2.2
KiB Mem:     8154800 total,   1681676 free
KiB Swap:    8000296 total,   8000296 free
Timestamp of tree: Sun, 29 Sep 2013 17:00:01 +0000
ld GNU ld (GNU Binutils) 2.23.2
app-shells/bash:          4.2_p45
dev-java/java-config:     2.2.0
dev-lang/python:          2.7.5
dev-util/cmake:           2.8.11.2
dev-util/pkgconfig:       0.28
sys-apps/baselayout:      2.2
sys-apps/openrc:          0.12
sys-apps/sandbox:         2.6-r1
sys-devel/autoconf:       2.13, 2.69
sys-devel/automake:       1.12.6
sys-devel/binutils:       2.23.2
sys-devel/gcc:            4.6.3, 4.7.3-r1
sys-devel/gcc-config:     1.7.3
sys-devel/libtool:        2.4-r1
sys-devel/make:           3.82-r4
sys-kernel/linux-headers: 3.7 (virtual/os-headers)
sys-libs/glibc:           2.15-r3
Repositories: gentoo
ACCEPT_KEYWORDS="amd64 ~amd64"
ACCEPT_LICENSE="* -@EULA"
CBUILD="x86_64-pc-linux-gnu"
CFLAGS="-O2 -pipe -march=native"
CHOST="x86_64-pc-linux-gnu"
CONFIG_PROTECT="/etc /usr/share/config /usr/share/gnupg/qualified.txt"
CONFIG_PROTECT_MASK="/etc/ca-certificates.conf /etc/env.d
/etc/fonts/fonts.conf /etc/gconf /etc/gentoo-release /etc/sandbox.d
/etc/terminfo"
CXXFLAGS="-O2 -pipe -march=native"
DISTDIR="/usr/portage/distfiles"
FCFLAGS="-O2 -pipe"
FEATURES="assume-digests binpkg-logs config-protect-if-modified
distlocks ebuild-locks fixlafiles merge-sync news parallel-fetch
preserve-libs protect-owned sandbox sfperms strict
unknown-features-warn unmerge-logs unmerge-orphans userfetch userpriv
usersandbox usersync"
FFLAGS="-O2 -pipe"
GENTOO_MIRRORS="http://distfiles.gentoo.org"
LDFLAGS="-Wl,-O1 -Wl,--as-needed"
MAKEOPTS="-j7"
PKGDIR="/usr/portage/packages"
PORTAGE_CONFIGROOT="/"
PORTAGE_RSYNC_OPTS="--recursive --links --safe-links --perms --times
--omit-dir-times --compress --force --whole-file --delete --stats
--human-readable --timeout=180 --exclude=/distfiles --exclude=/local
--exclude=/packages"
PORTAGE_TMPDIR="/var/tmp"
PORTDIR="/usr/portage"
PORTDIR_OVERLAY=""
USE="X a52 aac acl acpi alsa amd64 berkdb bindist bittorrent bluetooth
branding bzip2 cairo cdda cdr cli consolekit cracklib crypt cups cxx
dbus declarative dri dts dvd dvdr emboss encode exif fam firefox flac
fortran gdbm gif gpm gtk iconv icu ipv6 jpeg kde kipi lcms libnotify
mad mmx mng modules mp3 mp4 mpeg mudflap multilib multimedia ncurses
networkmanager nls nptl nvidia ogg opengl openmp pam pango pcre pdf
phonon plasma png policykit postgres ppds pulseaudio python qml
qt3support qt4 readline sdl semantic-desktop session skype spell
sqlite sse sse2 ssl startup-notification svg tcpd thumbnail tiff
truetype udev udisks unicode upower usb vorbis wxwidgets x264 xcb
xcomposite xine xinerama xml xscreensaver xv xvid xvmc yahoo zlib"
ABI_X86="64" ALSA_CARDS="ali5451 als4000 atiixp atiixp-modem bt87x
ca0106 cmipci emu10k1x ens1370 ens1371 es1938 es1968 fm801 hda-intel
intel8x0 intel8x0m maestro3 trident usb-audio via82xx via82xx-modem
ymfpci" APACHE2_MODULES="authn_core authz_core socache_shmcb unixd
actions alias auth_basic authn_alias authn_anon authn_dbm
authn_default authn_file authz_dbm authz_default authz_groupfile
authz_host authz_owner authz_user autoindex cache cgi cgid dav dav_fs
dav_lock deflate dir disk_cache env expires ext_filter file_cache
filter headers include info log_config logio mem_cache mime mime_magic
negotiation rewrite setenvif speling status unique_id userdir
usertrack vhost_alias" CALLIGRA_FEATURES="kexi words flow plan sheets
stage tables krita karbon braindump author" CAMERAS="ptp2"
COLLECTD_PLUGINS="df interface irq load memory rrdtool swap syslog"
ELIBC="glibc" GPSD_PROTOCOLS="ashtech aivdm earthmate evermore fv18
garmin garmintxt gpsclock itrax mtk3301 nmea ntrip navcom oceanserver
oldstyle oncore rtcm104v2 rtcm104v3 sirf superstar2 timing tsip
tripmate tnt ubx" INPUT_DEVICES="keyboard mouse evdev" KERNEL="linux"
LCD_DEVICES="bayrad cfontz cfontz633 glk hd44780 lb216 lcdm001 mtxorb
ncurses text" LIBREOFFICE_EXTENSIONS="presenter-console
presenter-minimizer" OFFICE_IMPLEMENTATION="libreoffice"
PHP_TARGETS="php5-5" PYTHON_SINGLE_TARGET="python2_7"
PYTHON_TARGETS="python2_7" RUBY_TARGETS="ruby19 ruby18" USERLAND="GNU"
VIDEO_CARDS="nv nouveau nvidia vesa" XTABLES_ADDONS="quota2 psd pknock
lscan length2 ipv4options ipset ipp2p iface geoip fuzzy condition tee
tarpit sysrq steal rawnat logmark ipmark dhcpmac delude chaos account"
USE_PYTHON="2.7"
Unset:  CPPFLAGS, CTARGET, EMERGE_DEFAULT_OPTS, INSTALL_MASK, LANG,
LC_ALL, PORTAGE_BUNZIP2_COMMAND, PORTAGE_COMPRESS,
PORTAGE_COMPRESS_FLAGS, PORTAGE_RSYNC_EXTRA_OPTS, SYNC

# emerge -pqv '=kde-base/pykde4-4.11.1::gentoo'
Code:
[ebuild  N    ] kde-base/pykde4-4.11.1  USE="(-aqua) -debug -doc
-examples {-test}" PYTHON_TARGETS="python2_7 -python2_6 -python3_2
-python3_3"


# cat /var/tmp/portage/kde-base/pykde4-4.11.1/temp/build.log
[code:1:03a5df778c]
* Package: kde-base/pykde4-4.11.1
* Repository: gentoo
* Maintainer: kde@gentoo.org
* USE: amd64 elibc_glibc kernel_linux python_targets_python2_7
userland_GNU
* FEATURES: preserve-libs sandbox userpriv usersandbox
* python2_7: running scan_python_versions
>>> Unpacking source...
>>> Unpacking pykde4-4.11.1.tar.xz to /var/tmp/portage/kde-base/pykde4-4.11.1/work
>>> Source unpacked in /var/tmp/portage/kde-base/pykde4-4.11.1/work
>>> Preparing source in /var/tmp/portage/kde-base/pykde4-4.11.1/work/pykde4-4.11.1 ...
* Will copy sources from
/var/tmp/portage/kde-base/pykde4-4.11.1/work/pykde4-4.11.1
* python2_7: copying to
/var/tmp/portage/kde-base/pykde4-4.11.1/work/pykde4-4.11.1-python2_7
>>> Source prepared.
>>> Configuring source in /var/tmp/portage/kde-base/pykde4-4.11.1/work/pykde4-4.11.1 ...
* python2_7: running run_in_build_dir configuration
>>> Working in BUILD_DIR: "/var/tmp/portage/kde-base/pykde4-4.11.1/work/pykde4-4.11.1-python2_7"
cmake --no-warn-unused-cli -C
/var/tmp/portage/kde-base/pykde4-4.11.1/work/pykde4-4.11.1-python2_7/gentoo_common_config.cmake
-G Unix Makefiles -DCMAKE_INSTALL_PREFIX=/usr -DKDE4_BUILD_TESTS=OFF
-DCMAKE_INSTALL_PREFIX=/usr -DSYSCONF_INSTALL_DIR=/etc
-DWITH_PolkitQt=OFF -DWITH_QScintilla=OFF
-DPYTHON_EXECUTABLE=/usr/bin/python2.7 -DPYKDEUIC4_ALTINSTALL=TRUE
-DCMAKE_BUILD_TYPE=Gentoo -DCMAKE_INSTALL_DO_STRIP=OFF
-DCMAKE_USER_MAKE_RULES_OVERRIDE=/var/tmp/portage/kde-base/pykde4-4.11.1/work/pykde4-4.11.1-python2_7/gentoo_rules.cmake
/var/tmp/portage/kde-base/pykde4-4.11.1/work/pykde4-4.11.1
Not searching for unused variables given on the command line.
loading initial cache file
/var/tmp/portage/kde-base/pykde4-4.11.1/work/pykde4-4.11.1-python2_7/gentoo_common_config.cmake
-- The C compiler identification is GNU 4.7.3
-- The CXX compiler identification is GNU 4.7.3
-- Check for working C compiler: /usr/bin/x86_64-pc-linux-gnu-gcc
-- Check for working C compiler: /usr/bin/x86_64-pc-linux-gnu-gcc -- works
-- Detecting C compiler ABI info
-- Detecting C compiler ABI info - done
-- Check for working CXX compiler: /usr/bin/x86_64-pc-linux-gnu-g++
-- Check for working CXX compiler: /usr/bin/x86_64-pc-linux-gnu-g++ -- works
-- Detecting CXX compiler ABI info
-- Detecting CXX compiler ABI info - done
-- Looking for Q_WS_X11
-- Looking for Q_WS_X11 - found
-- Looking for Q_WS_WIN
-- Looking for Q_WS_WIN - not found
-- Looking for Q_WS_QWS
-- Looking for Q_WS_QWS - not found
-- Looking for Q_WS_MAC
-- Looking for Q_WS_MAC - not found
-- Found Qt-Version 4.8.5 (using /usr/bin/qmake)
-- Looking for XOpenDisplay in
/usr/lib64/libX11.so;/usr/lib64/libXext.so;/usr/lib64/libXft.so;/usr/lib64/libXau.so;/usr/lib64/libXdmcp.so;/usr/lib64/libXpm.so
-- Looking for XOpenDisplay in
/usr/lib64/libX11.so;/usr/lib64/libXext.so;/usr/lib64/libXft.so;/usr/lib64/libXau.so;/usr/lib64/libXdmcp.so;/usr/lib64/libXpm.so
- found
-- Looking for gethostbyname
-- Looking for gethostbyname - found
-- Looking for connect
-- Looking for connect - found
-- Looking for remove
-- Looking for remove - found
-- Looking for shmat
-- Looking for shmat - found
-- Looking for IceConnectionNumber in ICE
-- Looking for IceConnectionNumber in ICE - found
-- Found X11: /usr/lib64/libX11.so
-- Looking for include file pthread.h
-- Looking for include file pthread.h - found
-- Looking for pthread_create
-- Looking for pthread_create - not found
-- Looking for pthread_create in pthreads
-- Looking for pthread_create in pthreads - not found
-- Looking for pthread_create in pthread
-- Looking for pthread_create in pthread - found
-- Found Threads: TRUE
-- Found OpenSSL: /usr/lib64/libssl.so;/usr/lib64/libcrypto.so (found
version "1.0.1c")
-- Looking for _POSIX_TIMERS
-- Looking for _POSIX_TIMERS - found
-- Found Automoc4: /usr/bin/automoc4
-- Found Perl: /usr/bin/perl (found version "5.16.3")
-- Found Phonon: /usr/include (Required is at least version "4.3.80")
-- Performing Test _OFFT_IS_64BIT
-- Performing Test _OFFT_IS_64BIT - Success
-- Performing Test HAVE_FPIE_SUPPORT
-- Performing Test HAVE_FPIE_SUPPORT - Success
-- Performing Test __KDE_HAVE_W_OVERLOADED_VIRTUAL
-- Performing Test __KDE_HAVE_W_OVERLOADED_VIRTUAL - Success
-- Performing Test __KDE_HAVE_GCC_VISIBILITY
-- Performing Test __KDE_HAVE_GCC_VISIBILITY - Success
-- Found KDE 4.11 include dir: /usr/include
-- Found KDE 4.11 library dir: /usr/lib64
-- Found the KDE4 kconfig_compiler preprocessor: /usr/bin/kconfig_compiler
-- Found automoc4: /usr/bin/automoc4
-- Found PythonInterp: /usr/bin/python2.7 (found version "2.7.5")
-- Python system site-packages directory: /usr/lib64/python2.7/site-packages
-- Found PythonLibrary: /usr/lib64/libpython2.7.so
-- Python system site-packages directory: /usr/lib64/python2.7/site-packages
-- Found SIP version: 4.15.2
-- Found PyQt4 version: 4.10.3
-- Found Soprano: /usr/include (found suitable version "2.9.3",
minimum required is "1.99")
-- Found SharedDesktopOntologies: /usr/share/ontology (found version "0.11.0")
-- Found Nepomuk: /usr/lib64/libnepomuk.so;/usr/lib64/libsoprano.so
-- Found KdepimLibs: /usr/lib64/cmake/KdepimLibs/KdepimLibsConfig.cmake
-- Boost version: 1.52.0
--
-- The following OPTIONAL packages have been found:

* Threads
* OpenSSL
* Perl
* Soprano , The Soprano libraries ,
<http://projects.kde.org/kdesupport/soprano>
Required for Soprano Python bindings
* SharedDesktopOntologies
* Nepomuk , The Nepomuk libraries , <http://projects.kde.org/kde/kdelibs/>
Required for Nepomuk Python bindings
* NepomukCore
* KdepimLibs , The KDE PIM libraries , <http://projects.kde.org/kde/kdepimlibs>
Required for the Akonadi Python bindings

-- The following REQUIRED packages have been found:

* X11
* Qt4
* Automoc4
* Phonon (required version >= 4.3.80)
* KDE4Internal
* KDE4 (required version >= 4.9.4) , The KDE libraries , <http://www.kde.org>
Required to build PyKDE4
* PythonInterp , The Python interpreter , <http://www.python.org>
Required to build PyKDE4
* PythonLibrary , The Python Library , <http://www.python.org>
Required to build PyKDE4
* SIP , The SIP binding generator , <http://riverbankcomputing.com>
Required to build PyKDE4
* PyQt4 , The PyQt bindings , <http://riverbankcomputing.com>
Required to build PyKDE4
* Boost (required version >= 1.34.0) , Boost C++ Libraries ,
<http://www.boost.org>
Boost is required by Akonadi

-- <<< Gentoo configuration >>>
Build type Gentoo
Install path /usr
Compiler flags:
C -O2 -pipe -march=native -Wno-long-long
-std=iso9899:1990 -Wundef -Wcast-align -Wchar-subscripts -Wall -W
-Wpointer-arith -Wwrite-strings -Wformat-security
-Wmissing-format-attribute -fno-common
C++ -O2 -pipe -march=native -Wnon-virtual-dtor
-Wno-long-long -Wundef -Wcast-align -Wchar-subscripts -Wall -W
-Wpointer-arith -Wformat-security -fno-exceptions -DQT_NO_EXCEPTIONS
-fno-check-new -fno-common -Woverloaded-virtual
-fno-threadsafe-statics -fvisibility=hidden
-fvisibility-inlines-hidden
Linker flags:
Executable -Wl,--enable-new-dtags -Wl,-O1 -Wl,--as-needed
Module -Wl,--enable-new-dtags -Wl,--no-undefined -lc -Wl,-O1
-Wl,--as-needed
Shared -Wl,--enable-new-dtags -Wl,--no-undefined -lc -Wl,-O1
-Wl,--as-needed

-- Configuring done
-- Generating done
-- Build files have been written to:
/var/tmp/portage/kde-base/pykde4-4.11.1/work/pykde4-4.11.1-python2_7
>>> Source configured.
>>> Compiling source in /var/tmp/portage/kde-base/pykde4-4.11.1/work/pykde4-4.11.1 ...
* python2_7: running run_in_build_dir compilation
>>> Working in BUILD_DIR: "/var/tmp/portage/kde-base/pykde4-4.11.1/work/pykde4-4.11.1-python2_7"
make -j7 VERBOSE=1
/usr/bin/cmake -H/var/tmp/portage/kde-base/pykde4-4.11.1/work/pykde4-4.11.1
-B/var/tmp/portage/kde-base/pykde4-4.11.1/work/pykde4-4.11.1-python2_7
--check-build-system CMakeFiles/Makefile.cmake 0
/usr/bin/cmake -E cmake_progress_start
/var/tmp/portage/kde-base/pykde4-4.11.1/work/pykde4-4.11.1-python2_7/CMakeFiles
/var/tmp/portage/kde-base/pykde4-4.11.1/work/pykde4-4.11.1-python2_7/CMakeFiles/progress.marks
make -f CMakeFiles/Makefile2 all
make[1]: Entering directory
`/var/tmp/portage/kde-base/pykde4-4.11.1/work/pykde4-4.11.1-python2_7'
make -f CMakeFiles/python_module_PyKDE4_akonadi.dir/build.make
CMakeFiles/python_module_PyKDE4_akonadi.dir/depend
make -f CMakeFiles/python_module_PyKDE4_dnssd.dir/build.make
CMakeFiles/python_module_PyKDE4_dnssd.dir/depend
make -f CMakeFiles/python_module_PyKDE4_kdecore.dir/build.make
CMakeFiles/python_module_PyKDE4_kdecore.dir/depend
make -f CMakeFiles/python_module_PyKDE4_kdeui.dir/build.make
CMakeFiles/python_module_PyKDE4_kdeui.dir/depend
make -f CMakeFiles/python_module_PyKDE4_khtml.dir/build.make
CMakeFiles/python_module_PyKDE4_khtml.dir/depend
make -f CMakeFiles/python_module_PyKDE4_kio.dir/build.make
CMakeFiles/python_module_PyKDE4_kio.dir/depend
make -f CMakeFiles/python_module_PyKDE4_knewstuff.dir/build.make
CMakeFiles/python_module_PyKDE4_knewstuff.dir/depend
make[2]: Entering directory
`/var/tmp/portage/kde-base/pykde4-4.11.1/work/pykde4-4.11.1-python2_7'
/usr/bin/cmake -E cmake_progress_report
/var/tmp/portage/kde-base/pykde4-4.11.1/work/pykde4-4.11.1-python2_7/CMakeFiles
8
make[2]: Entering directory
`/var/tmp/portage/kde-base/pykde4-4.11.1/work/pykde4-4.11.1-python2_7'
/usr/bin/cmake -E cmake_progress_report
/var/tmp/portage/kde-base/pykde4-4.11.1/work/pykde4-4.11.1-python2_7/CMakeFiles
make[2]: Entering directory
`/var/tmp/portage/kde-base/pykde4-4.11.1/work/pykde4-4.11.1-python2_7'
/usr/bin/cmake -E cmake_progress_report
/var/tmp/portage/kde-base/pykde4-4.11.1/work/pykde4-4.11.1-python2_7/CMakeFiles
14
make[2]: Entering directory
`/var/tmp/portage/kde-base/pykde4-4.11.1/work/pykde4-4.11.1-python2_7'
/usr/bin/cmake -E cmake_progress_report
/var/tmp/portage/kde-base/pykde4-4.11.1/work/pykde4-4.11.1-python2_7/CMakeFiles
2
[ 1%] make[2]: Entering directory
`/var/tmp/portage/kde-base/pykde4-4.11.1/work/pykde4-4.11.1-python2_7'
[ 1%] /usr/bin/cmake -E cmake_progress_report
/var/tmp/portage/kde-base/pykde4-4.11.1/work/pykde4-4.11.1-python2_7/CMakeFiles
39
[ 2%] make[2]: Entering directory
`/var/tmp/portage/kde-base/pykde4-4.11.1/work/pykde4-4.11.1-python2_7'
/usr/bin/cmake -E cmake_progress_report
/var/tmp/portage/kde-base/pykde4-4.11.1/work/pykde4-4.11.1-python2_7/CMakeFiles
20
make[2]: Entering directory
`/var/tmp/portage/kde-base/pykde4-4.11.1/work/pykde4-4.11.1-python2_7'
/usr/bin/cmake -E cmake_progress_report
/var/tmp/portage/kde-base/pykde4-4.11.1/work/pykde4-4.11.1-python2_7/CMakeFiles
[ 3%] [ 4%] [ 5%] Generating sip/dnssd/sipdnssdpart0.cpp,
sip/dnssd/sipdnssdpart1.cpp, sip/dnssd/sipdnssdpart2.cpp,
sip/dnssd/sipdnssdpart3.cpp, sip/dnssd/sipdnssdpart4.cpp,
sip/dnssd/sipdnssdpart5.cpp, sip/dnssd/sipdnssdpart6.cpp,
sip/dnssd/sipdnssdpart7.cpp
Generating sip/akonadi/sipakonadipart0.cpp,
sip/akonadi/sipakonadipart1.cpp, sip/akonadi/sipakonadipart2.cpp,
sip/akonadi/sipakonadipart3.cpp, sip/akonadi/sipakonadipart4.cpp,
sip/akonadi/sipakonadipart5.cpp, sip/akonadi/sipakonadipart6.cpp,
sip/akonadi/sipakonadipart7.cpp
/usr/bin/cmake -E echo
Generating sip/kdecore/sipkdecorepart0.cpp,
sip/kdecore/sipkdecorepart1.cpp, sip/kdecore/sipkdecorepart2.cpp,
sip/kdecore/sipkdecorepart3.cpp, sip/kdecore/sipkdecorepart4.cpp,
sip/kdecore/sipkdecorepart5.cpp, sip/kdecore/sipkdecorepart6.cpp,
sip/kdecore/sipkdecorepart7.cpp
[ 5%] /usr/bin/cmake -E echo
Generating sip/khtml/sipkhtmlpart0.cpp, sip/khtml/sipkhtmlpart1.cpp,
sip/khtml/sipkhtmlpart2.cpp, sip/khtml/sipkhtmlpart3.cpp,
sip/khtml/sipkhtmlpart4.cpp, sip/khtml/sipkhtmlpart5.cpp,
sip/khtml/sipkhtmlpart6.cpp, sip/khtml/sipkhtmlpart7.cpp
/usr/bin/cmake -E echo

/usr/bin/cmake -E echo
Generating sip/knewstuff/sipknewstuffpart0.cpp,
sip/knewstuff/sipknewstuffpart1.cpp,
sip/knewstuff/sipknewstuffpart2.cpp,
sip/knewstuff/sipknewstuffpart3.cpp,
sip/knewstuff/sipknewstuffpart4.cpp,
sip/knewstuff/sipknewstuffpart5.cpp,
sip/knewstuff/sipknewstuffpart6.cpp,
sip/knewstuff/sipknewstuffpart7.cpp
touch /var/tmp/portage/kde-base/pykde4-4.11.1/work/pykde4-4.11.1-python2_7/sip/akonadi/sipakonadipart0.cpp
/var/tmp/portage/kde-base/pykde4-4.11.1/work/pykde4-4.11.1-python2_7/sip/akonadi/sipakonadipart1.cpp
/var/tmp/portage/kde-base/pykde4-4.11.1/work/pykde4-4.11.1-python2_7/sip/akonadi/sipakonadipart2.cpp
/var/tmp/portage/kde-base/pykde4-4.11.1/work/pykde4-4.11.1-python2_7/sip/akonadi/sipakonadipart3.cpp
/var/tmp/portage/kde-base/pykde4-4.11.1/work/pykde4-4.11.1-python2_7/sip/akonadi/sipakonadipart4.cpp
/var/tmp/portage/kde-base/pykde4-4.11.1/work/pykde4-4.11.1-python2_7/sip/akonadi/sipakonadipart5.cpp
/var/tmp/portage/kde-base/pykde4-4.11.1/work/pykde4-4.11.1-python2_7/sip/akonadi/sipakonadipart6.cpp
/var/tmp/portage/kde-base/pykde4-4.11.1/work/pykde4-4.11.1-python2_7/sip/akonadi/sipakonadipart7.cpp
/usr/bin/cmake -E echo
Generating sip/kdeui/sipkdeuipart0.cpp, sip/kdeui/sipkdeuipart1.cpp,
sip/kdeui/sipkdeuipart2.cpp, sip/kdeui/sipkdeuipart3.cpp,
sip/kdeui/sipkdeuipart4.cpp, sip/kdeui/sipkdeuipart5.cpp,
sip/kdeui/sipkdeuipart6.cpp, sip/kdeui/sipkdeuipart7.cpp
/usr/bin/cmake -E echo

touch /var/tmp/portage/kde-base/pykde4-4.11.1/work/pykde4-4.11.1-python2_7/sip/kdecore/sipkdecorepart0.cpp
/var/tmp/portage/kde-base/pykde4-4.11.1/work/pykde4-4.11.1-python2_7/sip/kdecore/sipkdecorepart1.cpp
/var/tmp/portage/kde-base/pykde4-4.11.1/work/pykde4-4.11.1-python2_7/sip/kdecore/sipkdecorepart2.cpp
/var/tmp/portage/kde-base/pykde4-4.11.1/work/pykde4-4.11.1-python2_7/sip/kdecore/sipkdecorepart3.cpp
/var/tmp/portage/kde-base/pykde4-4.11.1/work/pykde4-4.11.1-python2_7/sip/kdecore/sipkdecorepart4.cpp
/var/tmp/portage/kde-base/pykde4-4.11.1/work/pykde4-4.11.1-python2_7/sip/kdecore/sipkdecorepart5.cpp
/var/tmp/portage/kde-base/pykde4-4.11.1/work/pykde4-4.11.1-python2_7/sip/kdecore/sipkdecorepart6.cpp
/var/tmp/portage/kde-base/pykde4-4.11.1/work/pykde4-4.11.1-python2_7/sip/kdecore/sipkdecorepart7.cpp
/usr/bin/sip -t ALL -t WS_X11 -t Qt_4_8_4 -x VendorID -x
PyQt_NoPrintRangeBug -g -x PyKDE_QVector -x Py_v3 -j 8 -c
/var/tmp/portage/kde-base/pykde4-4.11.1/work/pykde4-4.11.1-python2_7/sip/akonadi
-I /usr/share/sip -I
/var/tmp/portage/kde-base/pykde4-4.11.1/work/pykde4-4.11.1/sip
/var/tmp/portage/kde-base/pykde4-4.11.1/work/pykde4-4.11.1/sip/akonadi/akonadimod.sip



/usr/bin/sip -t ALL -t WS_X11 -t Qt_4_8_4 -x VendorID -x
PyQt_NoPrintRangeBug -g -x PyKDE_QVector -x Py_v3 -j 8 -c
/var/tmp/portage/kde-base/pykde4-4.11.1/work/pykde4-4.11.1-python2_7/sip/kdecore
-I /usr/share/sip -I
/var/tmp/portage/kde-base/pykde4-4.11.1/work/pykde4-4.11.1/sip
/var/tmp/portage/kde-base/pykde4-4.11.1/work/pykde4-4.11.1/sip/kdecore/kdecoremod.sip
touch /var/tmp/portage/kde-base/pykde4-4.11.1/work/pykde4-4.11.1-python2_7/sip/khtml/sipkhtmlpart0.cpp
/var/tmp/portage/kde-base/pykde4-4.11.1/work/pykde4-4.11.1-python2_7/sip/khtml/sipkhtmlpart1.cpp
/var/tmp/portage/kde-base/pykde4-4.11.1/work/pykde4-4.11.1-python2_7/sip/khtml/sipkhtmlpart2.cpp
/var/tmp/portage/kde-base/pykde4-4.11.1/work/pykde4-4.11.1-python2_7/sip/khtml/sipkhtmlpart3.cpp
/var/tmp/portage/kde-base/pykde4-4.11.1/work/pykde4-4.11.1-python2_7/sip/khtml/sipkhtmlpart4.cpp
/var/tmp/portage/kde-base/pykde4-4.11.1/work/pykde4-4.11.1-python2_7/sip/khtml/sipkhtmlpart5.cpp
/var/tmp/portage/kde-base/pykde4-4.11.1/work/pykde4-4.11.1-python2_7/sip/khtml/sipkhtmlpart6.cpp
/var/tmp/portage/kde-base/pykde4-4.11.1/work/pykde4-4.11.1-python2_7/sip/khtml/sipkhtmlpart7.cpp
touch /var/tmp/portage/kde-base/pykde4-4.11.1/work/pykde4-4.11.1-python2_7/sip/knewstuff/sipknewstuffpart0.cpp
/var/tmp/portage/kde-base/pykde4-4.11.1/work/pykde4-4.11.1-python2_7/sip/knewstuff/sipknewstuffpart1.cpp
/var/tmp/portage/kde-base/pykde4-4.11.1/work/pykde4-4.11.1-python2_7/sip/knewstuff/sipknewstuffpart2.cpp
/var/tmp/portage/kde-base/pykde4-4.11.1/work/pykde4-4.11.1-python2_7/sip/knewstuff/sipknewstuffpart3.cpp
/var/tmp/portage/kde-base/pykde4-4.11.1/work/pykde4-4.11.1-python2_7/sip/knewstuff/sipknewstuffpart4.cpp
/var/tmp/portage/kde-base/pykde4-4.11.1/work/pykde4-4.11.1-python2_7/sip/knewstuff/sipknewstuffpart5.cpp
/var/tmp/portage/kde-base/pykde4-4.11.1/work/pykde4-4.11.1-python2_7/sip/knewstuff/sipknewstuffpart6.cpp
/var/tmp/portage/kde-base/pykde4-4.11.1/work/pykde4-4.11.1-python2_7/sip/knewstuff/sipknewstuffpart7.cpp
touch /var/tmp/portage/kde-base/pykde4-4.11.1/work/pykde4-4.11.1-python2_7/sip/dnssd/sipdnssdpart0.cpp
/var/tmp/portage/kde-base/pykde4-4.11.1/work/pykde4-4.11.1-python2_7/sip/dnssd/sipdnssdpart1.cpp
/var/tmp/portage/kde-base/pykde4-4.11.1/work/pykde4-4.11.1-python2_7/sip/dnssd/sipdnssdpart2.cpp
/var/tmp/portage/kde-base/pykde4-4.11.1/work/pykde4-4.11.1-python2_7/sip/dnssd/sipdnssdpart3.cpp
/var/tmp/portage/kde-base/pykde4-4.11.1/work/pykde4-4.11.1-python2_7/sip/dnssd/sipdnssdpart4.cpp
/var/tmp/portage/kde-base/pykde4-4.11.1/work/pykde4-4.11.1-python2_7/sip/dnssd/sipdnssdpart5.cpp
/var/tmp/portage/kde-base/pykde4-4.11.1/work/pykde4-4.11.1-python2_7/sip/dnssd/sipdnssdpart6.cpp
/var/tmp/portage/kde-base/pykde4-4.11.1/work/pykde4-4.11.1-python2_7/sip/dnssd/sipdnssdpart7.cpp
/usr/bin/sip -t ALL -t WS_X11 -t Qt_4_8_4 -x VendorID -x
PyQt_NoPrintRangeBug -g -x PyKDE_QVector -x Py_v3 -j 8 -c
/var/tmp/portage/kde-base/pykde4-4.11.1/work/pykde4-4.11.1-python2_7/sip/dnssd
-I /usr/share/sip -I
/var/tmp/portage/kde-base/pykde4-4.11.1/work/pykde4-4.11.1/sip
/var/tmp/portage/kde-base/pykde4-4.11.1/work/pykde4-4.11.1/sip/dnssd/dnssdmod.sip

touch /var/tmp/portage/kde-base/pykde4-4.11.1/work/pykde4-4.11.1-python2_7/sip/kdeui/sipkdeuipart0.cpp
/var/tmp/portage/kde-base/pykde4-4.11.1/work/pykde4-4.11.1-python2_7/sip/kdeui/sipkdeuipart1.cpp
/var/tmp/portage/kde-base/pykde4-4.11.1/work/pykde4-4.11.1-python2_7/sip/kdeui/sipkdeuipart2.cpp
/var/tmp/portage/kde-base/pykde4-4.11.1/work/pykde4-4.11.1-python2_7/sip/kdeui/sipkdeuipart3.cpp
/var/tmp/portage/kde-base/pykde4-4.11.1/work/pykde4-4.11.1-python2_7/sip/kdeui/sipkdeuipart4.cpp
/var/tmp/portage/kde-base/pykde4-4.11.1/work/pykde4-4.11.1-python2_7/sip/kdeui/sipkdeuipart5.cpp
/var/tmp/portage/kde-base/pykde4-4.11.1/work/pykde4-4.11.1-python2_7/sip/kdeui/sipkdeuipart6.cpp
/var/tmp/portage/kde-base/pykde4-4.11.1/work/pykde4-4.11.1-python2_7/sip/kdeui/sipkdeuipart7.cpp
Generating sip/kio/sipkiopart0.cpp, sip/kio/sipkiopart1.cpp,
sip/kio/sipkiopart2.cpp, sip/kio/sipkiopart3.cpp,
sip/kio/sipkiopart4.cpp, sip/kio/sipkiopart5.cpp,
sip/kio/sipkiopart6.cpp, sip/kio/sipkiopart7.cpp
/usr/bin/cmake -E echo

/usr/bin/sip -t ALL -t WS_X11 -t Qt_4_8_4 -x VendorID -x
PyQt_NoPrintRangeBug -g -x PyKDE_QVector -x Py_v3 -j 8 -c
/var/tmp/portage/kde-base/pykde4-4.11.1/work/pykde4-4.11.1-python2_7/sip/khtml
-I /usr/share/sip -I
/var/tmp/portage/kde-base/pykde4-4.11.1/work/pykde4-4.11.1/sip
/var/tmp/portage/kde-base/pykde4-4.11.1/work/pykde4-4.11.1/sip/khtml/khtmlmod.sip
touch /var/tmp/portage/kde-base/pykde4-4.11.1/work/pykde4-4.11.1-python2_7/sip/kio/sipkiopart0.cpp
/var/tmp/portage/kde-base/pykde4-4.11.1/work/pykde4-4.11.1-python2_7/sip/kio/sipkiopart1.cpp
/var/tmp/portage/kde-base/pykde4-4.11.1/work/pykde4-4.11.1-python2_7/sip/kio/sipkiopart2.cpp
/var/tmp/portage/kde-base/pykde4-4.11.1/work/pykde4-4.11.1-python2_7/sip/kio/sipkiopart3.cpp
/var/tmp/portage/kde-base/pykde4-4.11.1/work/pykde4-4.11.1-python2_7/sip/kio/sipkiopart4.cpp
/var/tmp/portage/kde-base/pykde4-4.11.1/work/pykde4-4.11.1-python2_7/sip/kio/sipkiopart5.cpp
/var/tmp/portage/kde-base/pykde4-4.11.1/work/pykde4-4.11.1-python2_7/sip/kio/sipkiopart6.cpp
/var/tmp/portage/kde-base/pykde4-4.11.1/work/pykde4-4.11.1-python2_7/sip/kio/sipkiopart7.cpp
/usr/bin/sip -t ALL -t WS_X11 -t Qt_4_8_4 -x VendorID -x
PyQt_NoPrintRangeBug -g -x PyKDE_QVector -x Py_v3 -j 8 -c
/var/tmp/portage/kde-base/pykde4-4.11.1/work/pykde4-4.11.1-python2_7/sip/kdeui
-I /usr/share/sip -I
/var/tmp/portage/kde-base/pykde4-4.11.1/work/pykde4-4.11.1/sip
/var/tmp/portage/kde-base/pykde4-4.11.1/work/pykde4-4.11.1/sip/kdeui/kdeuimod.sip
/usr/bin/sip -t ALL -t WS_X11 -t Qt_4_8_4 -x VendorID -x
PyQt_NoPrintRangeBug -g -x PyKDE_QVector -x Py_v3 -j 8 -c
/var/tmp/portage/kde-base/pykde4-4.11.1/work/pykde4-4.11.1-python2_7/sip/knewstuff
-I /usr/share/sip -I
/var/tmp/portage/kde-base/pykde4-4.11.1/work/pykde4-4.11.1/sip
/var/tmp/portage/kde-base/pykde4-4.11.1/work/pykde4-4.11.1/sip/knewstuff/knewstuffmod.sip
/usr/bin/sip -t ALL -t WS_X11 -t Qt_4_8_4 -x VendorID -x
PyQt_NoPrintRangeBug -g -x PyKDE_QVector -x Py_v3 -j 8 -c
/var/tmp/portage/kde-base/pykde4-4.11.1/work/pykde4-4.11.1-python2_7/sip/kio
-I /usr/share/sip -I
/var/tmp/portage/kde-base/pykde4-4.11.1/work/pykde4-4.11.1/sip
/var/tmp/portage/kde-base/pykde4-4.11.1/work/pykde4-4.11.1/sip/kio/kiomod.sip
cd /var/tmp/portage/kde-base/pykde4-4.11.1/work/pykde4-4.11.1-python2_7
&& /usr/bin/cmake -E cmake_depends "Unix Makefiles"
/var/tmp/portage/kde-base/pykde4-4.11.1/work/pykde4-4.11.1
/var/tmp/portage/kde-base/pykde4-4.11.1/work/pykde4-4.11.1
/var/tmp/portage/kde-base/pykde4-4.11.1/work/pykde4-4.11.1-python2_7
/var/tmp/portage/kde-base/pykde4-4.11.1/work/pykde4-4.11.1-python2_7
/var/tmp/portage/kde-base/pykde4-4.11.1/work/pykde4-4.11.1-python2_7/CMakeFiles/python_module_PyKDE4_kdecore.dir/DependInfo.cmake
--color=
Dependee "/var/tmp/portage/kde-base/pykde4-4.11.1/work/pykde4-4.11.1-python2_7/CMakeFiles/python_module_PyKDE4_kdecore.dir/DependInfo.cmake"
is newer than depender
"/var/tmp/portage/kde-base/pykde4-4.11.1/work/pykde4-4.11.1-python2_7/CMakeFiles/python_module_PyKDE4_kdecore.dir/depend.internal".
Dependee "/var/tmp/portage/kde-base/pykde4-4.11.1/work/pykde4-4.11.1-python2_7/CMakeFiles/CMakeDirectoryInformation.cmake"
is newer than depender
"/var/tmp/portage/kde-base/pykde4-4.11.1/work/pykde4-4.11.1-python2_7/CMakeFiles/python_module_PyKDE4_kdecore.dir/depend.internal".
Scanning dependencies of target python_module_PyKDE4_kdecore
make[2]: Leaving directory
`/var/tmp/portage/kde-base/pykde4-4.11.1/work/pykde4-4.11.1-python2_7'
make -f CMakeFiles/python_module_PyKDE4_kdecore.dir/build.make
CMakeFiles/python_module_PyKDE4_kdecore.dir/build
make[2]: Entering directory
`/var/tmp/portage/kde-base/pykde4-4.11.1/work/pykde4-4.11.1-python2_7'
/usr/bin/cmake -E cmake_progress_report
/var/tmp/portage/kde-base/pykde4-4.11.1/work/pykde4-4.11.1-python2_7/CMakeFiles
15
[ 6%] Building CXX object
CMakeFiles/python_module_PyKDE4_kdecore.dir/sip/kdecore/sipkdecorepart0.cpp.o
/usr/bin/x86_64-pc-linux-gnu-g++ -DQT_CORE_LIB -DQT_GUI_LIB
-DUSING_SOPRANO_NRLMODEL_UNSTABLE_API -D_BSD_SOURCE -D_REENTRANT
-Dpython_module_PyKDE4_kdecore_EXPORTS -DQT_NO_DEBUG -DNDEBUG -O2
-pipe -march=native -Wnon-virtual-dtor -Wno-long-long -Wundef
-Wcast-align -Wchar-subscripts -Wall -W -Wpointer-arith
-Wformat-security -fno-exceptions -DQT_NO_EXCEPTIONS -fno-check-new
-fno-common -Woverloaded-virtual -fno-threadsafe-statics
-fvisibility=hidden -fvisibility-inlines-hidden -fPIC
-I/var/tmp/portage/kde-base/pykde4-4.11.1/work/pykde4-4.11.1-python2_7
-I/var/tmp/portage/kde-base/pykde4-4.11.1/work/pykde4-4.11.1
-I/usr/include/KDE -I/usr/include/qt4/QtXmlPatterns
-I/usr/include/qt4/QtXml -I/usr/include/qt4/QtWebKit
-I/usr/include/qt4/QtUiTools -I/usr/include/qt4/QtTest
-I/usr/include/qt4/QtSvg -I/usr/include/qt4/QtSql
-I/usr/include/qt4/QtScriptTools -I/usr/include/qt4/QtScript
-I/usr/include/qt4/QtOpenGL -I/usr/include/qt4/QtNetwork
-I/usr/include/qt4/QtMultimedia -I/usr/include/qt4/QtDesigner
-I/usr/include/qt4/QtDeclarative -I/usr/include/qt4/QtDBus
-I/usr/include/qt4/Qt3Support -I/usr/include/qt4/QtGui
-I/usr/include/qt4/QtCore -I/usr/include/qt4/Qt
-I/usr/share/qt4/mkspecs/default -I/usr/include/qt4
-I/usr/include/python2.7 -I/usr/include/solid -I/usr/include/kio
-I/usr/include/dom -I/usr/include/ksettings -I/usr/include/knewstuff2
-I/usr/include/dnssd -o
CMakeFiles/python_module_PyKDE4_kdecore.dir/sip/kdecore/sipkdecorepart0.cpp.o
-c /var/tmp/portage/kde-base/pykde4-4.11.1/work/pykde4-4.11.1-python2_7/sip/kdecore/sipkdecorepart0.cpp
sip: Deprecation warning:
/var/tmp/portage/kde-base/pykde4-4.11.1/work/pykde4-4.11.1/sip/kdeui/kxmlguibuilder.sip:41:
Annotations should not be used in explicit C/C++ signatures
sip: Deprecation warning:
/var/tmp/portage/kde-base/pykde4-4.11.1/work/pykde4-4.11.1/sip/kdeui/kxmlguibuilder.sip:41:
Annotations should not be used in explicit C/C++ signatures
sip: Deprecation warning:
/var/tmp/portage/kde-base/pykde4-4.11.1/work/pykde4-4.11.1/sip/kdeui/kxmlguibuilder.sip:41:
Annotations should not be used in explicit C/C++ signatures
sip: Deprecation warning:
/var/tmp/portage/kde-base/pykde4-4.11.1/work/pykde4-4.11.1/sip/kdeui/kxmlguibuilder.sip:41:
Annotations should not be used in explicit C/C++ signatures
sip: Deprecation warning:
/var/tmp/portage/kde-base/pykde4-4.11.1/work/pykde4-4.11.1/sip/kdeui/kxmlguibuilder.sip:41:
Annotations should not be used in explicit C/C++ signatures
sip: Deprecation warning:
/var/tmp/portage/kde-base/pykde4-4.11.1/work/pykde4-4.11.1/sip/kdeui/kxmlguibuilder.sip:41:
Annotations should not be used in explicit C/C++ signatures
/usr/bin/cmake -E cmake_progress_report
/var/tmp/portage/kde-base/pykde4-4.11.1/work/pykde4-4.11.1-python2_7/CMakeFiles
[ 6%] Building CXX object
CMakeFiles/python_module_PyKDE4_kdecore.dir/sip/kdecore/sipkdecorepart1.cpp.o
/usr/bin/x86_64-pc-linux-gnu-g++ -DQT_CORE_LIB -DQT_GUI_LIB
-DUSING_SOPRANO_NRLMODEL_UNSTABLE_API -D_BSD_SOURCE -D_REENTRANT
-Dpython_module_PyKDE4_kdecore_EXPORTS -DQT_NO_DEBUG -DNDEBUG -O2
-pipe -march=native -Wnon-virtual-dtor -Wno-long-long -Wundef
-Wcast-align -Wchar-subscripts -Wall -W -Wpointer-arith
-Wformat-security -fno-exceptions -DQT_NO_EXCEPTIONS -fno-check-new
-fno-common -Woverloaded-virtual -fno-threadsafe-statics
-fvisibility=hidden -fvisibility-inlines-hidden -fPIC
-I/var/tmp/portage/kde-base/pykde4-4.11.1/work/pykde4-4.11.1-python2_7
-I/var/tmp/portage/kde-base/pykde4-4.11.1/work/pykde4-4.11.1
-I/usr/include/KDE -I/usr/include/qt4/QtXmlPatterns
-I/usr/include/qt4/QtXml -I/usr/include/qt4/QtWebKit
-I/usr/include/qt4/QtUiTools -I/usr/include/qt4/QtTest
-I/usr/include/qt4/QtSvg -I/usr/include/qt4/QtSql
-I/usr/include/qt4/QtScriptTools -I/usr/include/qt4/QtScript
-I/usr/include/qt4/QtOpenGL -I/usr/include/qt4/QtNetwork
-I/usr/include/qt4/QtMultimedia -I/usr/include/qt4/QtDesigner
-I/usr/include/qt4/QtDeclarative -I/usr/include/qt4/QtDBus
-I/usr/include/qt4/Qt3Support -I/usr/include/qt4/QtGui
-I/usr/include/qt4/QtCore -I/usr/include/qt4/Qt
-I/usr/share/qt4/mkspecs/default -I/usr/include/qt4
-I/usr/include/python2.7 -I/usr/include/solid -I/usr/include/kio
-I/usr/include/dom -I/usr/include/ksettings -I/usr/include/knewstuff2
-I/usr/include/dnssd -o
CMakeFiles/python_module_PyKDE4_kdecore.dir/sip/kdecore/sipkdecorepart1.cpp.o
-c /var/tmp/portage/kde-base/pykde4-4.11.1/work/pykde4-4.11.1-python2_7/sip/kdecore/sipkdecorepart1.cpp
cd /var/tmp/portage/kde-base/pykde4-4.11.1/work/pykde4-4.11.1-python2_7
&& /usr/bin/cmake -E cmake_depends "Unix Makefiles"
/var/tmp/portage/kde-base/pykde4-4.11.1/work/pykde4-4.11.1
/var/tmp/portage/kde-base/pykde4-4.11.1/work/pykde4-4.11.1
/var/tmp/portage/kde-base/pykde4-4.11.1/work/pykde4-4.11.1-python2_7
/var/tmp/portage/kde-base/pykde4-4.11.1/work/pykde4-4.11.1-python2_7
/var/tmp/portage/kde-base/pykde4-4.11.1/work/pykde4-4.11.1-python2_7/CMakeFiles/python_module_PyKDE4_knewstuff.dir/DependInfo.cmake
--color=
Dependee "/var/tmp/portage/kde-base/pykde4-4.11.1/work/pykde4-4.11.1-python2_7/CMakeFiles/python_module_PyKDE4_knewstuff.dir/DependInfo.cmake"
is newer than depender
"/var/tmp/portage/kde-base/pykde4-4.11.1/work/pykde4-4.11.1-python2_7/CMakeFiles/python_module_PyKDE4_knewstuff.dir/depend.internal".
Dependee "/var/tmp/portage/kde-base/pykde4-4.11.1/work/pykde4-4.11.1-python2_7/CMakeFiles/CMakeDirectoryInformation.cmake"
is newer than depender
"/var/tmp/portage/kde-base/pykde4-4.11.1/work/pykde4-4.11.1-python2_7/CMakeFiles/python_module_PyKDE4_knewstuff.dir/depend.internal".
Scanning dependencies of target python_module_PyKDE4_knewstuff
make[2]: Leaving directory
`/var/tmp/portage/kde-base/pykde4-4.11.1/work/pykde4-4.11.1-python2_7'
make -f CMakeFiles/python_module_PyKDE4_knewstuff.dir/build.make
CMakeFiles/python_module_PyKDE4_knewstuff.dir/build
make[2]: Entering directory
`/var/tmp/portage/kde-base/pykde4-4.11.1/work/pykde4-4.11.1-python2_7'
/usr/bin/cmake -E cmake_progress_report
/var/tmp/portage/kde-base/pykde4-4.11.1/work/pykde4-4.11.1-python2_7/CMakeFiles
[ 6%] Building CXX object
CMakeFiles/python_module_PyKDE4_knewstuff.dir/sip/knewstuff/sipknewstuffpart0.cpp.o
/usr/bin/x86_64-pc-linux-gnu-g++ -DQT_CORE_LIB -DQT_GUI_LIB
-DUSING_SOPRANO_NRLMODEL_UNSTABLE_API -D_BSD_SOURCE -D_REENTRANT
-Dpython_module_PyKDE4_knewstuff_EXPORTS -DQT_NO_DEBUG -DNDEBUG -O2
-pipe -march=native -Wnon-virtual-dtor -Wno-long-long -Wundef
-Wcast-align -Wchar-subscripts -Wall -W -Wpointer-arith
-Wformat-security -fno-exceptions -DQT_NO_EXCEPTIONS -fno-check-new
-fno-common -Woverloaded-virtual -fno-threadsafe-statics
-fvisibility=hidden -fvisibility-inlines-hidden -fPIC
-I/var/tmp/portage/kde-base/pykde4-4.11.1/work/pykde4-4.11.1-python2_7
-I/var/tmp/portage/kde-base/pykde4-4.11.1/work/pykde4-4.11.1
-I/usr/include/KDE -I/usr/include/qt4/QtXmlPatterns
-I/usr/include/qt4/QtXml -I/usr/include/qt4/QtWebKit
-I/usr/include/qt4/QtUiTools -I/usr/include/qt4/QtTest
-I/usr/include/qt4/QtSvg -I/usr/include/qt4/QtSql
-I/usr/include/qt4/QtScriptTools -I/usr/include/qt4/QtScript
-I/usr/include/qt4/QtOpenGL -I/usr/include/qt4/QtNetwork
-I/usr/include/qt4/QtMultimedia -I/usr/include/qt4/QtDesigner
-I/usr/include/qt4/QtDeclarative -I/usr/include/qt4/QtDBus
-I/usr/include/qt4/Qt3Support -I/usr/include/qt4/QtGui
-I/usr/include/qt4/QtCore -I/usr/include/qt4/Qt
-I/usr/share/qt4/mkspecs/default -I/usr/include/qt4
-I/usr/include/python2.7 -I/usr/include/solid -I/usr/include/kio
-I/usr/include/dom -I/usr/include/ksettings -I/usr/include/knewstuff2
-I/usr/include/dnssd -o
CMakeFiles/python_module_PyKDE4_knewstuff.dir/sip/knewstuff/sipknewstuffpart0.cpp.o
-c /var/tmp/portage/kde-base/pykde4-4.11.1/work/pykde4-4.11.1-python2_7/sip/knewstuff/sipknewstuffpart0.cpp
sip: Deprecation warning:
/var/tmp/portage/kde-base/pykde4-4.11.1/work/pykde4-4.11.1/sip/akonadi/itemserializerplugin.sip:33:
Annotation is invalid
cd /var/tmp/portage/kde-base/pykde4-4.11.1/work/pykde4-4.11.1-python2_7
&& /usr/bin/cmake -E cmake_depends "Unix Makefiles"
/var/tmp/portage/kde-base/pykde4-4.11.1/work/pykde4-4.11.1
/var/tmp/portage/kde-base/pykde4-4.11.1/work/pykde4-4.11.1
/var/tmp/portage/kde-base/pykde4-4.11.1/work/pykde4-4.11.1-python2_7
/var/tmp/portage/kde-base/pykde4-4.11.1/work/pykde4-4.11.1-python2_7
/var/tmp/portage/kde-base/pykde4-4.11.1/work/pykde4-4.11.1-python2_7/CMakeFiles/python_module_PyKDE4_dnssd.dir/DependInfo.cmake
--color=
Dependee "/var/tmp/portage/kde-base/pykde4-4.11.1/work/pykde4-4.11.1-python2_7/CMakeFiles/python_module_PyKDE4_dnssd.dir/DependInfo.cmake"
is newer than depender
"/var/tmp/portage/kde-base/pykde4-4.11.1/work/pykde4-4.11.1-python2_7/CMakeFiles/python_module_PyKDE4_dnssd.dir/depend.internal".
Dependee "/var/tmp/portage/kde-base/pykde4-4.11.1/work/pykde4-4.11.1-python2_7/CMakeFiles/CMakeDirectoryInformation.cmake"
is newer than depender
"/var/tmp/portage/kde-base/pykde4-4.11.1/work/pykde4-4.11.1-python2_7/CMakeFiles/python_module_PyKDE4_dnssd.dir/depend.internal".
/usr/bin/cmake -E cmake_progress_report
/var/tmp/portage/kde-base/pykde4-4.11.1/work/pykde4-4.11.1-python2_7/CMakeFiles
40
[ 7%] Building CXX object
CMakeFiles/python_module_PyKDE4_knewstuff.dir/sip/knewstuff/sipknewstuffpart1.cpp.o
/usr/bin/x86_64-pc-linux-gnu-g++ -DQT_CORE_LIB -DQT_GUI_LIB
-DUSING_SOPRANO_NRLMODEL_UNSTABLE_API -D_BSD_SOURCE -D_REENTRANT
-Dpython_module_PyKDE4_knewstuff_EXPORTS -DQT_NO_DEBUG -DNDEBUG -O2
-pipe -march=native -Wnon-virtual-dtor -Wno-long-long -Wundef
-Wcast-align -Wchar-subscripts -Wall -W -Wpointer-arith
-Wformat-security -fno-exceptions -DQT_NO_EXCEPTIONS -fno-check-new
-fno-common -Woverloaded-virtual -fno-threadsafe-statics
-fvisibility=hidden -fvisibility-inlines-hidden -fPIC
-I/var/tmp/portage/kde-base/pykde4-4.11.1/work/pykde4-4.11.1-python2_7
-I/var/tmp/portage/kde-base/pykde4-4.11.1/work/pykde4-4.11.1
-I/usr/include/KDE -I/usr/include/qt4/QtXmlPatterns
-I/usr/include/qt4/QtXml -I/usr/include/qt4/QtWebKit
-I/usr/include/qt4/QtUiTools -I/usr/include/qt4/QtTest
-I/usr/include/qt4/QtSvg -I/usr/include/qt4/QtSql
-I/usr/include/qt4/QtScriptTools -I/usr/include/qt4/QtScript
-I/usr/include/qt4/QtOpenGL -I/usr/include/qt4/QtNetwork
-I/usr/include/qt4/QtMultimedia -I/usr/include/qt4/QtDesigner
-I/usr/include/qt4/QtDeclarative -I/usr/include/qt4/QtDBus
-I/usr/include/qt4/Qt3Support -I/usr/include/qt4/QtGui
-I/usr/include/qt4/QtCore -I/usr/include/qt4/Qt
-I/usr/share/qt4/mkspecs/default -I/usr/include/qt4
-I/usr/include/python2.7 -I/usr/include/solid -I/usr/include/kio
-I/usr/include/dom -I/usr/include/ksettings -I/usr/include/knewstuff2
-I/usr/include/dnssd -o
CMakeFiles/python_module_PyKDE4_knewstuff.dir/sip/knewstuff/sipknewstuffpart1.cpp.o
-c /var/tmp/portage/kde-base/pykde4-4.11.1/work/pykde4-4.11.1-python2_7/sip/knewstuff/sipknewstuffpart1.cpp
Scanning dependencies of target python_module_PyKDE4_dnssd
make[2]: Leaving directory
`/var/tmp/portage/kde-base/pykde4-4.11.1/work/pykde4-4.11.1-python2_7'
make -f CMakeFiles/python_module_PyKDE4_dnssd.dir/build.make
CMakeFiles/python_module_PyKDE4_dnssd.dir/build
make[2]: Entering directory
`/var/tmp/portage/kde-base/pykde4-4.11.1/work/pykde4-4.11.1-python2_7'
/usr/bin/cmake -E cmake_progress_report
/var/tmp/portage/kde-base/pykde4-4.11.1/work/pykde4-4.11.1-python2_7/CMakeFiles
[ 7%] Building CXX object
CMakeFiles/python_module_PyKDE4_dnssd.dir/sip/dnssd/sipdnssdpart0.cpp.o
/usr/bin/x86_64-pc-linux-gnu-g++ -DQT_CORE_LIB -DQT_GUI_LIB
-DUSING_SOPRANO_NRLMODEL_UNSTABLE_API -D_BSD_SOURCE -D_REENTRANT
-Dpython_module_PyKDE4_dnssd_EXPORTS -DQT_NO_DEBUG -DNDEBUG -O2 -pipe
-march=native -Wnon-virtual-dtor -Wno-long-long -Wundef -Wcast-align
-Wchar-subscripts -Wall -W -Wpointer-arith -Wformat-security
-fno-exceptions -DQT_NO_EXCEPTIONS -fno-check-new -fno-common
-Woverloaded-virtual -fno-threadsafe-statics -fvisibility=hidden
-fvisibility-inlines-hidden -fPIC
-I/var/tmp/portage/kde-base/pykde4-4.11.1/work/pykde4-4.11.1-python2_7
-I/var/tmp/portage/kde-base/pykde4-4.11.1/work/pykde4-4.11.1
-I/usr/include/KDE -I/usr/include/qt4/QtXmlPatterns
-I/usr/include/qt4/QtXml -I/usr/include/qt4/QtWebKit
-I/usr/include/qt4/QtUiTools -I/usr/include/qt4/QtTest
-I/usr/include/qt4/QtSvg -I/usr/include/qt4/QtSql
-I/usr/include/qt4/QtScriptTools -I/usr/include/qt4/QtScript
-I/usr/include/qt4/QtOpenGL -I/usr/include/qt4/QtNetwork
-I/usr/include/qt4/QtMultimedia -I/usr/include/qt4/QtDesigner
-I/usr/include/qt4/QtDeclarative -I/usr/include/qt4/QtDBus
-I/usr/include/qt4/Qt3Support -I/usr/include/qt4/QtGui
-I/usr/include/qt4/QtCore -I/usr/include/qt4/Qt
-I/usr/share/qt4/mkspecs/default -I/usr/include/qt4
-I/usr/include/python2.7 -I/usr/include/solid -I/usr/include/kio
-I/usr/include/dom -I/usr/include/ksettings -I/usr/include/knewstuff2
-I/usr/include/dnssd -o
CMakeFiles/python_module_PyKDE4_dnssd.dir/sip/dnssd/sipdnssdpart0.cpp.o
-c /var/tmp/portage/kde-base/pykde4-4.11.1/work/pykde4-4.11.1-python2_7/sip/dnssd/sipdnssdpart0.cpp
/usr/bin/cmake -E cmake_progress_report
/var/tmp/portage/kde-base/pykde4-4.11.1/work/pykde4-4.11.1-python2_7/CMakeFiles
9
[ 8%] Building CXX object
CMakeFiles/python_module_PyKDE4_dnssd.dir/sip/dnssd/sipdnssdpart1.cpp.o
/usr/bin/x86_64-pc-linux-gnu-g++ -DQT_CORE_LIB -DQT_GUI_LIB
-DUSING_SOPRANO_NRLMODEL_UNSTABLE_API -D_BSD_SOURCE -D_REENTRANT
-Dpython_module_PyKDE4_dnssd_EXPORTS -DQT_NO_DEBUG -DNDEBUG -O2 -pipe
-march=native -Wnon-virtual-dtor -Wno-long-long -Wundef -Wcast-align
-Wchar-subscripts -Wall -W -Wpointer-arith -Wformat-security
-fno-exceptions -DQT_NO_EXCEPTIONS -fno-check-new -fno-common
-Woverloaded-virtual -fno-threadsafe-statics -fvisibility=hidden
-fvisibility-inlines-hidden -fPIC
-I/var/tmp/portage/kde-base/pykde4-4.11.1/work/pykde4-4.11.1-python2_7
-I/var/tmp/portage/kde-base/pykde4-4.11.1/work/pykde4-4.11.1
-I/usr/include/KDE -I/usr/include/qt4/QtXmlPatterns
-I/usr/include/qt4/QtXml -I/usr/include/qt4/QtWebKit
-I/usr/include/qt4/QtUiTools -I/usr/include/qt4/QtTest
-I/usr/include/qt4/QtSvg -I/usr/include/qt4/QtSql
-I/usr/include/qt4/QtScriptTools -I/usr/include/qt4/QtScript
-I/usr/include/qt4/QtOpenGL -I/usr/include/qt4/QtNetwork
-I/usr/include/qt4/QtMultimedia -I/usr/include/qt4/QtDesigner
-I/usr/include/qt4/QtDeclarative -I/usr/include/qt4/QtDBus
-I/usr/include/qt4/Qt3Support -I/usr/include/qt4/QtGui
-I/usr/include/qt4/QtCore -I/usr/include/qt4/Qt
-I/usr/share/qt4/mkspecs/default -I/usr/include/qt4
-I/usr/include/python2.7 -I/usr/include/solid -I/usr/include/kio
-I/usr/include/dom -I/usr/include/ksettings -I/usr/include/knewstuff2
-I/usr/include/dnssd -o
CMakeFiles/python_module_PyKDE4_dnssd.dir/sip/dnssd/sipdnssdpart1.cpp.o
-c /var/tmp/portage/kde-base/pykde4-4.11.1/work/pykde4-4.11.1-python2_7/sip/dnssd/sipdnssdpart1.cpp
/usr/bin/cmake -E cmake_progress_report
/var/tmp/portage/kde-base/pykde4-4.11.1/work/pykde4-4.11.1-python2_7/CMakeFiles
16
[ 9%] Building CXX object
CMakeFiles/python_module_PyKDE4_kdecore.dir/sip/kdecore/sipkdecorepart2.cpp.o
/usr/bin/x86_64-pc-linux-gnu-g++ -DQT_CORE_LIB -DQT_GUI_LIB
-DUSING_SOPRANO_NRLMODEL_UNSTABLE_API -D_BSD_SOURCE -D_REENTRANT
-Dpython_module_PyKDE4_kdecore_EXPORTS -DQT_NO_DEBUG -DNDEBUG -O2
-pipe -march=native -Wnon-virtual-dtor -Wno-long-long -Wundef
-Wcast-align -Wchar-subscripts -Wall -W -Wpointer-arith
-Wformat-security -fno-exceptions -DQT_NO_EXCEPTIONS -fno-check-new
-fno-common -Woverloaded-virtual -fno-threadsafe-statics
-fvisibility=hidden -fvisibility-inlines-hidden -fPIC
-I/var/tmp/portage/kde-base/pykde4-4.11.1/work/pykde4-4.11.1-python2_7
-I/var/tmp/portage/kde-base/pykde4-4.11.1/work/pykde4-4.11.1
-I/usr/include/KDE -I/usr/include/qt4/QtXmlPatterns
-I/usr/include/qt4/QtXml -I/usr/include/qt4/QtWebKit
-I/usr/include/qt4/QtUiTools -I/usr/include/qt4/QtTest
-I/usr/include/qt4/QtSvg -I/usr/include/qt4/QtSql
-I/usr/include/qt4/QtScriptTools -I/usr/include/qt4/QtScript
-I/usr/include/qt4/QtOpenGL -I/usr/include/qt4/QtNetwork
-I/usr/include/qt4/QtMultimedia -I/usr/include/qt4/QtDesigner
-I/usr/include/qt4/QtDeclarative -I/usr/include/qt4/QtDBus
-I/usr/include/qt4/Qt3Support -I/usr/include/qt4/QtGui
-I/usr/include/qt4/QtCore -I/usr/include/qt4/Qt
-I/usr/share/qt4/mkspecs/default -I/usr/include/qt4
-I/usr/include/python2.7 -I/usr/include/solid -I/usr/include/kio
-I/usr/include/dom -I/usr/include/ksettings -I/usr/include/knewstuff2
-I/usr/include/dnssd -o
CMakeFiles/python_module_PyKDE4_kdecore.dir/sip/kdecore/sipkdecorepart2.cpp.o
-c /var/tmp/portage/kde-base/pykde4-4.11.1/work/pykde4-4.11.1-python2_7/sip/kdecore/sipkdecorepart2.cpp
/var/tmp/portage/kde-base/pykde4-4.11.1/work/pykde4-4.11.1-python2_7/sip/dnssd/sipdnssdpart1.cpp:2995:1:
warning: narrowing conversion of
'(DNSSD::ServiceModel::AdditionalRoles)2690980318u' from 'unsigned
int' to 'int' inside { } is ill-formed in C++11 [-Wnarrowing]
/usr/bin/cmake -E cmake_progress_report
/var/tmp/portage/kde-base/pykde4-4.11.1/work/pykde4-4.11.1-python2_7/CMakeFiles
10
[ 10%] Building CXX object
CMakeFiles/python_module_PyKDE4_dnssd.dir/sip/dnssd/sipdnssdpart2.cpp.o
/usr/bin/x86_64-pc-linux-gnu-g++ -DQT_CORE_LIB -DQT_GUI_LIB
-DUSING_SOPRANO_NRLMODEL_UNSTABLE_API -D_BSD_SOURCE -D_REENTRANT
-Dpython_module_PyKDE4_dnssd_EXPORTS -DQT_NO_DEBUG -DNDEBUG -O2 -pipe
-march=native -Wnon-virtual-dtor -Wno-long-long -Wundef -Wcast-align
-Wchar-subscripts -Wall -W -Wpointer-arith -Wformat-security
-fno-exceptions -DQT_NO_EXCEPTIONS -fno-check-new -fno-common
-Woverloaded-virtual -fno-threadsafe-statics -fvisibility=hidden
-fvisibility-inlines-hidden -fPIC
-I/var/tmp/portage/kde-base/pykde4-4.11.1/work/pykde4-4.11.1-python2_7
-I/var/tmp/portage/kde-base/pykde4-4.11.1/work/pykde4-4.11.1
-I/usr/include/KDE -I/usr/include/qt4/QtXmlPatterns
-I/usr/include/qt4/QtXml -I/usr/include/qt4/QtWebKit
-I/usr/include/qt4/QtUiTools -I/usr/include/qt4/QtTest
-I/usr/include/qt4/QtSvg -I/usr/include/qt4/QtSql
-I/usr/include/qt4/QtScriptTools -I/usr/include/qt4/QtScript
-I/usr/include/qt4/QtOpenGL -I/usr/include/qt4/QtNetwork
-I/usr/include/qt4/QtMultimedia -I/usr/include/qt4/QtDesigner
-I/usr/include/qt4/QtDeclarative -I/usr/include/qt4/QtDBus
-I/usr/include/qt4/Qt3Support -I/usr/include/qt4/QtGui
-I/usr/include/qt4/QtCore -I/usr/include/qt4/Qt
-I/usr/share/qt4/mkspecs/default -I/usr/include/qt4
-I/usr/include/python2.7 -I/usr/include/solid -I/usr/include/kio
-I/usr/include/dom -I/usr/include/ksettings -I/usr/include/knewstuff2
-I/usr/include/dnssd -o
CMakeFiles/python_module_PyKDE4_dnssd.dir/sip/dnssd/sipdnssdpart2.cpp.o
-c /var/tmp/portage/kde-base/pykde4-4.11.1/work/pykde4-4.11.1-python2_7/sip/dnssd/sipdnssdpart2.cpp
sip: KMimeTypeValidator::fixup has versioned and unversioned overloads
make[2]: *** [sip/kdeui/sipkdeuipart0.cpp] Error 1
make[2]: Leaving directory
`/var/tmp/portage/kde-base/pykde4-4.11.1/work/pykde4-4.11.1-python2_7'
make[1]: *** [CMakeFiles/python_module_PyKDE4_kdeui.dir/all] Error 2
make[1]: *** Waiting for unfinished jobs....
/usr/bin/cmake -E cmake_progress_report
/var/tmp/portage/kde-base/pykde4-4.11.1/work/pykde4-4.11.1-python2_7/CMakeFiles
[ 10%] Building CXX object
CMakeFiles/python_module_PyKDE4_dnssd.dir/sip/dnssd/sipdnssdpart3.cpp.o
/usr/bin/x86_64-pc-linux-gnu-g++ -DQT_CORE_LIB -DQT_GUI_LIB
-DUSING_SOPRANO_NRLMODEL_UNSTABLE_API -D_BSD_SOURCE -D_REENTRANT
-Dpython_module_PyKDE4_dnssd_EXPORTS -DQT_NO_DEBUG -DNDEBUG -O2 -pipe
-march=native -Wnon-virtual-dtor -Wno-long-long -Wundef -Wcast-align
-Wchar-subscripts -Wall -W -Wpointer-arith -Wformat-security
-fno-exceptions -DQT_NO_EXCEPTIONS -fno-check-new -fno-common
-Woverloaded-virtual -fno-threadsafe-statics -fvisibility=hidden
-fvisibility-inlines-hidden -fPIC
-I/var/tmp/portage/kde-base/pykde4-4.11.1/work/pykde4-4.11.1-python2_7
-I/var/tmp/portage/kde-base/pykde4-4.11.1/work/pykde4-4.11.1
-I/usr/include/KDE -I/usr/include/qt4/QtXmlPatterns
-I/usr/include/qt4/QtXml -I/usr/include/qt4/QtWebKit
-I/usr/include/qt4/QtUiTools -I/usr/include/qt4/QtTest
-I/usr/include/qt4/QtSvg -I/usr/include/qt4/QtSql
-I/usr/include/qt4/QtScriptTools -I/usr/include/qt4/QtScript
-I/usr/include/qt4/QtOpenGL -I/usr/include/qt4/QtNetwork
-I/usr/include/qt4/QtMultimedia -I/usr/include/qt4/QtDesigner
-I/usr/include/qt4/QtDeclarative -I/usr/include/qt4/QtDBus
-I/usr/include/qt4/Qt3Support -I/usr/include/qt4/QtGui
-I/usr/include/qt4/QtCore -I/usr/include/qt4/Qt
-I/usr/share/qt4/mkspecs/default -I/usr/include/qt4
-I/usr/include/python2.7 -I/usr/include/solid -I/usr/include/kio
-I/usr/include/dom -I/usr/include/ksettings -I/usr/include/knewstuff2
-I/usr/include/dnssd -o
CMakeFiles/python_module_PyKDE4_dnssd.dir/sip/dnssd/sipdnssdpart3.cpp.o
-c /var/tmp/portage/kde-base/pykde4-4.11.1/work/pykde4-4.11.1-python2_7/sip/dnssd/sipdnssdpart3.cpp
/usr/bin/cmake -E cmake_progress_report
/var/tmp/portage/kde-base/pykde4-4.11.1/work/pykde4-4.11.1-python2_7/CMakeFiles
41
[ 11%] Building CXX object
CMakeFiles/python_module_PyKDE4_knewstuff.dir/sip/knewstuff/sipknewstuffpart2.cpp.o
/usr/bin/x86_64-pc-linux-gnu-g++ -DQT_CORE_LIB -DQT_GUI_LIB
-DUSING_SOPRANO_NRLMODEL_UNSTABLE_API -D_BSD_SOURCE -D_REENTRANT
-Dpython_module_PyKDE4_knewstuff_EXPORTS -DQT_NO_DEBUG -DNDEBUG -O2
-pipe -march=native -Wnon-virtual-dtor -Wno-long-long -Wundef
-Wcast-align -Wchar-subscripts -Wall -W -Wpointer-arith
-Wformat-security -fno-exceptions -DQT_NO_EXCEPTIONS -fno-check-new
-fno-common -Woverloaded-virtual -fno-threadsafe-statics
-fvisibility=hidden -fvisibility-inlines-hidden -fPIC
-I/var/tmp/portage/kde-base/pykde4-4.11.1/work/pykde4-4.11.1-python2_7
-I/var/tmp/portage/kde-base/pykde4-4.11.1/work/pykde4-4.11.1
-I/usr/include/KDE -I/usr/include/qt4/QtXmlPatterns
-I/usr/include/qt4/QtXml -I/usr/include/qt4/QtWebKit
-I/usr/include/qt4/QtUiTools -I/usr/include/qt4/QtTest
-I/usr/include/qt4/QtSvg -I/usr/include/qt4/QtSql
-I/usr/include/qt4/QtScriptTools -I/usr/include/qt4/QtScript
-I/usr/include/qt4/QtOpenGL -I/usr/include/qt4/QtNetwork
-I/usr/include/qt4/QtMultimedia -I/usr/include/qt4/QtDesigner
-I/usr/include/qt4/QtDeclarative -I/usr/include/qt4/QtDBus
-I/usr/include/qt4/Qt3Support -I/usr/include/qt4/QtGui
-I/usr/include/qt4/QtCore -I/usr/include/qt4/Qt
-I/usr/share/qt4/mkspecs/default -I/usr/include/qt4
-I/usr/include/python2.7 -I/usr/include/solid -I/usr/include/kio
-I/usr/include/dom -I/usr/include/ksettings -I/usr/include/knewstuff2
-I/usr/include/dnssd -o
CMakeFiles/python_module_PyKDE4_knewstuff.dir/sip/knewstuff/sipknewstuffpart2.cpp.o
-c /var/tmp/portage/kde-base/pykde4-4.11.1/work/pykde4-4.11.1-python2_7/sip/knewstuff/sipknewstuffpart2.cpp
/usr/bin/cmake -E cmake_progress_report
/var/tmp/portage/kde-base/pykde4-4.11.1/work/pykde4-4.11.1-python2_7/CMakeFiles
11
[ 12%] Building CXX object
CMakeFiles/python_module_PyKDE4_dnssd.dir/sip/dnssd/sipdnssdpart4.cpp.o
/usr/bin/x86_64-pc-linux-gnu-g++ -DQT_CORE_LIB -DQT_GUI_LIB
-DUSING_SOPRANO_NRLMODEL_UNSTABLE_API -D_BSD_SOURCE -D_REENTRANT
-Dpython_module_PyKDE4_dnssd_EXPORTS -DQT_NO_DEBUG -DNDEBUG -O2 -pipe
-march=native -Wnon-virtual-dtor -Wno-long-long -Wundef -Wcast-align
-Wchar-subscripts -Wall -W -Wpointer-arith -Wformat-security
-fno-exceptions -DQT_NO_EXCEPTIONS -fno-check-new -fno-common
-Woverloaded-virtual -fno-threadsafe-statics -fvisibility=hidden
-fvisibility-inlines-hidden -fPIC
-I/var/tmp/portage/kde-base/pykde4-4.11.1/work/pykde4-4.11.1-python2_7
-I/var/tmp/portage/kde-base/pykde4-4.11.1/work/pykde4-4.11.1
-I/usr/include/KDE -I/usr/include/qt4/QtXmlPatterns
-I/usr/include/qt4/QtXml -I/usr/include/qt4/QtWebKit
-I/usr/include/qt4/QtUiTools -I/usr/include/qt4/QtTest
-I/usr/include/qt4/QtSvg -I/usr/include/qt4/QtSql
-I/usr/include/qt4/QtScriptTools -I/usr/include/qt4/QtScript
-I/usr/include/qt4/QtOpenGL -I/usr/include/qt4/QtNetwork
-I/usr/include/qt4/QtMultimedia -I/usr/include/qt4/QtDesigner
-I/usr/include/qt4/QtDeclarative -I/usr/include/qt4/QtDBus
-I/usr/include/qt4/Qt3Support -I/usr/include/qt4/QtGui
-I/usr/include/qt4/QtCore -I/usr/include/qt4/Qt
-I/usr/share/qt4/mkspecs/default -I/usr/include/qt4
-I/usr/include/python2.7 -I/usr/include/solid -I/usr/include/kio
-I/usr/include/dom -I/usr/include/ksettings -I/usr/include/knewstuff2
-I/usr/include/dnssd -o
CMakeFiles/python_module_PyKDE4_dnssd.dir/sip/dnssd/sipdnssdpart4.cpp.o
-c /var/tmp/portage/kde-base/pykde4-4.11.1/work/pykde4-4.11.1-python2_7/sip/dnssd/sipdnssdpart4.cpp
/usr/bin/cmake -E cmake_progress_report
/var/tmp/portage/kde-base/pykde4-4.11.1/work/pykde4-4.11.1-python2_7/CMakeFiles
12
[ 13%] Building CXX object
CMakeFiles/python_module_PyKDE4_dnssd.dir/sip/dnssd/sipdnssdpart5.cpp.o
/usr/bin/x86_64-pc-linux-gnu-g++ -DQT_CORE_LIB -DQT_GUI_LIB
-DUSING_SOPRANO_NRLMODEL_UNSTABLE_API -D_BSD_SOURCE -D_REENTRANT
-Dpython_module_PyKDE4_dnssd_EXPORTS -DQT_NO_DEBUG -DNDEBUG -O2 -pipe
-march=native -Wnon-virtual-dtor -Wno-long-long -Wundef -Wcast-align
-Wchar-subscripts -Wall -W -Wpointer-arith -Wformat-security
-fno-exceptions -DQT_NO_EXCEPTIONS -fno-check-new -fno-common
-Woverloaded-virtual -fno-threadsafe-statics -fvisibility=hidden
-fvisibility-inlines-hidden -fPIC
-I/var/tmp/portage/kde-base/pykde4-4.11.1/work/pykde4-4.11.1-python2_7
-I/var/tmp/portage/kde-base/pykde4-4.11.1/work/pykde4-4.11.1
-I/usr/include/KDE -I/usr/include/qt4/QtXmlPatterns
-I/usr/include/qt4/QtXml -I/usr/include/qt4/QtWebKit
-I/usr/include/qt4/QtUiTools -I/usr/include/qt4/QtTest
-I/usr/include/qt4/QtSvg -I/usr/include/qt4/QtSql
-I/usr/include/qt4/QtScriptTools -I/usr/include/qt4/QtScript
-I/usr/include/qt4/QtOpenGL -I/usr/include/qt4/QtNetwork
-I/usr/include/qt4/QtMultimedia -I/usr/include/qt4/QtDesigner
-I/usr/include/qt4/QtDeclarative -I/usr/include/qt4/QtDBus
-I/usr/include/qt4/Qt3Support -I/usr/include/qt4/QtGui
-I/usr/include/qt4/QtCore -I/usr/include/qt4/Qt
-I/usr/share/qt4/mkspecs/default -I/usr/include/qt4
-I/usr/include/python2.7 -I/usr/include/solid -I/usr/include/kio
-I/usr/include/dom -I/usr/include/ksettings -I/usr/include/knewstuff2
-I/usr/include/dnssd -o
CMakeFiles/python_module_PyKDE4_dnssd.dir/sip/dnssd/sipdnssdpart5.cpp.o
-c /var/tmp/portage/kde-base/pykde4-4.11.1/work/pykde4-4.11.1-python2_7/sip/dnssd/sipdnssdpart5.cpp
/usr/bin/cmake -E cmake_progress_report
/var/tmp/portage/kde-base/pykde4-4.11.1/work/pykde4-4.11.1-python2_7/CMakeFiles
13
[ 14%] Building CXX object
CMakeFiles/python_module_PyKDE4_dnssd.dir/sip/dnssd/sipdnssdpart6.cpp.o
/usr/bin/x86_64-pc-linux-gnu-g++ -DQT_CORE_LIB -DQT_GUI_LIB
-DUSING_SOPRANO_NRLMODEL_UNSTABLE_API -D_BSD_SOURCE -D_REENTRANT
-Dpython_module_PyKDE4_dnssd_EXPORTS -DQT_NO_DEBUG -DNDEBUG -O2 -pipe
-march=native -Wnon-virtual-dtor -Wno-long-long -Wundef -Wcast-align
-Wchar-subscripts -Wall -W -Wpointer-arith -Wformat-security
-fno-exceptions -DQT_NO_EXCEPTIONS -fno-check-new -fno-common
-Woverloaded-virtual -fno-threadsafe-statics -fvisibility=hidden
-fvisibility-inlines-hidden -fPIC
-I/var/tmp/portage/kde-base/pykde4-4.11.1/work/pykde4-4.11.1-python2_7
-I/var/tmp/portage/kde-base/pykde4-4.11.1/work/pykde4-4.11.1
-I/usr/include/KDE -I/usr/include/qt4/QtXmlPatterns
-I/usr/include/qt4/QtXml -I/usr/include/qt4/QtWebKit
-I/usr/include/qt4/QtUiTools -I/usr/include/qt4/QtTest
-I/usr/include/qt4/QtSvg -I/usr/include/qt4/QtSql
-I/usr/include/qt4/QtScriptTools -I/usr/include/qt4/QtScript
-I/usr/include/qt4/QtOpenGL -I/usr/include/qt4/QtNetwork
-I/usr/include/qt4/QtMultimedia -I/usr/include/qt4/QtDesigner
-I/usr/include/qt4/QtDeclarative -I/usr/include/qt4/QtDBus
-I/usr/include/qt4/Qt3Support -I/usr/include/qt4/QtGui
-I/usr/include/qt4/QtCore -I/usr/include/qt4/Qt
-I/usr/share/qt4/mkspecs/default -I/usr/include/qt4
-I/usr/include/python2.7 -I/usr/include/solid -I/usr/include/kio
-I/usr/include/dom -I/usr/include/ksettings -I/usr/include/knewstuff2
-I/usr/include/dnssd -o
CMakeFiles/python_module_PyKDE4_dnssd.dir/sip/dnssd/sipdnssdpart6.cpp.o
-c /var/tmp/portage/kde-base/pykde4-4.11.1/work/pykde4-4.11.1-python2_7/sip/dnssd/sipdnssdpart6.cpp
/usr/bin/cmake -E cmake_progress_report
/var/tmp/portage/kde-base/pykde4-4.11.1/work/pykde4-4.11.1-python2_7/CMakeFiles
[ 14%] Building CXX object
CMakeFiles/python_module_PyKDE4_dnssd.dir/sip/dnssd/sipdnssdpart7.cpp.o
/usr/bin/x86_64-pc-linux-gnu-g++ -DQT_CORE_LIB -DQT_GUI_LIB
-DUSING_SOPRANO_NRLMODEL_UNSTABLE_API -D_BSD_SOURCE -D_REENTRANT
-Dpython_module_PyKDE4_dnssd_EXPORTS -DQT_NO_DEBUG -DNDEBUG -O2 -pipe
-march=native -Wnon-virtual-dtor -Wno-long-long -Wundef -Wcast-align
-Wchar-subscripts -Wall -W -Wpointer-arith -Wformat-security
-fno-exceptions -DQT_NO_EXCEPTIONS -fno-check-new -fno-common
-Woverloaded-virtual -fno-threadsafe-statics -fvisibility=hidden
-fvisibility-inlines-hidden -fPIC
-I/var/tmp/portage/kde-base/pykde4-4.11.1/work/pykde4-4.11.1-python2_7
-I/var/tmp/portage/kde-base/pykde4-4.11.1/work/pykde4-4.11.1
-I/usr/include/KDE -I/usr/include/qt4/QtXmlPatterns
-I/usr/include/qt4/QtXml -I/usr/include/qt4/QtWebKit
-I/usr/include/qt4/QtUiTools -I/usr/include/qt4/QtTest
-I/usr/include/qt4/QtSvg -I/usr/include/qt4/QtSql
-I/usr/include/qt4/QtScriptTools -I/usr/include/qt4/QtScript
-I/usr/include/qt4/QtOpenGL -I/usr/include/qt4/QtNetwork
-I/usr/include/qt4/QtMultimedia -I/usr/include/qt4/QtDesigner
-I/usr/include/qt4/QtDeclarative -I/usr/include/qt4/QtDBus
-I/usr/include/qt4/Qt3Support -I/usr/include/qt4/QtGui
-I/usr/include/qt4/QtCore -I/usr/include/qt4/Qt
-I/usr/share/qt4/mkspecs/default -I/usr/include/qt4
-I/usr/include/python2.7 -I/usr/include/solid -I/usr/include/kio
-I/usr/include/dom -I/usr/include/ksettings -I/usr/include/knewstuff2
-I/usr/include/dnssd -o
CMakeFiles/python_module_PyKDE4_dnssd.dir/sip/dnssd/sipdnssdpart7.cpp.o
-c /var/tmp/portage/kde-base/pykde4-4.11.1/work/pykde4-4.11.1-python2_7/sip/dnssd/sipdnssdpart7.cpp
/usr/bin/cmake -E cmake_progress_report
/var/tmp/portage/kde-base/pykde4-4.11.1/work/pykde4-4.11.1-python2_7/CMakeFiles
[ 14%] Building CXX object
CMakeFiles/python_module_PyKDE4_knewstuff.dir/sip/knewstuff/sipknewstuffpart3.cpp.o
/usr/bin/x86_64-pc-linux-gnu-g++ -DQT_CORE_LIB -DQT_GUI_LIB
-DUSING_SOPRANO_NRLMODEL_UNSTABLE_API -D_BSD_SOURCE -D_REENTRANT
-Dpython_module_PyKDE4_knewstuff_EXPORTS -DQT_NO_DEBUG -DNDEBUG -O2
-pipe -march=native -Wnon-virtual-dtor -Wno-long-long -Wundef
-Wcast-align -Wchar-subscripts -Wall -W -Wpointer-arith
-Wformat-security -fno-exceptions -DQT_NO_EXCEPTIONS -fno-check-new
-fno-common -Woverloaded-virtual -fno-threadsafe-statics
-fvisibility=hidden -fvisibility-inlines-hidden -fPIC
-I/var/tmp/portage/kde-base/pykde4-4.11.1/work/pykde4-4.11.1-python2_7
-I/var/tmp/portage/kde-base/pykde4-4.11.1/work/pykde4-4.11.1
-I/usr/include/KDE -I/usr/include/qt4/QtXmlPatterns
-I/usr/include/qt4/QtXml -I/usr/include/qt4/QtWebKit
-I/usr/include/qt4/QtUiTools -I/usr/include/qt4/QtTest
-I/usr/include/qt4/QtSvg -I/usr/include/qt4/QtSql
-I/usr/include/qt4/QtScriptTools -I/usr/include/qt4/QtScript
-I/usr/include/qt4/QtOpenGL -I/usr/include/qt4/QtNetwork
-I/usr/include/qt4/QtMultimedia -I/usr/include/qt4/QtDesigner
-I/usr/include/qt4/QtDeclarative -I/usr/include/qt4/QtDBus
-I/usr/include/qt4/Qt3Support -I/usr/include/qt4/QtGui
-I/usr/include/qt4/QtCore -I/usr/include/qt4/Qt
-I/usr/share/qt4/mkspecs/default -I/usr/include/qt4
-I/usr/include/python2.7 -I/usr/include/solid -I/usr/include/kio
-I/usr/include/dom -I/usr/include/ksettings -I/usr/include/knewstuff2
-I/usr/include/dnssd -o
CMakeFiles/python_module_PyKDE4_knewstuff.dir/sip/knewstuff/sipknewstuffpart3.cpp.o
-c /var/tmp/portage/kde-base/pykde4-4.11.1/work/pykde4-4.11.1-python2_7/sip/knewstuff/sipknewstuffpart3.cpp
Linking CXX shared library lib/dnssd.so
/usr/bin/cmake -E cmake_link_script
CMakeFiles/python_module_PyKDE4_dnssd.dir/link.txt --verbose=1
/usr/bin/x86_64-pc-linux-gnu-g++ -fPIC -O2 -pipe -march=native
-Wnon-virtual-dtor -Wno-long-long -Wundef -Wcast-align
-Wchar-subscripts -Wall -W -Wpointer-arith -Wformat-security
-fno-exceptions -DQT_NO_EXCEPTIONS -fno-check-new -fno-common
-Woverloaded-virtual -fno-threadsafe-statics -fvisibility=hidden
-fvisibility-inlines-hidden -Wl,--enable-new-dtags -Wl,--no-undefined
-lc -Wl,-O1 -Wl,--as-needed -shared -Wl,-soname,dnssd.so -o
lib/dnssd.so CMakeFiles/python_module_PyKDE4_dnssd.dir/sip/dnssd/sipdnssdpart0.cpp.o
CMakeFiles/python_module_PyKDE4_dnssd.dir/sip/dnssd/sipdnssdpart1.cpp.o
CMakeFiles/python_module_PyKDE4_dnssd.dir/sip/dnssd/sipdnssdpart2.cpp.o
CMakeFiles/python_module_PyKDE4_dnssd.dir/sip/dnssd/sipdnssdpart3.cpp.o
CMakeFiles/python_module_PyKDE4_dnssd.dir/sip/dnssd/sipdnssdpart4.cpp.o
CMakeFiles/python_module_PyKDE4_dnssd.dir/sip/dnssd/sipdnssdpart5.cpp.o
CMakeFiles/python_module_PyKDE4_dnssd.dir/sip/dnssd/sipdnssdpart6.cpp.o
CMakeFiles/python_module_PyKDE4_dnssd.dir/sip/dnssd/sipdnssdpart7.cpp.o
-lpython2.7 /usr/lib64/libkdnssd.so.4.11.1 /usr/lib64/qt4/libQtCore.so
-lpthread /usr/lib64/libkdecore.so.5.11.1 /usr/lib64/qt4/libQtCore.so
-lpthread /usr/lib64/qt4/libQtDBus.so -Wl,-rpath,/usr/lib64/qt4:
make[2]: Leaving directory
`/var/tmp/portage/kde-base/pykde4-4.11.1/work/pykde4-4.11.1-python2_7'
/usr/bin/cmake -E cmake_progress_report
/var/tmp/portage/kde-base/pykde4-4.11.1/work/pykde4-4.11.1-python2_7/CMakeFiles
8 9 10 11 12 13
[ 14%] Built target python_module_PyKDE4_dnssd
/usr/bin/cmake -E cmake_progress_report
/var/tmp/portage/kde-base/pykde4-4.11.1/work/pykde4-4.11.1-python2_7/CMakeFiles
42
[ 15%] Building CXX object
CMakeFiles/python_module_PyKDE4_knewstuff.dir/sip/knewstuff/sipknewstuffpart4.cpp.o
/usr/bin/x86_64-pc-linux-gnu-g++ -DQT_CORE_LIB -DQT_GUI_LIB
-DUSING_SOPRANO_NRLMODEL_UNSTABLE_API -D_BSD_SOURCE -D_REENTRANT
-Dpython_module_PyKDE4_knewstuff_EXPORTS -DQT_NO_DEBUG -DNDEBUG -O2
-pipe -march=native -Wnon-virtual-dtor -Wno-long-long -Wundef
-Wcast-align -Wchar-subscripts -Wall -W -Wpointer-arith
-Wformat-security -fno-exceptions -DQT_NO_EXCEPTIONS -fno-check-new
-fno-common -Woverloaded-virtual -fno-threadsafe-statics
-fvisibility=hidden -fvisibility-inlines-hidden -fPIC
-I/var/tmp/portage/kde-base/pykde4-4.11.1/work/pykde4-4.11.1-python2_7
-I/var/tmp/portage/kde-base/pykde4-4.11.1/work/pykde4-4.11.1
-I/usr/include/KDE -I/usr/include/qt4/QtXmlPatterns
-I/usr/include/qt4/QtXml -I/usr/include/qt4/QtWebKit
-I/usr/include/qt4/QtUiTools -I/usr/include/qt4/QtTest
-I/usr/include/qt4/QtSvg -I/usr/include/qt4/QtSql
-I/usr/include/qt4/QtScriptTools -I/usr/include/qt4/QtScript
-I/usr/include/qt4/QtOpenGL -I/usr/include/qt4/QtNetwork
-I/usr/include/qt4/QtMultimedia -I/usr/include/
Back to top
View user's profile Send private message
eyoung100
Veteran
Veteran


Joined: 23 Jan 2004
Posts: 1406

PostPosted: Mon Sep 30, 2013 4:58 pm    Post subject: Reply with quote

Please repost w/ actual error...
_________________
The Birth and Growth of Science is the Death and Atrophy of Art -- Unknown
Registerd Linux User #363735
Adopt a Post | Strip Comments| Emerge Wrapper
Back to top
View user's profile Send private message
hermanng
Apprentice
Apprentice


Joined: 28 Jan 2004
Posts: 175
Location: Nussberg,Germany,Earth

PostPosted: Tue Oct 01, 2013 7:37 am    Post subject: Reply with quote

Same or similar problem here. Actual error here is
Code:
/usr/bin/x86_64-pc-linux-gnu-g++  -DQT_CORE_LIB -DQT_GUI_LIB -DUSING_SOPRANO_NRLMODEL_UNSTABLE_API -D_BSD_SOURCE -D_REENTRANT -Dpython_module_PyKDE4_akonadi_EXPORTS  -DQT_NO_DEBUG -DNDEBUG -O2 -pipe  -Wnon-virtual-dtor -Wno-long-long -Wundef -Wcast-align -Wchar-subscripts -Wall -W -Wpointer-arith -Wformat-security -fno-exceptions -DQT_NO_EXCEPTIONS -fno-check-new -fno-common -Woverloaded-virtual -fno-threadsafe-statics -fvisibility=hidden -fvisibility-inlines-hidden -fPIC -I/var/tmp/portage/kde-base/pykde4-4.11.1/work/pykde4-4.11.1-python3_2 -I/var/tmp/portage/kde-base/pykde4-4.11.1/work/pykde4-4.11.1 -I/usr/include/KDE -I/usr/include/qt4/QtXmlPatterns -I/usr/include/qt4/QtXml -I/usr/include/qt4/QtWebKit -I/usr/include/qt4/QtUiTools -I/usr/include/qt4/QtTest -I/usr/include/qt4/QtSvg -I/usr/include/qt4/QtSql -I/usr/include/qt4/QtScriptTools -I/usr/include/qt4/QtScript -I/usr/include/qt4/QtOpenGL -I/usr/include/qt4/QtNetwork -I/usr/include/qt4/QtHelp -I/usr/include/qt4/QtDesigner -I/usr/include/qt4/QtDeclarative -I/usr/include/qt4/QtDBus -I/usr/include/qt4/Qt3Support -I/usr/include/qt4/QtGui -I/usr/include/qt4/QtCore -I/usr/include/qt4/Qt -I/usr/share/qt4/mkspecs/default -I/usr/include/qt4 -I/usr/include/python3.2 -I/usr/include/solid -I/usr/include/kio -I/usr/include/dom -I/usr/include/ksettings -I/usr/include/knewstuff2 -I/usr/include/dnssd    -o CMakeFiles/python_module_PyKDE4_akonadi.dir/sip/akonadi/sipakonadipart0.cpp.o -c /var/tmp/portage/kde-base/pykde4-4.11.1/work/pykde4-4.11.1-python3_2/sip/akonad/sipakonadipart0.cpp
In file included from /usr/include/akonadi/entityrightsfiltermodel.h:25:0,
                 from /var/tmp/portage/kde-base/pykde4-4.11.1/work/pykde4-4.11.1/sip/akonadi/agentfilterproxymodel.sip:58,
                 from /var/tmp/portage/kde-base/pykde4-4.11.1/work/pykde4-4.11.1-python3_2/sip/akonadi/sipakonadipart0.cpp:7:
/usr/include/krecursivefilterproxymodel.h: In member function 'virtual bool sipAkonadi_TrashFilterProxyModel::filterAcceptsRow(int, const QModelIndex&) const':
/usr/include/krecursivefilterproxymodel.h:118:8: error: 'virtual bool KRecursiveFilterProxyModel::filterAcceptsRow(int, const QModelIndex&) const' is private
/var/tmp/portage/kde-base/pykde4-4.11.1/work/pykde4-4.11.1-python3_2/sip/akonadi/sipakonadipart0.cpp:8703:70: error: within this context

This problem (pykde4 build fails with sip 4.15) is known and already fixed by upstream, see https://bugs.kde.org/show_bug.cgi?id=323899, we just have to wait for a new pykde4 version.
_________________
Hermann
Back to top
View user's profile Send private message
jasn
Guru
Guru


Joined: 05 May 2005
Posts: 412
Location: Maryland, US

PostPosted: Tue Oct 01, 2013 6:05 pm    Post subject: Reply with quote

I was getting a segmentation error when trying to log in to my KDE desktop from KDM, which required me to re-emerge kde-base/pykde4-4.11.1 in order to fix the error, and allow me to access my desktop. The only way I was able to do it now was by downgrading to dev-python/sip-4.14.7 and dev-python/PyQt4-4.10.2, as outlined in the Gentoo bug report, and this thread.

Good Luck..
Back to top
View user's profile Send private message
Display posts from previous:   
Reply to topic    Gentoo Forums Forum Index Desktop Environments All times are GMT
Page 1 of 1

 
Jump to:  
You cannot post new topics in this forum
You cannot reply to topics in this forum
You cannot edit your posts in this forum
You cannot delete your posts in this forum
You cannot vote in polls in this forum