Gentoo Forums
Gentoo Forums
Gentoo Forums
Quick Search: in
missing vala/gir stuff or not configured? [solved]
View unanswered posts
View posts from last 24 hours

 
Reply to topic    Gentoo Forums Forum Index Portage & Programming
View previous topic :: View next topic  
Author Message
nordic bro
Guru
Guru


Joined: 25 Oct 2003
Posts: 560

PostPosted: Thu Sep 12, 2013 8:15 pm    Post subject: missing vala/gir stuff or not configured? [solved] Reply with quote

I originally had ~nothing of gnome and wanted to install 3.8. a number of pkgs that have or use this vala stuff always spit these out:

Code:
error: Package `GObject-2.0' not found in specified Vala API directories or GObject-Introspection GIR directories
error: Package `Gio-2.0' not found in specified Vala API directories or GObject-Introspection GIR directories

I'd get them for "GLib-2.0" in some pkgs, other things in others, etc. it seems whatever vala needs to be configured for is missing/incomplete?

I've spent a week of googling, reading posts and whatnot, trying all kinds of fixes/workarounds (removing vala-xx or multiple vala, adding /usr/lib/gir* and /usr/share/vala to xdg_data_dirs, linking around in /usr/share/vala*/vapi, linking "glib-2.0" to "GLib-2.0", running a specific pkg's makefile "/usr/bin/vala* ..." myself to work out how to resolve it, etc.).

since I haven't gotten anywhere I thought I'd post output from net-libs/gssdp failure to see if someone knows what needs to be done.

emerge --info '=net-libs/gssdp-0.12.2.1'

Code:
Portage 2.1.11.62 (default/linux/amd64/13.0, gcc-4.7.2, glibc-2.15-r3, 3.5.4_k2 x86_64)
=================================================================
                         System Settings
=================================================================
System uname: Linux-3.5.4_k2-x86_64-Intel-R-_Core-TM-2_CPU_6600_@_2.40GHz-with-gentoo-2.2
KiB Mem:     4049728 total,    389476 free
KiB Swap:    2152672 total,   2152672 free
Timestamp of tree: Mon, 13 May 2013 00:45:01 +0000
ld GNU ld (GNU Binutils) 2.22
app-shells/bash:          4.2_p45
dev-lang/python:          2.7.3-r3, 3.2.3-r2
dev-util/cmake:           2.8.10.2-r2
dev-util/pkgconfig:       0.28
sys-apps/baselayout:      2.2
sys-apps/openrc:          0.11.8
sys-apps/sandbox:         2.5
sys-devel/autoconf:       2.13, 2.69
sys-devel/automake:       1.10.3, 1.11.6, 1.12.6
sys-devel/binutils:       2.22-r1
sys-devel/gcc:            4.6.3, 4.7.2-r1
sys-devel/gcc-config:     1.7.3
sys-devel/libtool:        2.4-r1
sys-devel/make:           3.82-r4
sys-kernel/linux-headers: 3.7 (virtual/os-headers)
sys-libs/glibc:           2.15-r3
Repositories: gentoo x-ebuilds_overlay
ACCEPT_KEYWORDS="amd64"
ACCEPT_LICENSE="*"
CBUILD="x86_64-pc-linux-gnu"
CFLAGS="-march=core2 -O2 -pipe"
CHOST="x86_64-pc-linux-gnu"
CONFIG_PROTECT="/etc /usr/share/gnupg/qualified.txt"
CONFIG_PROTECT_MASK="/etc/ca-certificates.conf /etc/env.d /etc/fonts/fonts.conf /etc/gconf /etc/gentoo-release /etc/revdep-rebuild /etc/sandbox.d /etc/terminfo"
CXXFLAGS="-march=core2 -O2 -pipe"
DISTDIR="/usr/portage/distfiles"
FCFLAGS="-O2 -pipe"
FEATURES="assume-digests binpkg-logs config-protect-if-modified distlocks ebuild-locks fixlafiles merge-sync news parallel-fetch protect-owned sandbox sfperms strict unknown-features-warn unmerge-logs unmerge-orphans userfetch"
FFLAGS="-O2 -pipe"
GENTOO_MIRRORS="ftp://mirror.mcs.anl.gov/pub/gentoo/            ftp://ftp.gtlib.gatech.edu/pub/gentoo ftp://mirrors.rit.edu/gentoo/            ftp://mirror.iawnet.sandia.gov/pub/gentoo/"
LANG="en_US.UTF-8"
LDFLAGS="-Wl,-O1 -Wl,--as-needed"
MAKEOPTS="-j3"
PKGDIR="/usr/portage/packages"
PORTAGE_CONFIGROOT="/"
PORTAGE_RSYNC_EXTRA_OPTS="--exclude-from=/etc/portage/rsync_excludes"
PORTAGE_RSYNC_OPTS="--recursive --links --safe-links --perms --times --compress --force --whole-file --delete --stats --human-readable --timeout=180 --exclude=/distfiles --exclude=/local --exclude=/packages"
PORTAGE_TMPDIR="/var/tmp"
PORTDIR="/usr/portage"
PORTDIR_OVERLAY="/usr/portage/ebuilds_overlay"
SYNC="rsync://rsync.gentoo.org/gentoo-portage"
USE="X Xaw3d acpi aim alsa amd64 berkdb bzip2 cairo cdda cddb cdr cli consolekit cracklib crypt css cups cxx dbus dri dvd dvdr fbcon fontconfig fortran gconf gdbm gif gimp gnome gnutls gpm gstreamer gtk gtk3 iconv icq imap imlib jpeg lame lm_sensors maildir mbox mime mmx modules mozilla mp3 msn mudflap multilib ncurses nptl ofx ogg opengl openmp pam pcre pdf perl png postgres ppds readline sasl scanner sdl session smp spell sse sse2 ssl startup-notification svg tcpd threads tiff truetype udev unicode v4l vcd vdpau vorbis xcomposite xft xpm xscreensaver xv yahoo zlib" ABI_X86="64" ALSA_CARDS="hda-intel" ALSA_PCM_PLUGINS="adpcm alaw asym copy dmix dshare dsnoop empty extplug file hooks iec958 ioplug ladspa lfloat linear meter mmap_emul mulaw multi null plug rate route share shm softvol" APACHE2_MODULES="authn_core authz_core socache_shmcb unixd actions alias auth_basic authn_alias authn_anon authn_dbm authn_default authn_file authz_dbm authz_default authz_groupfile authz_host authz_owner authz_user autoindex cache cgi cgid dav dav_fs dav_lock deflate dir disk_cache env expires ext_filter file_cache filter headers include info log_config logio mem_cache mime mime_magic negotiation rewrite setenvif speling status unique_id userdir usertrack vhost_alias" CALLIGRA_FEATURES="kexi words flow plan sheets stage tables krita karbon braindump author" CAMERAS="ptp2" COLLECTD_PLUGINS="df interface irq load memory rrdtool swap syslog" ELIBC="glibc" GPSD_PROTOCOLS="ashtech aivdm earthmate evermore fv18 garmin garmintxt gpsclock itrax mtk3301 nmea ntrip navcom oceanserver oldstyle oncore rtcm104v2 rtcm104v3 sirf superstar2 timing tsip tripmate tnt ubx" INPUT_DEVICES="keyboard mouse" KERNEL="linux" LCD_DEVICES="bayrad cfontz cfontz633 glk hd44780 lb216 lcdm001 mtxorb ncurses text" LIBREOFFICE_EXTENSIONS="presenter-console presenter-minimizer" OFFICE_IMPLEMENTATION="libreoffice" PHP_TARGETS="php5-3" PYTHON_SINGLE_TARGET="python2_7" PYTHON_TARGETS="python2_7 python3_2" QEMU_SOFTMMU_TARGETS="i386 x86_64" QEMU_USER_TARGETS="i386 x86_64" RUBY_TARGETS="ruby18 ruby19" USERLAND="GNU" VIDEO_CARDS="nvidia" XTABLES_ADDONS="quota2 psd pknock lscan length2 ipv4options ipset ipp2p iface geoip fuzzy condition tee tarpit sysrq steal rawnat logmark ipmark dhcpmac delude chaos account"
Unset:  CPPFLAGS, CTARGET, EMERGE_DEFAULT_OPTS, INSTALL_MASK, LC_ALL, PORTAGE_BUNZIP2_COMMAND, PORTAGE_COMPRESS, PORTAGE_COMPRESS_FLAGS, USE_PYTHON


emerge -pqv '=net-libs/gssdp-0.12.2.1'

Code:
* Last emerge --sync was 122d 18h 34m 14s ago.
[ebuild  N    ] net-libs/gssdp-0.12.2.1  USE="gtk introspection"

 * IMPORTANT: 2 news items need reading for repository 'gentoo'.
 * Use eselect news to read news items.


the build log

Code:
 * Package:    net-libs/gssdp-0.12.2.1
 * Repository: gentoo
 * Maintainer: net-p2p@gentoo.org gnome@gentoo.org
 * USE:        abi_x86_64 amd64 elibc_glibc gtk introspection kernel_linux multilib userland_GNU
 * FEATURES:   sandbox
>>> Unpacking source...
>>> Unpacking gssdp-0.12.2.1.tar.xz to /var/tmp/portage/net-libs/gssdp-0.12.2.1/work
>>> Source unpacked in /var/tmp/portage/net-libs/gssdp-0.12.2.1/work
>>> Preparing source in /var/tmp/portage/net-libs/gssdp-0.12.2.1/work/gssdp-0.12.2.1 ...
>>> Source prepared.
>>> Configuring source in /var/tmp/portage/net-libs/gssdp-0.12.2.1/work/gssdp-0.12.2.1 ...
 * econf: updating gssdp-0.12.2.1/build-aux/config.guess with /usr/share/gnuconfig/config.guess
 * econf: updating gssdp-0.12.2.1/build-aux/config.sub with /usr/share/gnuconfig/config.sub
./configure --prefix=/usr --build=x86_64-pc-linux-gnu --host=x86_64-pc-linux-gnu --mandir=/usr/share/man --infodir=/usr/share/info --datadir=/usr/share --sysconfdir=/etc --localstatedir=/var/lib --libdir=/usr/lib64 --disable-dependency-tracking --enable-introspection --with-gtk --disable-dependency-tracking --disable-static --disable-gtk-doc VAPIGEN=/usr/bin/vapigen-0.14
checking for a BSD-compatible install... /usr/bin/install -c
checking whether build environment is sane... yes
checking for a thread-safe mkdir -p... /bin/mkdir -p
checking for gawk... gawk
checking whether make sets $(MAKE)... yes
checking how to create a ustar tar archive... gnutar
checking whether to enable maintainer-specific portions of Makefiles... yes
checking whether make supports nested variables... yes
checking for style of include used by make... GNU
checking for x86_64-pc-linux-gnu-gcc... x86_64-pc-linux-gnu-gcc
checking whether the C compiler works... yes
checking for C compiler default output file name... a.out
checking for suffix of executables...
checking whether we are cross compiling... no
checking for suffix of object files... o
checking whether we are using the GNU C compiler... yes
checking whether x86_64-pc-linux-gnu-gcc accepts -g... yes
checking for x86_64-pc-linux-gnu-gcc option to accept ISO C89... none needed
checking dependency style of x86_64-pc-linux-gnu-gcc... none
checking for library containing strerror... none required
checking for x86_64-pc-linux-gnu-gcc... (cached) x86_64-pc-linux-gnu-gcc
checking whether we are using the GNU C compiler... (cached) yes
checking whether x86_64-pc-linux-gnu-gcc accepts -g... (cached) yes
checking for x86_64-pc-linux-gnu-gcc option to accept ISO C89... (cached) none needed
checking dependency style of x86_64-pc-linux-gnu-gcc... (cached) none
checking how to run the C preprocessor... x86_64-pc-linux-gnu-gcc -E
checking for grep that handles long lines and -e... /bin/grep
checking for egrep... /bin/grep -E
checking for ANSI C header files... yes
checking build system type... x86_64-pc-linux-gnu
checking host system type... x86_64-pc-linux-gnu
checking how to print strings... printf
checking for a sed that does not truncate output... /bin/sed
checking for fgrep... /bin/grep -F
checking for ld used by x86_64-pc-linux-gnu-gcc... /usr/x86_64-pc-linux-gnu/bin/ld
checking if the linker (/usr/x86_64-pc-linux-gnu/bin/ld) is GNU ld... yes
checking for BSD- or MS-compatible name lister (nm)... /usr/bin/nm -B
checking the name lister (/usr/bin/nm -B) interface... BSD nm
checking whether ln -s works... yes
checking the maximum length of command line arguments... 1572864
checking whether the shell understands some XSI constructs... yes
checking whether the shell understands "+="... yes
checking how to convert x86_64-pc-linux-gnu file names to x86_64-pc-linux-gnu format... func_convert_file_noop
checking how to convert x86_64-pc-linux-gnu file names to toolchain format... func_convert_file_noop
checking for /usr/x86_64-pc-linux-gnu/bin/ld option to reload object files... -r
checking for x86_64-pc-linux-gnu-objdump... x86_64-pc-linux-gnu-objdump
checking how to recognize dependent libraries... pass_all
checking for x86_64-pc-linux-gnu-dlltool... no
checking for dlltool... no
checking how to associate runtime and link libraries... printf %s\n
checking for x86_64-pc-linux-gnu-ar... x86_64-pc-linux-gnu-ar
checking for archiver @FILE support... @
checking for x86_64-pc-linux-gnu-strip... x86_64-pc-linux-gnu-strip
checking for x86_64-pc-linux-gnu-ranlib... x86_64-pc-linux-gnu-ranlib
checking command to parse /usr/bin/nm -B output from x86_64-pc-linux-gnu-gcc object... ok
checking for sysroot... no
checking for x86_64-pc-linux-gnu-mt... no
checking for mt... no
checking if : is a manifest tool... no
checking for sys/types.h... yes
checking for sys/stat.h... yes
checking for stdlib.h... yes
checking for string.h... yes
checking for memory.h... yes
checking for strings.h... yes
checking for inttypes.h... yes
checking for stdint.h... yes
checking for unistd.h... yes
checking for dlfcn.h... yes
checking for objdir... .libs
checking if x86_64-pc-linux-gnu-gcc supports -fno-rtti -fno-exceptions... no
checking for x86_64-pc-linux-gnu-gcc option to produce PIC... -fPIC -DPIC
checking if x86_64-pc-linux-gnu-gcc PIC flag -fPIC -DPIC works... yes
checking if x86_64-pc-linux-gnu-gcc static flag -static works... yes
checking if x86_64-pc-linux-gnu-gcc supports -c -o file.o... yes
checking if x86_64-pc-linux-gnu-gcc supports -c -o file.o... (cached) yes
checking whether the x86_64-pc-linux-gnu-gcc linker (/usr/x86_64-pc-linux-gnu/bin/ld -m elf_x86_64) supports shared libraries... yes
checking whether -lc should be explicitly linked in... no
checking dynamic linker characteristics... GNU/Linux ld.so
checking how to hardcode library paths into programs... immediate
checking whether stripping libraries is possible... yes
checking if libtool supports shared libraries... yes
checking whether to build shared libraries... yes
checking whether to build static libraries... no
checking for x86_64-pc-linux-gnu-pkg-config... /usr/bin/x86_64-pc-linux-gnu-pkg-config
checking pkg-config is at least version 0.9.0... yes
checking for LIBGSSDP... yes
checking for LIBGTK... yes
checking for gobject-introspection... yes
checking for vapigen... /usr/bin/vapigen-0.14
checking /usr/bin/vapigen-0.14 is at least version 0.14... yes
checking for Win32... no
checking for gtkdoc-check... /usr/bin/gtkdoc-check
checking for gtkdoc-rebase... /usr/bin/gtkdoc-rebase
checking for gtkdoc-mkpdf... /usr/bin/gtkdoc-mkpdf
checking whether to build gtk-doc documentation... no
configure: creating ./config.status
config.status: creating Makefile
config.status: creating libgssdp/Makefile
config.status: creating tools/Makefile
config.status: creating tests/Makefile
config.status: creating tests/gtest/Makefile
config.status: creating vala/Makefile
config.status: creating doc/Makefile
config.status: creating doc/version.xml
config.status: creating gssdp-1.0.pc
config.status: creating gssdp-1.0-uninstalled.pc
config.status: creating config.h
config.status: executing depfiles commands
config.status: executing libtool commands
>>> Source configured.
>>> Compiling source in /var/tmp/portage/net-libs/gssdp-0.12.2.1/work/gssdp-0.12.2.1 ...
make -j3
make  all-recursive
make[1]: Entering directory `/var/tmp/portage/net-libs/gssdp-0.12.2.1/work/gssdp-0.12.2.1'
Making all in libgssdp
make[2]: Entering directory `/var/tmp/portage/net-libs/gssdp-0.12.2.1/work/gssdp-0.12.2.1/libgssdp'
make  all-am
make[3]: Entering directory `/var/tmp/portage/net-libs/gssdp-0.12.2.1/work/gssdp-0.12.2.1/libgssdp'
  CC     gssdp-error.lo
  CC     gssdp-client.lo
  CC     gssdp-resource-browser.lo
  CC     gssdp-resource-group.lo
  CC     gssdp-socket-source.lo
  CC     gssdp-socket-functions.lo
  CC     gssdp-marshal.lo
  CCLD   libgssdp-1.0.la
  GISCAN GSSDP-1.0.gir
  GICOMP GSSDP-1.0.gir
make[3]: Leaving directory `/var/tmp/portage/net-libs/gssdp-0.12.2.1/work/gssdp-0.12.2.1/libgssdp'
make[2]: Leaving directory `/var/tmp/portage/net-libs/gssdp-0.12.2.1/work/gssdp-0.12.2.1/libgssdp'
Making all in tools
make[2]: Entering directory `/var/tmp/portage/net-libs/gssdp-0.12.2.1/work/gssdp-0.12.2.1/tools'
  CC     gssdp-device-sniffer.o
  CCLD   gssdp-device-sniffer
make[2]: Leaving directory `/var/tmp/portage/net-libs/gssdp-0.12.2.1/work/gssdp-0.12.2.1/tools'
Making all in tests
make[2]: Entering directory `/var/tmp/portage/net-libs/gssdp-0.12.2.1/work/gssdp-0.12.2.1/tests'
Making all in gtest
make[3]: Entering directory `/var/tmp/portage/net-libs/gssdp-0.12.2.1/work/gssdp-0.12.2.1/tests/gtest'
  CC     test-util.o
  AR     libtestutil.a
make[3]: Leaving directory `/var/tmp/portage/net-libs/gssdp-0.12.2.1/work/gssdp-0.12.2.1/tests/gtest'
make[3]: Entering directory `/var/tmp/portage/net-libs/gssdp-0.12.2.1/work/gssdp-0.12.2.1/tests'
  CC     test-browser.o
  CC     test-publish.o
test-browser.c: In function 'main':
test-browser.c:59:9: warning: 'g_type_init' is deprecated (declared at /usr/include/glib-2.0/gobject/gtype.h:669) [-Wdeprecated-declarations]
test-publish.c: In function 'main':
test-publish.c:35:9: warning: 'g_type_init' is deprecated (declared at /usr/include/glib-2.0/gobject/gtype.h:669) [-Wdeprecated-declarations]
  CCLD   test-browser
  CCLD   test-publish
make[3]: Leaving directory `/var/tmp/portage/net-libs/gssdp-0.12.2.1/work/gssdp-0.12.2.1/tests'
make[2]: Leaving directory `/var/tmp/portage/net-libs/gssdp-0.12.2.1/work/gssdp-0.12.2.1/tests'
Making all in doc
make[2]: Entering directory `/var/tmp/portage/net-libs/gssdp-0.12.2.1/work/gssdp-0.12.2.1/doc'
make[2]: Nothing to be done for `all'.
make[2]: Leaving directory `/var/tmp/portage/net-libs/gssdp-0.12.2.1/work/gssdp-0.12.2.1/doc'
Making all in vala
make[2]: Entering directory `/var/tmp/portage/net-libs/gssdp-0.12.2.1/work/gssdp-0.12.2.1/vala'
  GEN    gssdp-1.0.stamp
error: Package `GObject-2.0' not found in specified Vala API directories or GObject-Introspection GIR directories
error: Package `Gio-2.0' not found in specified Vala API directories or GObject-Introspection GIR directories
GSSDP-1.0.gir:54.11-54.32: error: expected start element of `parameter'
          <instance-parameter name="client" transfer-ownership="none">
          ^^^^^^^^^^^^^^^^^^^^^^
GSSDP-1.0.gir:57.11-57.10: error: expected end element of `parameter'
          </instance-parameter>
         
GSSDP-1.0.gir:67.11-67.32: error: expected start element of `parameter'
          <instance-parameter name="client" transfer-ownership="none">
          ^^^^^^^^^^^^^^^^^^^^^^
GSSDP-1.0.gir:70.11-70.10: error: expected end element of `parameter'
          </instance-parameter>
         
GSSDP-1.0.gir:80.11-80.32: error: expected start element of `parameter'
          <instance-parameter name="client" transfer-ownership="none">
          ^^^^^^^^^^^^^^^^^^^^^^
GSSDP-1.0.gir:83.11-83.10: error: expected end element of `parameter'
          </instance-parameter>
         
GSSDP-1.0.gir:92.11-92.32: error: expected start element of `parameter'
          <instance-parameter name="client" transfer-ownership="none">
          ^^^^^^^^^^^^^^^^^^^^^^
GSSDP-1.0.gir:94.11-94.10: error: expected end element of `parameter'
          </instance-parameter>
         
GSSDP-1.0.gir:104.11-104.32: error: expected start element of `parameter'
          <instance-parameter name="client" transfer-ownership="none">
          ^^^^^^^^^^^^^^^^^^^^^^
GSSDP-1.0.gir:107.11-107.10: error: expected end element of `parameter'
          </instance-parameter>
         
GSSDP-1.0.gir:116.11-116.32: error: expected start element of `parameter'
          <instance-parameter name="client" transfer-ownership="none">
          ^^^^^^^^^^^^^^^^^^^^^^
GSSDP-1.0.gir:119.11-119.10: error: expected end element of `parameter'
          </instance-parameter>
         
GSSDP-1.0.gir:128.11-128.32: error: expected start element of `parameter'
          <instance-parameter name="client" transfer-ownership="none">
          ^^^^^^^^^^^^^^^^^^^^^^
GSSDP-1.0.gir:131.11-131.10: error: expected end element of `parameter'
          </instance-parameter>
         
GSSDP-1.0.gir:144.11-144.32: error: expected start element of `parameter'
          <instance-parameter name="client" transfer-ownership="none">
          ^^^^^^^^^^^^^^^^^^^^^^
GSSDP-1.0.gir:147.11-147.10: error: expected end element of `parameter'
          </instance-parameter>
         
GSSDP-1.0.gir:321.11-322.38: error: expected start element of `parameter'
GSSDP-1.0.gir:324.11-324.10: error: expected end element of `parameter'
          </instance-parameter>
         
GSSDP-1.0.gir:337.11-338.38: error: expected start element of `parameter'
GSSDP-1.0.gir:341.11-341.10: error: expected end element of `parameter'
          </instance-parameter>
         
GSSDP-1.0.gir:351.11-352.38: error: expected start element of `parameter'
GSSDP-1.0.gir:355.11-355.10: error: expected end element of `parameter'
          </instance-parameter>
         
GSSDP-1.0.gir:364.11-365.38: error: expected start element of `parameter'
GSSDP-1.0.gir:368.11-368.10: error: expected end element of `parameter'
          </instance-parameter>
         
GSSDP-1.0.gir:378.11-379.38: error: expected start element of `parameter'
GSSDP-1.0.gir:382.11-382.10: error: expected end element of `parameter'
          </instance-parameter>
         
GSSDP-1.0.gir:392.11-393.38: error: expected start element of `parameter'
GSSDP-1.0.gir:396.11-396.10: error: expected end element of `parameter'
          </instance-parameter>
         
GSSDP-1.0.gir:409.11-410.38: error: expected start element of `parameter'
GSSDP-1.0.gir:413.11-413.10: error: expected end element of `parameter'
          </instance-parameter>
         
GSSDP-1.0.gir:427.11-428.38: error: expected start element of `parameter'
GSSDP-1.0.gir:431.11-431.10: error: expected end element of `parameter'
          </instance-parameter>
         
GSSDP-1.0.gir:600.11-600.48: error: expected start element of `parameter'
          <instance-parameter name="resource_group" transfer-ownership="none">
          ^^^^^^^^^^^^^^^^^^^^^^^^^^^^^^^^^^^^^^
GSSDP-1.0.gir:603.11-603.10: error: expected end element of `parameter'
          </instance-parameter>
         
GSSDP-1.0.gir:629.11-629.48: error: expected start element of `parameter'
          <instance-parameter name="resource_group" transfer-ownership="none">
          ^^^^^^^^^^^^^^^^^^^^^^^^^^^^^^^^^^^^^^
GSSDP-1.0.gir:632.11-632.10: error: expected end element of `parameter'
          </instance-parameter>
         
GSSDP-1.0.gir:654.11-654.48: error: expected start element of `parameter'
          <instance-parameter name="resource_group" transfer-ownership="none">
          ^^^^^^^^^^^^^^^^^^^^^^^^^^^^^^^^^^^^^^
GSSDP-1.0.gir:657.11-657.10: error: expected end element of `parameter'
          </instance-parameter>
         
GSSDP-1.0.gir:666.11-666.48: error: expected start element of `parameter'
          <instance-parameter name="resource_group" transfer-ownership="none">
          ^^^^^^^^^^^^^^^^^^^^^^^^^^^^^^^^^^^^^^
GSSDP-1.0.gir:669.11-669.10: error: expected end element of `parameter'
          </instance-parameter>
         
GSSDP-1.0.gir:679.11-679.48: error: expected start element of `parameter'
          <instance-parameter name="resource_group" transfer-ownership="none">
          ^^^^^^^^^^^^^^^^^^^^^^^^^^^^^^^^^^^^^^
GSSDP-1.0.gir:682.11-682.10: error: expected end element of `parameter'
          </instance-parameter>
         
GSSDP-1.0.gir:692.11-692.48: error: expected start element of `parameter'
          <instance-parameter name="resource_group" transfer-ownership="none">
          ^^^^^^^^^^^^^^^^^^^^^^^^^^^^^^^^^^^^^^
GSSDP-1.0.gir:695.11-695.10: error: expected end element of `parameter'
          </instance-parameter>
         
GSSDP-1.0.gir:705.11-705.48: error: expected start element of `parameter'
          <instance-parameter name="resource_group" transfer-ownership="none">
          ^^^^^^^^^^^^^^^^^^^^^^^^^^^^^^^^^^^^^^
GSSDP-1.0.gir:708.11-708.10: error: expected end element of `parameter'
          </instance-parameter>
         
GSSDP-1.0.gir:724.11-724.48: error: expected start element of `parameter'
          <instance-parameter name="resource_group" transfer-ownership="none">
          ^^^^^^^^^^^^^^^^^^^^^^^^^^^^^^^^^^^^^^
GSSDP-1.0.gir:727.11-727.10: error: expected end element of `parameter'
          </instance-parameter>
         
GSSDP-1.0.gir:741.11-741.48: error: expected start element of `parameter'
          <instance-parameter name="resource_group" transfer-ownership="none">
          ^^^^^^^^^^^^^^^^^^^^^^^^^^^^^^^^^^^^^^
GSSDP-1.0.gir:744.11-744.10: error: expected end element of `parameter'
          </instance-parameter>
         
GSSDP-1.0.gir:758.11-758.48: error: expected start element of `parameter'
          <instance-parameter name="resource_group" transfer-ownership="none">
          ^^^^^^^^^^^^^^^^^^^^^^^^^^^^^^^^^^^^^^
GSSDP-1.0.gir:761.11-761.10: error: expected end element of `parameter'
          </instance-parameter>
         
GSSDP-1.0.gir:316.7-316.47: warning: Signal `GSSDP.ResourceBrowser.resource_unavailable' conflicts with method of the same name
      <virtual-method name="resource_unavailable">
      ^^^^^^^^^^^^^^^^^^^^^^^^^^^^^^^^^^^^^^^^^
Generation failed: 54 error(s), 1 warning(s)
make[2]: *** [gssdp-1.0.stamp] Error 1
make[2]: Leaving directory `/var/tmp/portage/net-libs/gssdp-0.12.2.1/work/gssdp-0.12.2.1/vala'
make[1]: *** [all-recursive] Error 1
make[1]: Leaving directory `/var/tmp/portage/net-libs/gssdp-0.12.2.1/work/gssdp-0.12.2.1'
make: *** [all] Error 2
 * ERROR: net-libs/gssdp-0.12.2.1 failed (compile phase):
 *   emake failed
 *
 * If you need support, post the output of `emerge --info '=net-libs/gssdp-0.12.2.1'`,
 * the complete build log and the output of `emerge -pqv '=net-libs/gssdp-0.12.2.1'`.
 * The complete build log is located at '/var/log/portage/net-libs:gssdp-0.12.2.1:20130912-190250.log'.
 * For convenience, a symlink to the build log is located at '/var/tmp/portage/net-libs/gssdp-0.12.2.1/temp/build.log'.
 * The ebuild environment file is located at '/var/tmp/portage/net-libs/gssdp-0.12.2.1/temp/environment'.
 * Working directory: '/var/tmp/portage/net-libs/gssdp-0.12.2.1/work/gssdp-0.12.2.1'
 * S: '/var/tmp/portage/net-libs/gssdp-0.12.2.1/work/gssdp-0.12.2.1'


I happen to have these emerge'd atm:

localhost / # epm -qa|grep vala
vala-0.14.2-r2
vala-0.18.1
vala-0.16.1-r2
vala-common-0.18.1

localhost / # epm -qa|grep gob
pygobject-2.28.6-r53
pygobject-3.8.1
gobject-introspection-1.36.0
gobject-introspection-common-1.36.0

if I need to include other things just let me know and I will.

thanks.


Last edited by nordic bro on Sat Sep 14, 2013 3:53 pm; edited 1 time in total
Back to top
View user's profile Send private message
quilosaq
l33t
l33t


Joined: 22 Dec 2009
Posts: 757

PostPosted: Thu Sep 12, 2013 9:52 pm    Post subject: Reply with quote

I think you need update the portage tree
Code:
emerge --sync
and then select the highest version on vala
Code:
eselect vala list
.
Back to top
View user's profile Send private message
nordic bro
Guru
Guru


Joined: 25 Oct 2003
Posts: 560

PostPosted: Fri Sep 13, 2013 5:08 am    Post subject: Reply with quote

thanks, is there a way to resolve this w/o doing a sync? many of the threads/mailing lists I found on others having this same vala/gir prob were from before may - june meaning they fixed it w/a portage tree (or source tars) as old or older than mine.

the main reason I don't want to sync is because there's no way to know if it actually fixes the prob; I also read in a couple places gnome 3.8.x requires systemd which I have no intention of using:

http://wiki.gentoo.org/index.php?title=GNOME/3.8-upgrade-guide&redirect=no

http://my.opera.com/pacho/blog/2013/07/24/gnome-3-8-requiring-systemd-on-gentoo

currently my portage tree has early 3.8 stuff so I'd like to just keep that given so far nothing is insisting on any systemd stuff.
Back to top
View user's profile Send private message
quilosaq
l33t
l33t


Joined: 22 Dec 2009
Posts: 757

PostPosted: Fri Sep 13, 2013 5:59 pm    Post subject: Reply with quote

Post the config.log file for that package (in ${WORKDIR}/${P} from ebuild).
Back to top
View user's profile Send private message
nordic bro
Guru
Guru


Joined: 25 Oct 2003
Posts: 560

PostPosted: Fri Sep 13, 2013 7:41 pm    Post subject: Reply with quote

I'm guessing when a var is set in config.log that affirms it exists? I checked anyway and these are all there:

/usr/share/gir-1.0
/usr/share/gobject-introspection-1.0/Makefile.introspection
/usr/lib64/girepository-1.0

I'm not sure what this means:

HAVE_VAPIGEN_FALSE='#'
HAVE_VAPIGEN_TRUE=''

but I show:

-rwxr-xr-x 1 root 172824 Sep 12 13 01:11 /usr/bin/vapigen-0.14
-rwxr-xr-x 1 root 172824 Sep 12 13 01:27 /usr/bin/vapigen-0.16
-rwxr-xr-x 1 root 172856 Sep 12 13 01:41 /usr/bin/vapigen-0.18

incidentally I'm running this from a chroot, could that have anything to do with my trouble? this is what I do to enter it (I have no gnome stuff on the host):

mount -t proc none /system/core2_build/proc
mount --rbind /dev /system/core2_build/dev
mount --rbind /sys /system/core2_build/sys
chroot /system/core2_build /bin/bash
env-update
source /etc/profile


Code:
This file contains any messages produced by compilers while
running configure, to aid debugging if configure makes a mistake.

It was created by gssdp configure 0.12.2.1, which was
generated by GNU Autoconf 2.68.  Invocation command line was

  $ ./configure --prefix=/usr --build=x86_64-pc-linux-gnu --host=x86_64-pc-linux-gnu --mandir=/usr/share/man --infodir=/usr/share/info --datadir=/usr/share --sysconfdir=/etc --localstatedir=/var/lib --libdir=/usr/lib64 --disable-dependency-tracking --enable-introspection --with-gtk --disable-dependency-tracking --disable-static --disable-gtk-doc VAPIGEN=/usr/bin/vapigen-0.14

## --------- ##
## Platform. ##
## --------- ##

hostname = localhost
uname -m = x86_64
uname -r = 3.5.4_k2
uname -s = Linux
uname -v = #7 SMP PREEMPT Fri Mar 29 00:36:21 EDT 2013

/usr/bin/uname -p = Intel(R) Core(TM)2 CPU 6600 @ 2.40GHz
/bin/uname -X     = unknown

/bin/arch              = unknown
/usr/bin/arch -k       = unknown
/usr/convex/getsysinfo = unknown
/usr/bin/hostinfo      = unknown
/bin/machine           = unknown
/usr/bin/oslevel       = unknown
/bin/universe          = unknown

PATH: /usr/lib64/portage/bin/ebuild-helpers
PATH: /usr/local/sbin
PATH: /usr/local/bin
PATH: /usr/sbin
PATH: /usr/bin
PATH: /sbin
PATH: /bin
PATH: /opt/bin
PATH: /usr/x86_64-pc-linux-gnu/gcc-bin/4.7.2


## ----------- ##
## Core tests. ##
## ----------- ##

configure:2295: checking for a BSD-compatible install
configure:2363: result: /usr/bin/install -c
configure:2374: checking whether build environment is sane
configure:2424: result: yes
configure:2565: checking for a thread-safe mkdir -p
configure:2604: result: /bin/mkdir -p
configure:2617: checking for gawk
configure:2633: found /usr/bin/gawk
configure:2644: result: gawk
configure:2655: checking whether make sets $(MAKE)
configure:2677: result: yes
configure:2752: checking how to create a ustar tar archive
configure:2765: tar --version
tar (GNU tar) 1.26
Copyright (C) 2011 Free Software Foundation, Inc.
License GPLv3+: GNU GPL version 3 or later <http://gnu.org/licenses/gpl.html>.
This is free software: you are free to change and redistribute it.
There is NO WARRANTY, to the extent permitted by law.

Written by John Gilmore and Jay Fenlason.
configure:2768: $? = 0
configure:2808: tardir=conftest.dir && eval tar --format=ustar -chf - "$tardir" >conftest.tar
configure:2811: $? = 0
configure:2815: tar -xf - <conftest.tar
configure:2818: $? = 0
configure:2831: result: gnutar
configure:2839: checking whether to enable maintainer-specific portions of Makefiles
configure:2848: result: yes
configure:2873: checking whether make supports nested variables
configure:2890: result: yes
configure:2914: checking for style of include used by make
configure:2942: result: GNU
configure:2973: checking for x86_64-pc-linux-gnu-gcc
configure:2989: found /usr/bin/x86_64-pc-linux-gnu-gcc
configure:3000: result: x86_64-pc-linux-gnu-gcc
configure:3269: checking for C compiler version
configure:3278: x86_64-pc-linux-gnu-gcc --version >&5
x86_64-pc-linux-gnu-gcc (Gentoo 4.7.2-r1 p1.6, pie-0.5.5) 4.7.2
Copyright (C) 2012 Free Software Foundation, Inc.
This is free software; see the source for copying conditions.  There is NO
warranty; not even for MERCHANTABILITY or FITNESS FOR A PARTICULAR PURPOSE.

configure:3289: $? = 0
configure:3278: x86_64-pc-linux-gnu-gcc -v >&5
Using built-in specs.
COLLECT_GCC=/usr/x86_64-pc-linux-gnu/gcc-bin/4.7.2/x86_64-pc-linux-gnu-gcc
COLLECT_LTO_WRAPPER=/usr/libexec/gcc/x86_64-pc-linux-gnu/4.7.2/lto-wrapper
Target: x86_64-pc-linux-gnu
Configured with: /var/tmp/portage/sys-devel/gcc-4.7.2-r1/work/gcc-4.7.2/configure --prefix=/usr --bindir=/usr/x86_64-pc-linux-gnu/gcc-bin/4.7.2 --includedir=/usr/lib/gcc/x86_64-pc-linux-gnu/4.7.2/include --datadir=/usr/share/gcc-data/x86_64-pc-linux-gnu/4.7.2 --mandir=/usr/share/gcc-data/x86_64-pc-linux-gnu/4.7.2/man --infodir=/usr/share/gcc-data/x86_64-pc-linux-gnu/4.7.2/info --with-gxx-include-dir=/usr/lib/gcc/x86_64-pc-linux-gnu/4.7.2/include/g++-v4 --host=x86_64-pc-linux-gnu --build=x86_64-pc-linux-gnu --disable-altivec --disable-fixed-point --without-cloog --without-ppl --enable-lto --disable-nls --with-system-zlib --enable-obsolete --disable-werror --enable-secureplt --enable-multilib --with-multilib-list=m32,m64 --enable-libmudflap --disable-libssp --enable-libgomp --with-python-dir=/share/gcc-data/x86_64-pc-linux-gnu/4.7.2/python --enable-checking=release --disable-libgcj --enable-libstdcxx-time --enable-languages=c,c++,fortran --enable-shared --enable-threads=posix --enable-__cxa_atexit --enable-clocale=gnu --enable-targets=all --with-bugurl=http://bugs.gentoo.org/ --with-pkgversion='Gentoo 4.7.2-r1 p1.6, pie-0.5.5'
Thread model: posix
gcc version 4.7.2 (Gentoo 4.7.2-r1 p1.6, pie-0.5.5)
configure:3289: $? = 0
configure:3278: x86_64-pc-linux-gnu-gcc -V >&5
x86_64-pc-linux-gnu-gcc: error: unrecognized command line option '-V'
x86_64-pc-linux-gnu-gcc: fatal error: no input files
compilation terminated.
configure:3289: $? = 1
configure:3278: x86_64-pc-linux-gnu-gcc -qversion >&5
x86_64-pc-linux-gnu-gcc: error: unrecognized command line option '-qversion'
x86_64-pc-linux-gnu-gcc: fatal error: no input files
compilation terminated.
configure:3289: $? = 1
configure:3309: checking whether the C compiler works
configure:3331: x86_64-pc-linux-gnu-gcc -march=core2 -O2 -pipe  -Wl,-O1 -Wl,--as-needed conftest.c  >&5
configure:3335: $? = 0
configure:3383: result: yes
configure:3386: checking for C compiler default output file name
configure:3388: result: a.out
configure:3394: checking for suffix of executables
configure:3401: x86_64-pc-linux-gnu-gcc -o conftest -march=core2 -O2 -pipe  -Wl,-O1 -Wl,--as-needed conftest.c  >&5
configure:3405: $? = 0
configure:3427: result:
configure:3449: checking whether we are cross compiling
configure:3457: x86_64-pc-linux-gnu-gcc -o conftest -march=core2 -O2 -pipe  -Wl,-O1 -Wl,--as-needed conftest.c  >&5
configure:3461: $? = 0
configure:3468: ./conftest
configure:3472: $? = 0
configure:3487: result: no
configure:3492: checking for suffix of object files
configure:3514: x86_64-pc-linux-gnu-gcc -c -march=core2 -O2 -pipe  conftest.c >&5
configure:3518: $? = 0
configure:3539: result: o
configure:3543: checking whether we are using the GNU C compiler
configure:3562: x86_64-pc-linux-gnu-gcc -c -march=core2 -O2 -pipe  conftest.c >&5
configure:3562: $? = 0
configure:3571: result: yes
configure:3580: checking whether x86_64-pc-linux-gnu-gcc accepts -g
configure:3600: x86_64-pc-linux-gnu-gcc -c -g  conftest.c >&5
configure:3600: $? = 0
configure:3641: result: yes
configure:3658: checking for x86_64-pc-linux-gnu-gcc option to accept ISO C89
configure:3722: x86_64-pc-linux-gnu-gcc  -c -march=core2 -O2 -pipe  conftest.c >&5
configure:3722: $? = 0
configure:3735: result: none needed
configure:3757: checking dependency style of x86_64-pc-linux-gnu-gcc
configure:3868: result: none
configure:3884: checking for library containing strerror
configure:3915: x86_64-pc-linux-gnu-gcc -o conftest -march=core2 -O2 -pipe  -Wl,-O1 -Wl,--as-needed conftest.c  >&5
configure:3915: $? = 0
configure:3932: result: none required
configure:3948: checking for x86_64-pc-linux-gnu-gcc
configure:3975: result: x86_64-pc-linux-gnu-gcc
configure:4244: checking for C compiler version
configure:4253: x86_64-pc-linux-gnu-gcc --version >&5
x86_64-pc-linux-gnu-gcc (Gentoo 4.7.2-r1 p1.6, pie-0.5.5) 4.7.2
Copyright (C) 2012 Free Software Foundation, Inc.
This is free software; see the source for copying conditions.  There is NO
warranty; not even for MERCHANTABILITY or FITNESS FOR A PARTICULAR PURPOSE.

configure:4264: $? = 0
configure:4253: x86_64-pc-linux-gnu-gcc -v >&5
Using built-in specs.
COLLECT_GCC=/usr/x86_64-pc-linux-gnu/gcc-bin/4.7.2/x86_64-pc-linux-gnu-gcc
COLLECT_LTO_WRAPPER=/usr/libexec/gcc/x86_64-pc-linux-gnu/4.7.2/lto-wrapper
Target: x86_64-pc-linux-gnu
Configured with: /var/tmp/portage/sys-devel/gcc-4.7.2-r1/work/gcc-4.7.2/configure --prefix=/usr --bindir=/usr/x86_64-pc-linux-gnu/gcc-bin/4.7.2 --includedir=/usr/lib/gcc/x86_64-pc-linux-gnu/4.7.2/include --datadir=/usr/share/gcc-data/x86_64-pc-linux-gnu/4.7.2 --mandir=/usr/share/gcc-data/x86_64-pc-linux-gnu/4.7.2/man --infodir=/usr/share/gcc-data/x86_64-pc-linux-gnu/4.7.2/info --with-gxx-include-dir=/usr/lib/gcc/x86_64-pc-linux-gnu/4.7.2/include/g++-v4 --host=x86_64-pc-linux-gnu --build=x86_64-pc-linux-gnu --disable-altivec --disable-fixed-point --without-cloog --without-ppl --enable-lto --disable-nls --with-system-zlib --enable-obsolete --disable-werror --enable-secureplt --enable-multilib --with-multilib-list=m32,m64 --enable-libmudflap --disable-libssp --enable-libgomp --with-python-dir=/share/gcc-data/x86_64-pc-linux-gnu/4.7.2/python --enable-checking=release --disable-libgcj --enable-libstdcxx-time --enable-languages=c,c++,fortran --enable-shared --enable-threads=posix --enable-__cxa_atexit --enable-clocale=gnu --enable-targets=all --with-bugurl=http://bugs.gentoo.org/ --with-pkgversion='Gentoo 4.7.2-r1 p1.6, pie-0.5.5'
Thread model: posix
gcc version 4.7.2 (Gentoo 4.7.2-r1 p1.6, pie-0.5.5)
configure:4264: $? = 0
configure:4253: x86_64-pc-linux-gnu-gcc -V >&5
x86_64-pc-linux-gnu-gcc: error: unrecognized command line option '-V'
x86_64-pc-linux-gnu-gcc: fatal error: no input files
compilation terminated.
configure:4264: $? = 1
configure:4253: x86_64-pc-linux-gnu-gcc -qversion >&5
x86_64-pc-linux-gnu-gcc: error: unrecognized command line option '-qversion'
x86_64-pc-linux-gnu-gcc: fatal error: no input files
compilation terminated.
configure:4264: $? = 1
configure:4268: checking whether we are using the GNU C compiler
configure:4296: result: yes
configure:4305: checking whether x86_64-pc-linux-gnu-gcc accepts -g
configure:4366: result: yes
configure:4383: checking for x86_64-pc-linux-gnu-gcc option to accept ISO C89
configure:4460: result: none needed
configure:4482: checking dependency style of x86_64-pc-linux-gnu-gcc
configure:4593: result: none
configure:4613: checking how to run the C preprocessor
configure:4644: x86_64-pc-linux-gnu-gcc -E  conftest.c
configure:4644: $? = 0
configure:4658: x86_64-pc-linux-gnu-gcc -E  conftest.c
conftest.c:11:28: fatal error: ac_nonexistent.h: No such file or directory
compilation terminated.
configure:4658: $? = 1
configure: failed program was:
| /* confdefs.h */
| #define PACKAGE_NAME "gssdp"
| #define PACKAGE_TARNAME "gssdp"
| #define PACKAGE_VERSION "0.12.2.1"
| #define PACKAGE_STRING "gssdp 0.12.2.1"
| #define PACKAGE_BUGREPORT "http://bugzilla.gnome.org/enter_bug.cgi?product=gupnp&component=gssdp"
| #define PACKAGE_URL "http://www.gupnp.org/"
| #define PACKAGE "gssdp"
| #define VERSION "0.12.2.1"
| /* end confdefs.h.  */
| #include <ac_nonexistent.h>
configure:4683: result: x86_64-pc-linux-gnu-gcc -E
configure:4703: x86_64-pc-linux-gnu-gcc -E  conftest.c
configure:4703: $? = 0
configure:4717: x86_64-pc-linux-gnu-gcc -E  conftest.c
conftest.c:11:28: fatal error: ac_nonexistent.h: No such file or directory
compilation terminated.
configure:4717: $? = 1
configure: failed program was:
| /* confdefs.h */
| #define PACKAGE_NAME "gssdp"
| #define PACKAGE_TARNAME "gssdp"
| #define PACKAGE_VERSION "0.12.2.1"
| #define PACKAGE_STRING "gssdp 0.12.2.1"
| #define PACKAGE_BUGREPORT "http://bugzilla.gnome.org/enter_bug.cgi?product=gupnp&component=gssdp"
| #define PACKAGE_URL "http://www.gupnp.org/"
| #define PACKAGE "gssdp"
| #define VERSION "0.12.2.1"
| /* end confdefs.h.  */
| #include <ac_nonexistent.h>
configure:4746: checking for grep that handles long lines and -e
configure:4804: result: /bin/grep
configure:4809: checking for egrep
configure:4871: result: /bin/grep -E
configure:4876: checking for ANSI C header files
configure:4896: x86_64-pc-linux-gnu-gcc -c -march=core2 -O2 -pipe  conftest.c >&5
configure:4896: $? = 0
configure:4969: x86_64-pc-linux-gnu-gcc -o conftest -march=core2 -O2 -pipe  -Wl,-O1 -Wl,--as-needed conftest.c  >&5
configure:4969: $? = 0
configure:4969: ./conftest
configure:4969: $? = 0
configure:4980: result: yes
configure:5019: checking build system type
configure:5033: result: x86_64-pc-linux-gnu
configure:5053: checking host system type
configure:5066: result: x86_64-pc-linux-gnu
configure:5107: checking how to print strings
configure:5134: result: printf
configure:5155: checking for a sed that does not truncate output
configure:5219: result: /bin/sed
configure:5237: checking for fgrep
configure:5299: result: /bin/grep -F
configure:5334: checking for ld used by x86_64-pc-linux-gnu-gcc
configure:5401: result: /usr/x86_64-pc-linux-gnu/bin/ld
configure:5408: checking if the linker (/usr/x86_64-pc-linux-gnu/bin/ld) is GNU ld
configure:5423: result: yes
configure:5435: checking for BSD- or MS-compatible name lister (nm)
configure:5484: result: /usr/bin/nm -B
configure:5614: checking the name lister (/usr/bin/nm -B) interface
configure:5621: x86_64-pc-linux-gnu-gcc -c -march=core2 -O2 -pipe  conftest.c >&5
configure:5624: /usr/bin/nm -B "conftest.o"
configure:5627: output
0000000000000000 B some_variable
configure:5634: result: BSD nm
configure:5637: checking whether ln -s works
configure:5641: result: yes
configure:5649: checking the maximum length of command line arguments
configure:5779: result: 1572864
configure:5796: checking whether the shell understands some XSI constructs
configure:5806: result: yes
configure:5810: checking whether the shell understands "+="
configure:5816: result: yes
configure:5851: checking how to convert x86_64-pc-linux-gnu file names to x86_64-pc-linux-gnu format
configure:5891: result: func_convert_file_noop
configure:5898: checking how to convert x86_64-pc-linux-gnu file names to toolchain format
configure:5918: result: func_convert_file_noop
configure:5925: checking for /usr/x86_64-pc-linux-gnu/bin/ld option to reload object files
configure:5932: result: -r
configure:5966: checking for x86_64-pc-linux-gnu-objdump
configure:5982: found /usr/bin/x86_64-pc-linux-gnu-objdump
configure:5993: result: x86_64-pc-linux-gnu-objdump
configure:6065: checking how to recognize dependent libraries
configure:6267: result: pass_all
configure:6312: checking for x86_64-pc-linux-gnu-dlltool
configure:6342: result: no
configure:6352: checking for dlltool
configure:6382: result: no
configure:6412: checking how to associate runtime and link libraries
configure:6439: result: printf %s\n
configure:6455: checking for x86_64-pc-linux-gnu-ar
configure:6471: found /usr/bin/x86_64-pc-linux-gnu-ar
configure:6482: result: x86_64-pc-linux-gnu-ar
configure:6563: checking for archiver @FILE support
configure:6580: x86_64-pc-linux-gnu-gcc -c -march=core2 -O2 -pipe  conftest.c >&5
configure:6580: $? = 0
configure:6583: x86_64-pc-linux-gnu-ar cru libconftest.a @conftest.lst >&5
configure:6586: $? = 0
configure:6591: x86_64-pc-linux-gnu-ar cru libconftest.a @conftest.lst >&5
x86_64-pc-linux-gnu-ar: conftest.o: No such file or directory
configure:6594: $? = 1
configure:6606: result: @
configure:6624: checking for x86_64-pc-linux-gnu-strip
configure:6640: found /usr/bin/x86_64-pc-linux-gnu-strip
configure:6651: result: x86_64-pc-linux-gnu-strip
configure:6723: checking for x86_64-pc-linux-gnu-ranlib
configure:6739: found /usr/bin/x86_64-pc-linux-gnu-ranlib
configure:6750: result: x86_64-pc-linux-gnu-ranlib
configure:6892: checking command to parse /usr/bin/nm -B output from x86_64-pc-linux-gnu-gcc object
configure:7012: x86_64-pc-linux-gnu-gcc -c -march=core2 -O2 -pipe  conftest.c >&5
configure:7015: $? = 0
configure:7019: /usr/bin/nm -B conftest.o \| sed -n -e 's/^.*[ ]\([ABCDGIRSTW][ABCDGIRSTW]*\)[ ][ ]*\([_A-Za-z][_A-Za-z0-9]*\)$/\1 \2 \2/p' | sed '/ __gnu_lto/d' \> conftest.nm
configure:7022: $? = 0
configure:7088: x86_64-pc-linux-gnu-gcc -o conftest -march=core2 -O2 -pipe  -Wl,-O1 -Wl,--as-needed conftest.c conftstm.o >&5
configure:7091: $? = 0
configure:7129: result: ok
configure:7166: checking for sysroot
configure:7196: result: no
configure:7273: x86_64-pc-linux-gnu-gcc -c -march=core2 -O2 -pipe  conftest.c >&5
configure:7276: $? = 0
configure:7412: checking for x86_64-pc-linux-gnu-mt
configure:7442: result: no
configure:7452: checking for mt
configure:7482: result: no
configure:7502: checking if : is a manifest tool
configure:7508: : '-?'
configure:7516: result: no
configure:8158: checking for sys/types.h
configure:8158: x86_64-pc-linux-gnu-gcc -c -march=core2 -O2 -pipe  conftest.c >&5
configure:8158: $? = 0
configure:8158: result: yes
configure:8158: checking for sys/stat.h
configure:8158: x86_64-pc-linux-gnu-gcc -c -march=core2 -O2 -pipe  conftest.c >&5
configure:8158: $? = 0
configure:8158: result: yes
configure:8158: checking for stdlib.h
configure:8158: x86_64-pc-linux-gnu-gcc -c -march=core2 -O2 -pipe  conftest.c >&5
configure:8158: $? = 0
configure:8158: result: yes
configure:8158: checking for string.h
configure:8158: x86_64-pc-linux-gnu-gcc -c -march=core2 -O2 -pipe  conftest.c >&5
configure:8158: $? = 0
configure:8158: result: yes
configure:8158: checking for memory.h
configure:8158: x86_64-pc-linux-gnu-gcc -c -march=core2 -O2 -pipe  conftest.c >&5
configure:8158: $? = 0
configure:8158: result: yes
configure:8158: checking for strings.h
configure:8158: x86_64-pc-linux-gnu-gcc -c -march=core2 -O2 -pipe  conftest.c >&5
configure:8158: $? = 0
configure:8158: result: yes
configure:8158: checking for inttypes.h
configure:8158: x86_64-pc-linux-gnu-gcc -c -march=core2 -O2 -pipe  conftest.c >&5
configure:8158: $? = 0
configure:8158: result: yes
configure:8158: checking for stdint.h
configure:8158: x86_64-pc-linux-gnu-gcc -c -march=core2 -O2 -pipe  conftest.c >&5
configure:8158: $? = 0
configure:8158: result: yes
configure:8158: checking for unistd.h
configure:8158: x86_64-pc-linux-gnu-gcc -c -march=core2 -O2 -pipe  conftest.c >&5
configure:8158: $? = 0
configure:8158: result: yes
configure:8172: checking for dlfcn.h
configure:8172: x86_64-pc-linux-gnu-gcc -c -march=core2 -O2 -pipe  conftest.c >&5
configure:8172: $? = 0
configure:8172: result: yes
configure:8378: checking for objdir
configure:8393: result: .libs
configure:8664: checking if x86_64-pc-linux-gnu-gcc supports -fno-rtti -fno-exceptions
configure:8682: x86_64-pc-linux-gnu-gcc -c -march=core2 -O2 -pipe  -fno-rtti -fno-exceptions conftest.c >&5
cc1: warning: command line option '-fno-rtti' is valid for C++/ObjC++ but not for C [enabled by default]
configure:8686: $? = 0
configure:8699: result: no
configure:9026: checking for x86_64-pc-linux-gnu-gcc option to produce PIC
configure:9033: result: -fPIC -DPIC
configure:9041: checking if x86_64-pc-linux-gnu-gcc PIC flag -fPIC -DPIC works
configure:9059: x86_64-pc-linux-gnu-gcc -c -march=core2 -O2 -pipe  -fPIC -DPIC -DPIC conftest.c >&5
configure:9063: $? = 0
configure:9076: result: yes
configure:9105: checking if x86_64-pc-linux-gnu-gcc static flag -static works
configure:9133: result: yes
configure:9148: checking if x86_64-pc-linux-gnu-gcc supports -c -o file.o
configure:9169: x86_64-pc-linux-gnu-gcc -c -march=core2 -O2 -pipe  -o out/conftest2.o conftest.c >&5
configure:9173: $? = 0
configure:9195: result: yes
configure:9203: checking if x86_64-pc-linux-gnu-gcc supports -c -o file.o
configure:9250: result: yes
configure:9283: checking whether the x86_64-pc-linux-gnu-gcc linker (/usr/x86_64-pc-linux-gnu/bin/ld -m elf_x86_64) supports shared libraries
configure:10440: result: yes
configure:10477: checking whether -lc should be explicitly linked in
configure:10485: x86_64-pc-linux-gnu-gcc -c -march=core2 -O2 -pipe  conftest.c >&5
configure:10488: $? = 0
configure:10503: x86_64-pc-linux-gnu-gcc -shared  -fPIC -DPIC conftest.o  -v -Wl,-soname -Wl,conftest -o conftest 2\>\&1 \| /bin/grep  -lc  \>/dev/null 2\>\&1
configure:10506: $? = 0
configure:10520: result: no
configure:10680: checking dynamic linker characteristics
configure:11191: x86_64-pc-linux-gnu-gcc -o conftest -march=core2 -O2 -pipe  -Wl,-O1 -Wl,--as-needed -Wl,-rpath -Wl,/foo conftest.c  >&5
configure:11191: $? = 0
configure:11425: result: GNU/Linux ld.so
configure:11532: checking how to hardcode library paths into programs
configure:11557: result: immediate
configure:12097: checking whether stripping libraries is possible
configure:12102: result: yes
configure:12137: checking if libtool supports shared libraries
configure:12139: result: yes
configure:12142: checking whether to build shared libraries
configure:12163: result: yes
configure:12166: checking whether to build static libraries
configure:12170: result: no
configure:12219: checking for x86_64-pc-linux-gnu-pkg-config
configure:12237: found /usr/bin/x86_64-pc-linux-gnu-pkg-config
configure:12249: result: /usr/bin/x86_64-pc-linux-gnu-pkg-config
configure:12317: checking pkg-config is at least version 0.9.0
configure:12320: result: yes
configure:12330: checking for LIBGSSDP
configure:12340: $PKG_CONFIG --exists --print-errors "glib-2.0 >= 2.22 \
                            gobject-2.0 >= 2.22 \
                            gio-2.0 >= 2.22 \
                            libsoup-2.4 >= 2.26.1"
configure:12346: $? = 0
configure:12366: $PKG_CONFIG --exists --print-errors "glib-2.0 >= 2.22 \
                            gobject-2.0 >= 2.22 \
                            gio-2.0 >= 2.22 \
                            libsoup-2.4 >= 2.26.1"
configure:12372: $? = 0
configure:12442: result: yes
configure:12462: checking for LIBGTK
configure:12469: $PKG_CONFIG --exists --print-errors "gtk+-2.0 >= $LIBGTK_REQUIRED "
configure:12472: $? = 0
configure:12486: $PKG_CONFIG --exists --print-errors "gtk+-2.0 >= $LIBGTK_REQUIRED "
configure:12489: $? = 0
configure:12535: result: yes
configure:12594: checking for gobject-introspection
configure:12603: $PKG_CONFIG --exists --print-errors "gobject-introspection-1.0"
configure:12606: $? = 0
configure:12613: $PKG_CONFIG --exists --print-errors "gobject-introspection-1.0 >= 0.6.7"
configure:12616: $? = 0
configure:12639: result: yes
configure:12682: checking for vapigen
configure:12712: result: /usr/bin/vapigen-0.14
configure:12725: checking /usr/bin/vapigen-0.14 is at least version 0.14
configure:12733: result: yes
configure:12761: checking for Win32
configure:12771: result: no
configure:12787: checking for gtkdoc-check
configure:12805: found /usr/bin/gtkdoc-check
configure:12817: result: /usr/bin/gtkdoc-check
configure:12829: checking for gtkdoc-rebase
configure:12847: found /usr/bin/gtkdoc-rebase
configure:12859: result: /usr/bin/gtkdoc-rebase
configure:12873: checking for gtkdoc-mkpdf
configure:12891: found /usr/bin/gtkdoc-mkpdf
configure:12903: result: /usr/bin/gtkdoc-mkpdf
configure:13037: checking whether to build gtk-doc documentation
configure:13039: result: no
configure:13280: creating ./config.status

## ---------------------- ##
## Running config.status. ##
## ---------------------- ##

This file was extended by gssdp config.status 0.12.2.1, which was
generated by GNU Autoconf 2.68.  Invocation command line was

  CONFIG_FILES    =
  CONFIG_HEADERS  =
  CONFIG_LINKS    =
  CONFIG_COMMANDS =
  $ ./config.status

on localhost

config.status:1151: creating Makefile
config.status:1151: creating libgssdp/Makefile
config.status:1151: creating tools/Makefile
config.status:1151: creating tests/Makefile
config.status:1151: creating tests/gtest/Makefile
config.status:1151: creating vala/Makefile
config.status:1151: creating doc/Makefile
config.status:1151: creating doc/version.xml
config.status:1151: creating gssdp-1.0.pc
config.status:1151: creating gssdp-1.0-uninstalled.pc
config.status:1151: creating config.h
config.status:1380: executing depfiles commands
config.status:1380: executing libtool commands

## ---------------- ##
## Cache variables. ##
## ---------------- ##

ac_cv_build=x86_64-pc-linux-gnu
ac_cv_c_compiler_gnu=yes
ac_cv_env_CC_set=
ac_cv_env_CC_value=
ac_cv_env_CFLAGS_set=set
ac_cv_env_CFLAGS_value='-march=core2 -O2 -pipe'
ac_cv_env_CPPFLAGS_set=
ac_cv_env_CPPFLAGS_value=
ac_cv_env_CPP_set=
ac_cv_env_CPP_value=
ac_cv_env_GTKDOC_DEPS_CFLAGS_set=
ac_cv_env_GTKDOC_DEPS_CFLAGS_value=
ac_cv_env_GTKDOC_DEPS_LIBS_set=
ac_cv_env_GTKDOC_DEPS_LIBS_value=
ac_cv_env_LDFLAGS_set=set
ac_cv_env_LDFLAGS_value='-Wl,-O1 -Wl,--as-needed'
ac_cv_env_LIBGSSDP_CFLAGS_set=
ac_cv_env_LIBGSSDP_CFLAGS_value=
ac_cv_env_LIBGSSDP_LIBS_set=
ac_cv_env_LIBGSSDP_LIBS_value=
ac_cv_env_LIBGTK_CFLAGS_set=
ac_cv_env_LIBGTK_CFLAGS_value=
ac_cv_env_LIBGTK_LIBS_set=
ac_cv_env_LIBGTK_LIBS_value=
ac_cv_env_LIBS_set=
ac_cv_env_LIBS_value=
ac_cv_env_PKG_CONFIG_LIBDIR_set=
ac_cv_env_PKG_CONFIG_LIBDIR_value=
ac_cv_env_PKG_CONFIG_PATH_set=set
ac_cv_env_PKG_CONFIG_PATH_value='$PKG_CONFIG_PATH:/usr/local/lib/pkgconfig'
ac_cv_env_PKG_CONFIG_set=
ac_cv_env_PKG_CONFIG_value=
ac_cv_env_build_alias_set=set
ac_cv_env_build_alias_value=x86_64-pc-linux-gnu
ac_cv_env_host_alias_set=set
ac_cv_env_host_alias_value=x86_64-pc-linux-gnu
ac_cv_env_target_alias_set=
ac_cv_env_target_alias_value=
ac_cv_header_dlfcn_h=yes
ac_cv_header_inttypes_h=yes
ac_cv_header_memory_h=yes
ac_cv_header_stdc=yes
ac_cv_header_stdint_h=yes
ac_cv_header_stdlib_h=yes
ac_cv_header_string_h=yes
ac_cv_header_strings_h=yes
ac_cv_header_sys_stat_h=yes
ac_cv_header_sys_types_h=yes
ac_cv_header_unistd_h=yes
ac_cv_host=x86_64-pc-linux-gnu
ac_cv_objext=o
ac_cv_path_EGREP='/bin/grep -E'
ac_cv_path_FGREP='/bin/grep -F'
ac_cv_path_GREP=/bin/grep
ac_cv_path_GTKDOC_CHECK=/usr/bin/gtkdoc-check
ac_cv_path_GTKDOC_MKPDF=/usr/bin/gtkdoc-mkpdf
ac_cv_path_GTKDOC_REBASE=/usr/bin/gtkdoc-rebase
ac_cv_path_PKG_CONFIG=/usr/bin/x86_64-pc-linux-gnu-pkg-config
ac_cv_path_SED=/bin/sed
ac_cv_path_VAPIGEN=/usr/bin/vapigen-0.14
ac_cv_path_install='/usr/bin/install -c'
ac_cv_path_mkdir=/bin/mkdir
ac_cv_prog_AR=x86_64-pc-linux-gnu-ar
ac_cv_prog_AWK=gawk
ac_cv_prog_CC=x86_64-pc-linux-gnu-gcc
ac_cv_prog_CPP='x86_64-pc-linux-gnu-gcc -E'
ac_cv_prog_OBJDUMP=x86_64-pc-linux-gnu-objdump
ac_cv_prog_RANLIB=x86_64-pc-linux-gnu-ranlib
ac_cv_prog_STRIP=x86_64-pc-linux-gnu-strip
ac_cv_prog_cc_c89=
ac_cv_prog_cc_g=yes
ac_cv_prog_make_make_set=yes
ac_cv_search_strerror='none required'
am_cv_CC_dependencies_compiler_type=none
am_cv_make_support_nested_variables=yes
am_cv_prog_tar_ustar=gnutar
lt_cv_ar_at_file=@
lt_cv_archive_cmds_need_lc=no
lt_cv_deplibs_check_method=pass_all
lt_cv_file_magic_cmd='$MAGIC_CMD'
lt_cv_file_magic_test_file=
lt_cv_ld_reload_flag=-r
lt_cv_nm_interface='BSD nm'
lt_cv_objdir=.libs
lt_cv_path_LD=/usr/x86_64-pc-linux-gnu/bin/ld
lt_cv_path_NM='/usr/bin/nm -B'
lt_cv_path_mainfest_tool=no
lt_cv_prog_compiler_c_o=yes
lt_cv_prog_compiler_pic='-fPIC -DPIC'
lt_cv_prog_compiler_pic_works=yes
lt_cv_prog_compiler_rtti_exceptions=no
lt_cv_prog_compiler_static_works=yes
lt_cv_prog_gnu_ld=yes
lt_cv_sharedlib_from_linklib_cmd='printf %s\n'
lt_cv_shlibpath_overrides_runpath=yes
lt_cv_sys_global_symbol_pipe='sed -n -e '\''s/^.*[    ]\([ABCDGIRSTW][ABCDGIRSTW]*\)[    ][    ]*\([_A-Za-z][_A-Za-z0-9]*\)$/\1 \2 \2/p'\'' | sed '\''/ __gnu_lto/d'\'''
lt_cv_sys_global_symbol_to_c_name_address='sed -n -e '\''s/^: \([^ ]*\)[ ]*$/  {\"\1\", (void *) 0},/p'\'' -e '\''s/^[ABCDGIRSTW]* \([^ ]*\) \([^ ]*\)$/  {"\2", (void *) \&\2},/p'\'''
lt_cv_sys_global_symbol_to_c_name_address_lib_prefix='sed -n -e '\''s/^: \([^ ]*\)[ ]*$/  {\"\1\", (void *) 0},/p'\'' -e '\''s/^[ABCDGIRSTW]* \([^ ]*\) \(lib[^ ]*\)$/  {"\2", (void *) \&\2},/p'\'' -e '\''s/^[ABCDGIRSTW]* \([^ ]*\) \([^ ]*\)$/  {"lib\2", (void *) \&\2},/p'\'''
lt_cv_sys_global_symbol_to_cdecl='sed -n -e '\''s/^T .* \(.*\)$/extern int \1();/p'\'' -e '\''s/^[ABCDGIRSTW]* .* \(.*\)$/extern char \1;/p'\'''
lt_cv_sys_max_cmd_len=1572864
lt_cv_to_host_file_cmd=func_convert_file_noop
lt_cv_to_tool_file_cmd=func_convert_file_noop
pkg_cv_LIBGSSDP_CFLAGS='-pthread -I/usr/include/libsoup-2.4 -I/usr/include/libxml2 -I/usr/include/glib-2.0 -I/usr/lib64/glib-2.0/include '
pkg_cv_LIBGSSDP_LIBS='-lsoup-2.4 -lgio-2.0 -lgobject-2.0 -lglib-2.0 '
pkg_cv_LIBGTK_CFLAGS='-pthread -I/usr/include/gtk-2.0 -I/usr/lib64/gtk-2.0/include -I/usr/include/pango-1.0 -I/usr/include/atk-1.0 -I/usr/include/cairo -I/usr/include/pixman-1 -I/usr/include/libdrm -I/usr/include/gdk-pixbuf-2.0 -I/usr/include/libpng15 -I/usr/include/pango-1.0 -I/usr/include/harfbuzz -I/usr/include/pango-1.0 -I/usr/include/glib-2.0 -I/usr/lib64/glib-2.0/include -I/usr/include/freetype2 '
pkg_cv_LIBGTK_LIBS='-lgtk-x11-2.0 -lgdk-x11-2.0 -lpangocairo-1.0 -latk-1.0 -lcairo -lgdk_pixbuf-2.0 -lgio-2.0 -lpangoft2-1.0 -lpango-1.0 -lgobject-2.0 -lglib-2.0 -lfreetype -lfontconfig '

## ----------------- ##
## Output variables. ##
## ----------------- ##

ACLOCAL='${SHELL} /var/tmp/portage/net-libs/gssdp-0.12.2.1/work/gssdp-0.12.2.1/build-aux/missing --run aclocal-1.11'
AMDEPBACKSLASH=''
AMDEP_FALSE=''
AMDEP_TRUE='#'
AMTAR='$${TAR-tar}'
AM_BACKSLASH='\'
AM_DEFAULT_V='$(AM_DEFAULT_VERBOSITY)'
AM_DEFAULT_VERBOSITY='0'
AM_V='$(V)'
AR='x86_64-pc-linux-gnu-ar'
AUTOCONF='${SHELL} /var/tmp/portage/net-libs/gssdp-0.12.2.1/work/gssdp-0.12.2.1/build-aux/missing --run autoconf'
AUTOHEADER='${SHELL} /var/tmp/portage/net-libs/gssdp-0.12.2.1/work/gssdp-0.12.2.1/build-aux/missing --run autoheader'
AUTOMAKE='${SHELL} /var/tmp/portage/net-libs/gssdp-0.12.2.1/work/gssdp-0.12.2.1/build-aux/missing --run automake-1.11'
AWK='gawk'
CC='x86_64-pc-linux-gnu-gcc'
CCDEPMODE='depmode=none'
CFLAGS='-march=core2 -O2 -pipe'
CPP='x86_64-pc-linux-gnu-gcc -E'
CPPFLAGS=''
CYGPATH_W='echo'
DEFS='-DHAVE_CONFIG_H'
DEPDIR='.deps'
DLLTOOL='false'
DSYMUTIL=''
DUMPBIN=''
ECHO_C=''
ECHO_N='-n'
ECHO_T=''
EGREP='/bin/grep -E'
ENABLE_GTK_DOC_FALSE=''
ENABLE_GTK_DOC_TRUE='#'
EXEEXT=''
FGREP='/bin/grep -F'
GLIB_GENMARSHAL='glib-genmarshal'
GREP='/bin/grep'
GTKDOC_CHECK='/usr/bin/gtkdoc-check'
GTKDOC_DEPS_CFLAGS=''
GTKDOC_DEPS_LIBS=''
GTKDOC_MKPDF='/usr/bin/gtkdoc-mkpdf'
GTKDOC_REBASE='/usr/bin/gtkdoc-rebase'
GTK_DOC_BUILD_HTML_FALSE='#'
GTK_DOC_BUILD_HTML_TRUE=''
GTK_DOC_BUILD_PDF_FALSE=''
GTK_DOC_BUILD_PDF_TRUE='#'
GTK_DOC_USE_LIBTOOL_FALSE='#'
GTK_DOC_USE_LIBTOOL_TRUE=''
GTK_DOC_USE_REBASE_FALSE='#'
GTK_DOC_USE_REBASE_TRUE=''
HAVE_INTROSPECTION_FALSE='#'
HAVE_INTROSPECTION_TRUE=''
HAVE_LIBGTK='yes'
HAVE_VAPIGEN_FALSE='#'
HAVE_VAPIGEN_TRUE=''
HTML_DIR='${datadir}/gtk-doc/html'
INSTALL_DATA='${INSTALL} -m 644'
INSTALL_PROGRAM='${INSTALL}'
INSTALL_SCRIPT='${INSTALL}'
INSTALL_STRIP_PROGRAM='$(install_sh) -c -s'
INTROSPECTION_CFLAGS='-pthread -I/usr/include/gobject-introspection-1.0 -I/usr/lib64/libffi-3.0.11/include -I/usr/include/glib-2.0 -I/usr/lib64/glib-2.0/include '
INTROSPECTION_COMPILER='/usr/bin/g-ir-compiler'
INTROSPECTION_GENERATE='/usr/bin/g-ir-generate'
INTROSPECTION_GIRDIR='/usr/share/gir-1.0'
INTROSPECTION_LIBS='-lgirepository-1.0 -lgobject-2.0 -lglib-2.0 '
INTROSPECTION_MAKEFILE='/usr/share/gobject-introspection-1.0/Makefile.introspection'
INTROSPECTION_SCANNER='/usr/bin/g-ir-scanner'
INTROSPECTION_TYPELIBDIR='/usr/lib64/girepository-1.0'
LD='/usr/x86_64-pc-linux-gnu/bin/ld -m elf_x86_64'
LDFLAGS='-Wl,-O1 -Wl,--as-needed'
LIBGSSDP_CFLAGS='-pthread -I/usr/include/libsoup-2.4 -I/usr/include/libxml2 -I/usr/include/glib-2.0 -I/usr/lib64/glib-2.0/include '
LIBGSSDP_LIBS='-lsoup-2.4 -lgio-2.0 -lgobject-2.0 -lglib-2.0 '
LIBGTK_CFLAGS='-pthread -I/usr/include/gtk-2.0 -I/usr/lib64/gtk-2.0/include -I/usr/include/pango-1.0 -I/usr/include/atk-1.0 -I/usr/include/cairo -I/usr/include/pixman-1 -I/usr/include/libdrm -I/usr/include/gdk-pixbuf-2.0 -I/usr/include/libpng15 -I/usr/include/pango-1.0 -I/usr/include/harfbuzz -I/usr/include/pango-1.0 -I/usr/include/glib-2.0 -I/usr/lib64/glib-2.0/include -I/usr/include/freetype2 '
LIBGTK_LIBS='-lgtk-x11-2.0 -lgdk-x11-2.0 -lpangocairo-1.0 -latk-1.0 -lcairo -lgdk_pixbuf-2.0 -lgio-2.0 -lpangoft2-1.0 -lpango-1.0 -lgobject-2.0 -lglib-2.0 -lfreetype -lfontconfig '
LIBOBJS=''
LIBS=''
LIBTOOL='$(SHELL) $(top_builddir)/libtool'
LIPO=''
LN_S='ln -s'
LTLIBOBJS=''
MAINT=''
MAINTAINER_MODE_FALSE='#'
MAINTAINER_MODE_TRUE=''
MAKEINFO='${SHELL} /var/tmp/portage/net-libs/gssdp-0.12.2.1/work/gssdp-0.12.2.1/build-aux/missing --run makeinfo'
MANIFEST_TOOL=':'
MKDIR_P='/bin/mkdir -p'
NM='/usr/bin/nm -B'
NMEDIT=''
OBJDUMP='x86_64-pc-linux-gnu-objdump'
OBJEXT='o'
OS_WIN32_FALSE=''
OS_WIN32_TRUE='#'
OTOOL64=''
OTOOL=''
PACKAGE='gssdp'
PACKAGE_BUGREPORT='http://bugzilla.gnome.org/enter_bug.cgi?product=gupnp&component=gssdp'
PACKAGE_NAME='gssdp'
PACKAGE_STRING='gssdp 0.12.2.1'
PACKAGE_TARNAME='gssdp'
PACKAGE_URL='http://www.gupnp.org/'
PACKAGE_VERSION='0.12.2.1'
PATH_SEPARATOR=':'
PKG_CONFIG='/usr/bin/x86_64-pc-linux-gnu-pkg-config'
PKG_CONFIG_LIBDIR=''
PKG_CONFIG_PATH='$PKG_CONFIG_PATH:/usr/local/lib/pkgconfig'
RANLIB='x86_64-pc-linux-gnu-ranlib'
SED='/bin/sed'
SET_MAKE=''
SHELL='/bin/sh'
STRIP='x86_64-pc-linux-gnu-strip'
USE_LIBGTK_FALSE='#'
USE_LIBGTK_TRUE=''
VAPIGEN='/usr/bin/vapigen-0.14'
VERSION='0.12.2.1'
ac_ct_AR=''
ac_ct_CC=''
ac_ct_DUMPBIN=''
am__EXEEXT_FALSE=''
am__EXEEXT_TRUE='#'
am__fastdepCC_FALSE=''
am__fastdepCC_TRUE='#'
am__include='include'
am__isrc=''
am__leading_dot='.'
am__nodep=''
am__quote=''
am__tar='tar --format=ustar -chf - "$$tardir"'
am__untar='tar -xf -'
bindir='${exec_prefix}/bin'
build='x86_64-pc-linux-gnu'
build_alias='x86_64-pc-linux-gnu'
build_cpu='x86_64'
build_os='linux-gnu'
build_vendor='pc'
datadir='/usr/share'
datarootdir='${prefix}/share'
docdir='${datarootdir}/doc/${PACKAGE_TARNAME}'
dvidir='${docdir}'
exec_prefix='${prefix}'
host='x86_64-pc-linux-gnu'
host_alias='x86_64-pc-linux-gnu'
host_cpu='x86_64'
host_os='linux-gnu'
host_vendor='pc'
htmldir='${docdir}'
includedir='${prefix}/include'
infodir='/usr/share/info'
install_sh='${SHELL} /var/tmp/portage/net-libs/gssdp-0.12.2.1/work/gssdp-0.12.2.1/build-aux/install-sh'
libdir='/usr/lib64'
libexecdir='${exec_prefix}/libexec'
localedir='${datarootdir}/locale'
localstatedir='/var/lib'
mandir='/usr/share/man'
mkdir_p='/bin/mkdir -p'
oldincludedir='/usr/include'
pdfdir='${docdir}'
prefix='/usr'
program_transform_name='s,x,x,'
psdir='${docdir}'
sbindir='${exec_prefix}/sbin'
sharedstatedir='${prefix}/com'
sysconfdir='/etc'
target_alias=''

## ----------- ##
## confdefs.h. ##
## ----------- ##

/* confdefs.h */
#define PACKAGE_NAME "gssdp"
#define PACKAGE_TARNAME "gssdp"
#define PACKAGE_VERSION "0.12.2.1"
#define PACKAGE_STRING "gssdp 0.12.2.1"
#define PACKAGE_BUGREPORT "http://bugzilla.gnome.org/enter_bug.cgi?product=gupnp&component=gssdp"
#define PACKAGE_URL "http://www.gupnp.org/"
#define PACKAGE "gssdp"
#define VERSION "0.12.2.1"
#define STDC_HEADERS 1
#define HAVE_SYS_TYPES_H 1
#define HAVE_SYS_STAT_H 1
#define HAVE_STDLIB_H 1
#define HAVE_STRING_H 1
#define HAVE_MEMORY_H 1
#define HAVE_STRINGS_H 1
#define HAVE_INTTYPES_H 1
#define HAVE_STDINT_H 1
#define HAVE_UNISTD_H 1
#define HAVE_DLFCN_H 1
#define LT_OBJDIR ".libs/"
#define HAVE_LIBGTK /**/

configure: exit 0
Back to top
View user's profile Send private message
quilosaq
l33t
l33t


Joined: 22 Dec 2009
Posts: 757

PostPosted: Fri Sep 13, 2013 11:32 pm    Post subject: Reply with quote

Try re-install vala (0.14):
Code:
(root)# emerge -pv --oneshot =dev-lang/vala-0.14*
Back to top
View user's profile Send private message
nordic bro
Guru
Guru


Joined: 25 Oct 2003
Posts: 560

PostPosted: Sat Sep 14, 2013 3:52 pm    Post subject: Reply with quote

thanks so much! your re-emerge suggestion has isolated the trouble. the problematic pkgs are installed, the rest of the gnome pkgs are installing and I've yet to hit another instance of op prob.

since not many pkgs have been getting merged due to constantly hitting the gir/vala aborts, when your suggestion to re-emerge succeeded I saw something like this (only appears at the end when something installs successfully):

Quote:
note that "/usr/share" is not in xdg* search path...

I checked both env.d/*xdg*, made sure "/usr/share" was there, reset env, uninst the older valas, installed 20.1 and it just blew through gssdp and installed it - hurray :)

I don't know why what config.log shows being found wasn't sufficient but after a week of going in circles I don't care, it's finally working.

thanks again for the help.
Back to top
View user's profile Send private message
Display posts from previous:   
Reply to topic    Gentoo Forums Forum Index Portage & Programming All times are GMT
Page 1 of 1

 
Jump to:  
You cannot post new topics in this forum
You cannot reply to topics in this forum
You cannot edit your posts in this forum
You cannot delete your posts in this forum
You cannot vote in polls in this forum