Gentoo Forums
Gentoo Forums
Gentoo Forums
Quick Search: in
dev-qt/qtwebkit failed to emerge
View unanswered posts
View posts from last 24 hours

 
Reply to topic    Gentoo Forums Forum Index Portage & Programming
View previous topic :: View next topic  
Author Message
Arcangelo
n00b
n00b


Joined: 18 Apr 2013
Posts: 2

PostPosted: Sun Jun 23, 2013 10:18 pm    Post subject: dev-qt/qtwebkit failed to emerge Reply with quote

Hi to everyone.

3 days ago I just started my adventure with Gentoo so I don't know to much.
I'm having now problem to emerge dev-qt/qtwebkit-4.8.4:4.
First thing - this is new system.
When I trigger full system update using this command -
Portage will try to emerge these packages:
emerge --pretend --verbose --update --deep --with-bdeps=y --newuse world

These are the packages that would be merged, in order:

Calculating dependencies... done!
[ebuild N ] dev-qt/qtwebkit-4.8.4:4 USE="exceptions jit (-aqua) -debug -gstreamer -icu -pch" 0 kB
[ebuild N ] media-libs/phonon-4.6.0-r1 USE="gstreamer (-aqua) -debug -pulseaudio -vlc (-zeitgeist)" 0 kB
[ebuild N ] sys-auth/polkit-0.110 USE="gtk introspection kde nls pam -examples (-selinux) (-systemd)" 0 kB
[ebuild N ] sys-auth/consolekit-0.4.5_p20120320-r1 USE="acl pam (policykit) -debug -doc (-selinux) {-test}" 0 kB
[ebuild N ] gnome-extra/polkit-gnome-0.105 0 kB
[ebuild R ] sys-auth/pambase-20101024-r2 USE="(consolekit*) cracklib sha512 -debug -gnome-keyring -minimal -mktemp -pam_krb5 -pam_ssh -passwdqc (-selinux)" 0 kB
[ebuild N ] sys-auth/polkit-qt-0.103.0 USE="-debug -examples" 0 kB
[ebuild N ] sys-power/upower-0.9.20-r2 USE="deprecated introspection -doc -ios (-systemd)" 0 kB
[ebuild N ] sys-fs/udisks-2.1.0:2 USE="crypt gptfdisk introspection -debug (-selinux) (-systemd)" 0 kB
[ebuild N ] kde-base/kdelibs-4.10.3-r2:4 USE="acl alsa bzip2 fam handbook mmx nls opengl (policykit) semantic-desktop spell sse sse2 ssl udev udisks upower -3dnow (-altivec) (-aqua) -debug -doc -jpeg2k -kerberos -lzma -openexr {-test} -zeroconf" 0 kB
[ebuild N ] sys-auth/polkit-kde-agent-0.99.0-r1:4 USE="(-aqua) -debug" LINGUAS="-ca -ca@valencia -cs -da -de -en_GB -eo -es -et -fi -fr -ga -gl -hr -hu -is -it -ja -km -lt -mai -ms -nb -nds -nl -pa -pt -pt_BR -ro -ru -sk -sr -sr@ijekavian -sr@ijekavianlatin -sr@latin -sv -th -tr -uk -zh_TW" 0 kB
[ebuild N ] kde-base/katepart-4.10.3:4 USE="handbook (-aqua) -debug" 0 kB
[ebuild N ] kde-misc/polkit-kde-kcmodules-0.98_pre20120917-r1:4 USE="(-aqua) -debug" 0 kB
[ebuild N ] kde-base/nepomuk-core-4.10.3:4 USE="exif pdf (-aqua) -debug -ffmpeg -taglib" 0 kB
[ebuild N ] kde-base/nepomuk-widgets-4.10.3:4 USE="(-aqua) -debug" 0 kB
[ebuild N ] kde-base/kdesu-4.10.3:4 USE="handbook (-aqua) -debug" 0 kB
[ebuild N ] kde-base/khelpcenter-4.10.3:4 USE="(-aqua) -debug" 0 kB
[ebuild N ] net-libs/libproxy-0.4.10-r1 USE="kde -gnome -mono -networkmanager -perl -python -spidermonkey {-test} -webkit" 0 kB
[ebuild N ] net-libs/glib-networking-2.32.3 USE="gnome libproxy ssl -smartcard {-test}" 0 kB
[ebuild N ] net-libs/libsoup-2.38.1:2.4 USE="introspection ssl -debug -samba {-test}" 0 kB
[ebuild N ] media-plugins/gst-plugins-soup-0.10.31:0.10 0 kB
[ebuild N ] media-libs/phonon-gstreamer-4.6.3 USE="alsa network -debug" 0 kB
[ebuild R ] net-misc/openssh-5.9_p1-r4 USE="X hpn ldap pam tcpd -X509 -bindist -kerberos -libedit* (-selinux) -skey -static" 0 kB

Total: 23 packages (21 new, 2 reinstalls), Size of downloads: 0 kB



As a first is qtwebkit and is failing on it.
Please help.
I am using profile - desktop/kde
/etc/portage/make.conf
# These settings were set by the catalyst build script that automatically
# built this stage.
# Please consult /usr/share/portage/config/make.conf.example for a more
# detailed example.
CFLAGS="-O2 -pipe"
CXXFLAGS="${CFLAGS}"
# WARNING: Changing your CHOST is not something that should be done lightly.
# Please consult http://www.gentoo.org/doc/en/change-chost.xml before changing.
CHOST="x86_64-pc-linux-gnu"
# These are the USE flags that were used in addition to what is provided by the
# profile used for building.
FEATURES="userfetch"
MAKEOPTS="--jobs 14 --load-average 40"
LINGUAS="en"
USE="cxx smp qt4"

emerge --info
Portage 2.1.12.2 (default/linux/amd64/13.0/desktop/kde, gcc-4.6.3, glibc-2.15-r3, 3.2.0-36-generic x86_64)
=================================================================
System uname: Linux-3.2.0-36-generic-x86_64-Intel-R-_Core-TM-_i7_CPU_K_875_@_2.93GHz-with-gentoo-2.2
KiB Mem: 12297028 total, 3039624 free
KiB Swap: 15624996 total, 15621536 free
Timestamp of tree: Sat, 22 Jun 2013 21:30:01 +0000
ld GNU ld (GNU Binutils) 2.22
app-shells/bash: 4.2_p45
dev-lang/python: 2.7.3-r3, 3.2.3-r2
dev-util/cmake: 2.8.10.2-r2
dev-util/pkgconfig: 0.28
sys-apps/baselayout: 2.2
sys-apps/openrc: 0.11.8
sys-apps/sandbox: 2.5
sys-devel/autoconf: 2.13, 2.69
sys-devel/automake: 1.10.3, 1.11.6, 1.12.6
sys-devel/binutils: 2.22-r1
sys-devel/gcc: 4.6.3
sys-devel/gcc-config: 1.7.3
sys-devel/libtool: 2.4-r1
sys-devel/make: 3.82-r4
sys-kernel/linux-headers: 3.7 (virtual/os-headers)
sys-libs/glibc: 2.15-r3
Repositories: gentoo
ACCEPT_KEYWORDS="amd64"
ACCEPT_LICENSE="* -@EULA"
CBUILD="x86_64-pc-linux-gnu"
CFLAGS="-O2 -pipe"
CHOST="x86_64-pc-linux-gnu"
CONFIG_PROTECT="/etc /usr/share/config /usr/share/gnupg/qualified.txt"
CONFIG_PROTECT_MASK="/etc/ca-certificates.conf /etc/env.d /etc/fonts/fonts.conf /etc/gconf /etc/gentoo-release /etc/revdep-rebuild /etc/sandbox.d /etc/terminfo"
CXXFLAGS="-O2 -pipe"
DISTDIR="/usr/portage/distfiles"
FCFLAGS="-O2 -pipe"
FEATURES="assume-digests binpkg-logs config-protect-if-modified distlocks ebuild-locks fixlafiles merge-sync news parallel-fetch preserve-libs protect-owned sandbox sfperms strict unknown-features-warn unmerge-logs unmerge-orphans userfetch"
FFLAGS="-O2 -pipe"
GENTOO_MIRRORS="http://distfiles.gentoo.org"
LANG="en_GB.UTF-8"
LDFLAGS="-Wl,-O1 -Wl,--as-needed"
MAKEOPTS="--jobs 14 --load-average 40"
PKGDIR="/usr/portage/packages"
PORTAGE_CONFIGROOT="/"
PORTAGE_RSYNC_OPTS="--recursive --links --safe-links --perms --times --compress --force --whole-file --delete --stats --human-readable --timeout=180 --exclude=/distfiles --exclude=/local --exclude=/packages"
PORTAGE_TMPDIR="/var/tmp"
PORTDIR="/usr/portage"
PORTDIR_OVERLAY=""
SYNC="rsync://rsync.gentoo.org/gentoo-portage"
USE="X a52 aac acl acpi alsa amd64 berkdb bluetooth branding bzip2 cairo cdda cdr cli consolekit cracklib crypt cups cxx dbus declarative dri dts dvd dvdr emboss encode exif fam firefox flac fortran gdbm gif gpm gtk iconv ipv6 jpeg kde kipi lcms ldap libnotify mad mmx mng modules mp3 mp4 mpeg mudflap multilib ncurses nls nptl ogg opengl openmp pam pango pcre pdf phonon plasma png policykit ppds qt3support qt4 readline sdl semantic-desktop session smp spell sse sse2 ssl startup-notification svg tcpd tiff truetype udev udisks unicode upower usb vorbis wxwidgets x264 xcb xcomposite xinerama xml xscreensaver xv xvid zlib" ABI_X86="64" ALSA_CARDS="ali5451 als4000 atiixp atiixp-modem bt87x ca0106 cmipci emu10k1x ens1370 ens1371 es1938 es1968 fm801 hda-intel intel8x0 intel8x0m maestro3 trident usb-audio via82xx via82xx-modem ymfpci" APACHE2_MODULES="authn_core authz_core socache_shmcb unixd actions alias auth_basic authn_alias authn_anon authn_dbm authn_default authn_file authz_dbm authz_default authz_groupfile authz_host authz_owner authz_user autoindex cache cgi cgid dav dav_fs dav_lock deflate dir disk_cache env expires ext_filter file_cache filter headers include info log_config logio mem_cache mime mime_magic negotiation rewrite setenvif speling status unique_id userdir usertrack vhost_alias" CALLIGRA_FEATURES="kexi words flow plan sheets stage tables krita karbon braindump author" CAMERAS="ptp2" COLLECTD_PLUGINS="df interface irq load memory rrdtool swap syslog" ELIBC="glibc" GPSD_PROTOCOLS="ashtech aivdm earthmate evermore fv18 garmin garmintxt gpsclock itrax mtk3301 nmea ntrip navcom oceanserver oldstyle oncore rtcm104v2 rtcm104v3 sirf superstar2 timing tsip tripmate tnt ubx" INPUT_DEVICES="keyboard mouse evdev" KERNEL="linux" LCD_DEVICES="bayrad cfontz cfontz633 glk hd44780 lb216 lcdm001 mtxorb ncurses text" LIBREOFFICE_EXTENSIONS="presenter-console presenter-minimizer" LINGUAS="en" OFFICE_IMPLEMENTATION="libreoffice" PHP_TARGETS="php5-3" PYTHON_SINGLE_TARGET="python2_7" PYTHON_TARGETS="python2_7 python3_2" RUBY_TARGETS="ruby19 ruby18" USERLAND="GNU" VIDEO_CARDS="fbdev glint intel mach64 mga nouveau nv r128 radeon savage sis tdfx trident vesa via vmware dummy v4l" XTABLES_ADDONS="quota2 psd pknock lscan length2 ipv4options ipset ipp2p iface geoip fuzzy condition tee tarpit sysrq steal rawnat logmark ipmark dhcpmac delude chaos account"
Unset: CPPFLAGS, CTARGET, EMERGE_DEFAULT_OPTS, INSTALL_MASK, LC_ALL, PORTAGE_BUNZIP2_COMMAND, PORTAGE_COMPRESS, PORTAGE_COMPRESS_FLAGS, PORTAGE_RSYNC_EXTRA_OPTS, USE_PYTHON


I hope that someone can help me to go through this.

Many thanks
Back to top
View user's profile Send private message
DONAHUE
Watchman
Watchman


Joined: 09 Dec 2006
Posts: 6254
Location: Goose Creek SC

PostPosted: Sun Jun 23, 2013 11:13 pm    Post subject: Reply with quote

if qtwebkit started to emerge, we need to see why emerge failed
Code:
emerge wgetpaste
wgetpaste /var/tmp/dev-qt/portage/dev-qt/qtwebkit/temp/build.log
post the url returned.
If emerge never started, portage gave a list of problems and we need to see that list
_________________
Defund the FCC.
Back to top
View user's profile Send private message
Arcangelo
n00b
n00b


Joined: 18 Apr 2013
Posts: 2

PostPosted: Mon Jun 24, 2013 6:14 am    Post subject: Reply with quote

I hope this build log will bring some light


 * Package: dev-qt/qtwebkit-4.8.4
 * Repository: gentoo
 * Maintainer: qt@gentoo.org
 * Upstream: https://bugreports.qt-project.org/
 * USE: abi_x86_64 amd64 consolekit elibc_glibc exceptions gstreamer jit kernel_linux multilib policykit userland_GNU
 * FEATURES: nostrip preserve-libs sandbox
>>> Unpacking source...
* Unpacking parts of qt-everywhere-opensource-src-4.8.4.tar.gz: configure LICENSE.GPL3 LICENSE.LGPL projects.pro src/qbase.pri src/qt_targets.pri src/qt_install.pri bin config.tests mkspecs qmake include src tools ...
 [ ok ]
>>> Source unpacked in /var/tmp/portage/dev-qt/qtwebkit-4.8.4/work
>>> Preparing source in /var/tmp/portage/dev-qt/qtwebkit-4.8.4/work/qt-everywhere-opensource-src-4.8.4 ...
* Applying qtwebkit-4.8.1-no-use-ld-gold.patch ...
 [ ok ]
* Applying 4.8.2-javascriptcore-x32.patch ...
 [ ok ]
>>> Source prepared.
>>> Configuring source in /var/tmp/portage/dev-qt/qtwebkit-4.8.4/work/qt-everywhere-opensource-src-4.8.4 ...
./configure -prefix /usr -bindir /usr/bin -libdir /usr/lib64/qt4 -docdir /usr/share/doc/qt-4.8.4 -headerdir /usr/include/qt4 -plugindir /usr/lib64/qt4/plugins -importdir /usr/lib64/qt4/imports -datadir /usr/share/qt4 -translationdir /usr/share/qt4/translations -sysconfdir /etc/qt4 -examplesdir /usr/share/qt4/examples -demosdir /usr/share/qt4/demos -opensource -confirm-license -shared -fast -largefile -stl -verbose -nomake examples -nomake demos -arch x86_64 -platform linux-g++ -L/usr/lib64 -release -no-separate-debug-info -exceptions -no-rpath -no-pch -reduce-relocations -I/usr/include/freetype2 -webkit -system-sqlite -no-icu -javascript-jit
Determining system architecture... (Linux:3.2.0-36-generic:x86_64)
64-bit AMD 80x86 (x86_64)
'x86_64' is supported
System architecture: 'x86_64'
Symbol visibility control enabled.
Symbolic function binding enabled.

This is the Open Source Edition.

You are licensed to use this software under the terms of
the Lesser GNU General Public License (LGPL) versions 2.1.
You are also licensed to use this software under the terms of
the GNU General Public License (GPL) versions 3.

You have already accepted the terms of the license.

floatmath auto-detection... ()
x86_64-pc-linux-gnu-g++ -c -pipe -O2 -pipe -O2 -Wall -W -I../../../mkspecs/linux-g++ -I. -I/usr/include/freetype2 -o floatmath.o floatmath.cpp
floatmath.cpp:44:5: warning: unused parameter ‘argc’ [-Wunused-parameter]
floatmath.cpp:44:5: warning: unused parameter ‘argv’ [-Wunused-parameter]
x86_64-pc-linux-gnu-g++ -Wl,-O1 -Wl,--as-needed -Wl,-O1 -o floatmath floatmath.o -L/usr/lib64
floatmath enabled.
mmx auto-detection... ()
x86_64-pc-linux-gnu-g++ -c -pipe -mmmx -O2 -pipe -O2 -Wall -W -I../../../mkspecs/linux-g++ -I. -I/usr/include/freetype2 -o mmx.o mmx.cpp
x86_64-pc-linux-gnu-g++ -Wl,-O1 -Wl,--as-needed -Wl,-O1 -o mmx mmx.o -L/usr/lib64 -mmmx
mmx enabled.
3dnow auto-detection... ()
x86_64-pc-linux-gnu-g++ -c -pipe -m3dnow -O2 -pipe -O2 -Wall -W -I../../../mkspecs/linux-g++ -I. -I/usr/include/freetype2 -o 3dnow.o 3dnow.cpp
x86_64-pc-linux-gnu-g++ -Wl,-O1 -Wl,--as-needed -Wl,-O1 -o 3dnow 3dnow.o -L/usr/lib64 -m3dnow
3dnow enabled.
sse auto-detection... ()
x86_64-pc-linux-gnu-g++ -c -pipe -msse -O2 -pipe -O2 -Wall -W -I../../../mkspecs/linux-g++ -I. -I/usr/include/freetype2 -o sse.o sse.cpp
x86_64-pc-linux-gnu-g++ -Wl,-O1 -Wl,--as-needed -Wl,-O1 -o sse sse.o -L/usr/lib64 -msse
sse enabled.
sse2 auto-detection... ()
x86_64-pc-linux-gnu-g++ -c -pipe -msse2 -O2 -pipe -O2 -Wall -W -I../../../mkspecs/linux-g++ -I. -I/usr/include/freetype2 -o sse2.o sse2.cpp
x86_64-pc-linux-gnu-g++ -Wl,-O1 -Wl,--as-needed -Wl,-O1 -o sse2 sse2.o -L/usr/lib64 -msse2
sse2 enabled.
sse3 auto-detection... ()
x86_64-pc-linux-gnu-g++ -c -pipe -msse3 -O2 -pipe -O2 -Wall -W -I../../../mkspecs/linux-g++ -I. -I/usr/include/freetype2 -o sse3.o sse3.cpp
x86_64-pc-linux-gnu-g++ -Wl,-O1 -Wl,--as-needed -Wl,-O1 -o sse3 sse3.o -L/usr/lib64 -msse3
sse3 enabled.
ssse3 auto-detection... ()
x86_64-pc-linux-gnu-g++ -c -pipe -mssse3 -O2 -pipe -O2 -Wall -W -I../../../mkspecs/linux-g++ -I. -I/usr/include/freetype2 -o ssse3.o ssse3.cpp
x86_64-pc-linux-gnu-g++ -Wl,-O1 -Wl,--as-needed -Wl,-O1 -o ssse3 ssse3.o -L/usr/lib64 -mssse3
ssse3 enabled.
sse4_1 auto-detection... ()
x86_64-pc-linux-gnu-g++ -c -pipe -msse4.1 -O2 -pipe -O2 -Wall -W -I../../../mkspecs/linux-g++ -I. -I/usr/include/freetype2 -o sse4_1.o sse4_1.cpp
x86_64-pc-linux-gnu-g++ -Wl,-O1 -Wl,--as-needed -Wl,-O1 -o sse4_1 sse4_1.o -L/usr/lib64 -msse4.1
sse4_1 enabled.
sse4_2 auto-detection... ()
x86_64-pc-linux-gnu-g++ -c -pipe -msse4.2 -O2 -pipe -O2 -Wall -W -I../../../mkspecs/linux-g++ -I. -I/usr/include/freetype2 -o sse4_2.o sse4_2.cpp
x86_64-pc-linux-gnu-g++ -Wl,-O1 -Wl,--as-needed -Wl,-O1 -o sse4_2 sse4_2.o -L/usr/lib64 -msse4.2
sse4_2 enabled.
avx auto-detection... ()
x86_64-pc-linux-gnu-g++ -c -pipe -mavx -O2 -pipe -O2 -Wall -W -I../../../mkspecs/linux-g++ -I. -I/usr/include/freetype2 -o avx.o avx.cpp
x86_64-pc-linux-gnu-g++ -Wl,-O1 -Wl,--as-needed -Wl,-O1 -o avx avx.o -L/usr/lib64 -mavx
avx enabled.
ipc_sysv auto-detection... ()
x86_64-pc-linux-gnu-g++ -c -pipe -O2 -pipe -O2 -Wall -W -I../../../mkspecs/linux-g++ -I. -I/usr/include/freetype2 -o ipc.o ipc.cpp
x86_64-pc-linux-gnu-g++ -Wl,-O1 -Wl,--as-needed -Wl,-O1 -o ipc_sysv ipc.o -L/usr/lib64
ipc_sysv enabled.
zlib auto-detection... ()
x86_64-pc-linux-gnu-g++ -c -pipe -O2 -pipe -O2 -Wall -W -I../../../mkspecs/linux-g++ -I. -I/usr/include/freetype2 -o zlib.o zlib.cpp
zlib.cpp: In function ‘int main(int, char**)’:
zlib.cpp:46:15: warning: variable ‘stream’ set but not used [-Wunused-but-set-variable]
zlib.cpp:48:17: warning: variable ‘ver’ set but not used [-Wunused-but-set-variable]
zlib.cpp:51:9: warning: variable ‘res’ set but not used [-Wunused-but-set-variable]
x86_64-pc-linux-gnu-g++ -Wl,-O1 -Wl,--as-needed -Wl,-O1 -o zlib zlib.o -L/usr/lib64 -lz
zlib enabled.
libjpeg auto-detection... ()
x86_64-pc-linux-gnu-g++ -c -pipe -O2 -pipe -O2 -Wall -W -I../../../mkspecs/linux-g++ -I. -I/usr/include/freetype2 -o libjpeg.o libjpeg.cpp
libjpeg.cpp: In function ‘int main(int, char**)’:
libjpeg.cpp:51:32: warning: ‘cinfo’ is used uninitialized in this function [-Wuninitialized]
x86_64-pc-linux-gnu-g++ -Wl,-O1 -Wl,--as-needed -Wl,-O1 -o libjpeg libjpeg.o -L/usr/lib64 -ljpeg
libjpeg enabled.
libtiff auto-detection... ()
x86_64-pc-linux-gnu-g++ -c -pipe -O2 -pipe -O2 -Wall -W -I../../../mkspecs/linux-g++ -I. -I/usr/include/freetype2 -o libtiff.o libtiff.cpp
x86_64-pc-linux-gnu-g++ -Wl,-O1 -Wl,--as-needed -Wl,-O1 -o libtiff libtiff.o -L/usr/lib64 -ltiff
libtiff enabled.
libmng auto-detection... ()
x86_64-pc-linux-gnu-g++ -c -pipe -O2 -pipe -O2 -Wall -W -I../../../mkspecs/linux-g++ -I. -I/usr/include/freetype2 -o libmng.o libmng.cpp
x86_64-pc-linux-gnu-g++ -Wl,-O1 -Wl,--as-needed -Wl,-O1 -o libmng libmng.o -L/usr/lib64 -lmng
libmng enabled.
libpng auto-detection... ()
x86_64-pc-linux-gnu-g++ -c -pipe -O2 -pipe -O2 -Wall -W -I../../../mkspecs/linux-g++ -I. -I/usr/include/freetype2 -o libpng.o libpng.cpp
libpng.cpp: In function ‘int main(int, char**)’:
libpng.cpp:50:17: warning: variable ‘png_ptr’ set but not used [-Wunused-but-set-variable]
x86_64-pc-linux-gnu-g++ -Wl,-O1 -Wl,--as-needed -Wl,-O1 -o libpng libpng.o -L/usr/lib64 -lpng
libpng enabled.
DB2 auto-detection... ()
x86_64-pc-linux-gnu-g++ -c -pipe -O2 -pipe -O2 -Wall -W -I../../../mkspecs/linux-g++ -I. -I/usr/include/freetype2 -o db2.o db2.cpp
db2.cpp:42:20: fatal error: sqlcli.h: No such file or directory
compilation terminated.
gmake: *** [db2.o] Error 1
DB2 disabled.
InterBase auto-detection... ()
x86_64-pc-linux-gnu-g++ -c -pipe -O2 -pipe -O2 -Wall -W -I../../../mkspecs/linux-g++ -I. -I/usr/include/freetype2 -o ibase.o ibase.cpp
ibase.cpp:42:19: fatal error: ibase.h: No such file or directory
compilation terminated.
gmake: *** [ibase.o] Error 1
InterBase disabled.
MySQL (thread-safe) auto-detection... ()
x86_64-pc-linux-gnu-g++ -c -pipe -O2 -pipe -O2 -Wall -W -I../../../mkspecs/linux-g++ -I. -I/usr/include/mysql -I/usr/include/freetype2 -o mysql.o ../mysql/mysql.cpp
x86_64-pc-linux-gnu-g++ -Wl,-O1 -Wl,--as-needed -Wl,-O1 -o mysql_r mysql.o -L/usr/lib64/mysql -L/usr//lib64 -lz -lpthread -lcrypt -lnsl -lm -L/usr/lib64/ -lssl -lcrypto -L/usr/lib64 -lmysqlclient_r
MySQL (thread-safe) enabled.
OCI auto-detection... ()
x86_64-pc-linux-gnu-g++ -c -pipe -O2 -pipe -O2 -Wall -W -I../../../mkspecs/linux-g++ -I. -I/usr/include/freetype2 -o oci.o oci.cpp
oci.cpp:42:17: fatal error: oci.h: No such file or directory
compilation terminated.
gmake: *** [oci.o] Error 1
OCI disabled.
ODBC auto-detection... ()
x86_64-pc-linux-gnu-g++ -c -pipe -O2 -pipe -O2 -Wall -W -I../../../mkspecs/linux-g++ -I. -I/usr/include/freetype2 -o odbc.o odbc.cpp
odbc.cpp:45:17: fatal error: sql.h: No such file or directory
compilation terminated.
gmake: *** [odbc.o] Error 1
ODBC disabled.
iODBC auto-detection... ()
x86_64-pc-linux-gnu-g++ -c -pipe -O2 -pipe -O2 -Wall -W -I../../../mkspecs/linux-g++ -I. -I/usr/include/freetype2 -o iodbc.o iodbc.cpp
iodbc.cpp:42:17: fatal error: sql.h: No such file or directory
compilation terminated.
gmake: *** [iodbc.o] Error 1
iODBC disabled.
PostgreSQL auto-detection... ()
x86_64-pc-linux-gnu-g++ -c -pipe -O2 -pipe -O2 -Wall -W -I../../../mkspecs/linux-g++ -I. -I/usr/include/freetype2 -o psql.o psql.cpp
psql.cpp:42:22: fatal error: libpq-fe.h: No such file or directory
compilation terminated.
gmake: *** [psql.o] Error 1
PostgreSQL disabled.
SQLite auto-detection... ()
x86_64-pc-linux-gnu-g++ -c -pipe -O2 -pipe -O2 -Wall -W -I../../../mkspecs/linux-g++ -I. -I/usr/include/freetype2 -o sqlite.o sqlite.cpp
x86_64-pc-linux-gnu-g++ -Wl,-O1 -Wl,--as-needed -Wl,-O1 -o sqlite sqlite.o -lsqlite3 -L/usr/lib64
SQLite enabled.
SQLite2 auto-detection... ()
x86_64-pc-linux-gnu-g++ -c -pipe -O2 -pipe -O2 -Wall -W -I../../../mkspecs/linux-g++ -I. -I/usr/include/freetype2 -o sqlite2.o sqlite2.cpp
sqlite2.cpp:42:20: fatal error: sqlite.h: No such file or directory
compilation terminated.
gmake: *** [sqlite2.o] Error 1
SQLite2 disabled.
unknown SQL driver: sqlite_symbian
unknown SQL driver: symsql
TDS auto-detection... ()
x86_64-pc-linux-gnu-g++ -c -pipe -O2 -pipe -O2 -Wall -W -I../../../mkspecs/linux-g++ -I. -I/usr/include/freetype2 -o tds.o tds.cpp
tds.cpp:42:22: fatal error: sybfront.h: No such file or directory
compilation terminated.
gmake: *** [tds.o] Error 1
TDS disabled.
NIS auto-detection... ()
x86_64-pc-linux-gnu-g++ -c -pipe -O2 -pipe -O2 -Wall -W -I../../../mkspecs/linux-g++ -I. -I/usr/include/freetype2 -o nis.o nis.cpp
x86_64-pc-linux-gnu-g++ -Wl,-O1 -Wl,--as-needed -Wl,-O1 -o nis nis.o -L/usr/lib64 -lnsl
NIS enabled.
Cups auto-detection... ()
x86_64-pc-linux-gnu-g++ -c -pipe -O2 -pipe -O2 -Wall -W -I../../../mkspecs/linux-g++ -I. -I/usr/include/freetype2 -o cups.o cups.cpp
x86_64-pc-linux-gnu-g++ -Wl,-O1 -Wl,--as-needed -Wl,-O1 -o cups cups.o -L/usr/lib64 -lcups
Cups enabled.
POSIX iconv auto-detection... ()
x86_64-pc-linux-gnu-g++ -c -pipe -O2 -pipe -O2 -Wall -W -I../../../mkspecs/linux-g++ -I. -I/usr/include/freetype2 -o iconv.o iconv.cpp
x86_64-pc-linux-gnu-g++ -Wl,-O1 -Wl,--as-needed -Wl,-O1 -o iconv iconv.o -L/usr/lib64
POSIX iconv enabled.
D-Bus auto-detection... ()
x86_64-pc-linux-gnu-g++ -c -pipe -O2 -pipe -O2 -Wall -W -I../../../mkspecs/linux-g++ -I. -I/usr/include/freetype2 -I/usr/include/dbus-1.0 -I/usr/lib64/dbus-1.0/include -o dbus.o dbus.cpp
x86_64-pc-linux-gnu-g++ -Wl,-O1 -Wl,--as-needed -Wl,-O1 -o dbus dbus.o -L/usr/lib64 -ldbus-1
D-Bus enabled.
Glib auto-detection... ()
x86_64-pc-linux-gnu-g++ -c -pipe -O2 -pipe -O2 -Wall -W -I../../../mkspecs/linux-g++ -I. -I/usr/include/freetype2 -I/usr/include/glib-2.0 -I/usr/lib64/glib-2.0/include -o glib.o glib.cpp
glib.cpp: In function ‘int main(int, char**)’:
glib.cpp:48:19: warning: variable ‘context’ set but not used [-Wunused-but-set-variable]
glib.cpp:55:38: warning: ‘pollfd’ is used uninitialized in this function [-Wuninitialized]
x86_64-pc-linux-gnu-g++ -Wl,-O1 -Wl,--as-needed -Wl,-O1 -o glib glib.o -L/usr/lib64 -pthread -lgthread-2.0 -lrt -lglib-2.0
Glib enabled.
GStreamer auto-detection... ()
x86_64-pc-linux-gnu-g++ -c -pipe -O2 -pipe -O2 -Wall -W -I../../../mkspecs/linux-g++ -I. -I/usr/include/freetype2 -I/usr/include/gstreamer-0.10 -I/usr/include/glib-2.0 -I/usr/lib64/glib-2.0/include -I/usr/include/libxml2 -o gstreamer.o gstreamer.cpp
gstreamer.cpp:53:5: warning: unused parameter ‘argc’ [-Wunused-parameter]
gstreamer.cpp:53:5: warning: unused parameter ‘argv’ [-Wunused-parameter]
x86_64-pc-linux-gnu-g++ -Wl,-O1 -Wl,--as-needed -Wl,-O1 -o gstreamer gstreamer.o -L/usr/lib64 -pthread -lgstreamer-0.10 -lgobject-2.0 -lgmodule-2.0 -lrt -lgthread-2.0 -lglib-2.0 -lxml2 -lgstinterfaces-0.10 -lgstvideo-0.10 -lgstbase-0.10
GStreamer enabled.
ICD auto-detection... ()
x86_64-pc-linux-gnu-g++ -c -pipe -O2 -pipe -O2 -Wall -W -I../../../mkspecs/linux-g++ -I. -I/usr/include/freetype2 -o icd.o icd.cpp
icd.cpp:42:22: fatal error: wlancond.h: No such file or directory
compilation terminated.
gmake: *** [icd.o] Error 1
ICD disabled.
PulseAudio auto-detection... ()
x86_64-pc-linux-gnu-g++ -c -pipe -O2 -pipe -O2 -Wall -W -I../../../mkspecs/linux-g++ -I. -I/usr/include/freetype2 -o pulseaudio.o pulseaudio.cpp
pulseaudio.cpp:42:30: fatal error: pulse/pulseaudio.h: No such file or directory
compilation terminated.
gmake: *** [pulseaudio.o] Error 1
PulseAudio disabled.
Detecting broken X11 headers... (/var/tmp/portage/dev-qt/qtwebkit-4.8.4/work/qt-everywhere-opensource-src-4.8.4/mkspecs/linux-g++ yes /var/tmp/portage/dev-qt/qtwebkit-4.8.4/work/qt-everywhere-opensource-src-4.8.4 /var/tmp/portage/dev-qt/qtwebkit-4.8.4/work/qt-everywhere-opensource-src-4.8.4)
X11 headers look good.
XLib auto-detection... ()
x86_64-pc-linux-gnu-g++ -c -pipe -O2 -pipe -O2 -Wall -W -I../../../mkspecs/linux-g++ -I. -I/usr/include/freetype2 -I/usr/X11R6/include -o xlib.o xlib.cpp
x86_64-pc-linux-gnu-g++ -Wl,-O1 -Wl,--as-needed -Wl,-O1 -o xlib xlib.o -L/usr/X11R6/lib -L/usr/lib64 -lXext -lX11 -lm
XLib enabled.
OpenGL auto-detection... ()
x86_64-pc-linux-gnu-g++ -c -pipe -O2 -pipe -O2 -Wall -W -I../../../mkspecs/linux-g++ -I. -I/usr/include/freetype2 -I/usr/X11R6/include -I/usr/X11R6/include -o opengl.o opengl.cpp
opengl.cpp: In function ‘int main(int, char**)’:
opengl.cpp:46:12: warning: variable ‘x’ set but not used [-Wunused-but-set-variable]
x86_64-pc-linux-gnu-g++ -Wl,-O1 -Wl,--as-needed -Wl,-O1 -o opengl opengl.o -L/usr/X11R6/lib -L/usr/lib64 -lGL -lXext -lX11 -lm
OpenGL enabled.
Xcursor auto-detection... ()
x86_64-pc-linux-gnu-g++ -c -pipe -O2 -pipe -O2 -Wall -W -I../../../mkspecs/linux-g++ -I. -I/usr/include/freetype2 -I/usr/X11R6/include -o xcursor.o xcursor.cpp
xcursor.cpp: In function ‘int main(int, char**)’:
xcursor.cpp:61:19: warning: variable ‘image’ set but not used [-Wunused-but-set-variable]
xcursor.cpp:63:21: warning: variable ‘cursors’ set but not used [-Wunused-but-set-variable]
x86_64-pc-linux-gnu-g++ -Wl,-O1 -Wl,--as-needed -Wl,-O1 -o xcursor xcursor.o -L/usr/X11R6/lib -L/usr/lib64 -lXcursor -lXext -lX11 -lm
Xcursor enabled.
Xfixes auto-detection... ()
x86_64-pc-linux-gnu-g++ -c -pipe -O2 -pipe -O2 -Wall -W -I../../../mkspecs/linux-g++ -I. -I/usr/include/freetype2 -I/usr/X11R6/include -o xfixes.o xfixes.cpp
xfixes.cpp: In function ‘int main(int, char**)’:
xfixes.cpp:51:32: warning: variable ‘event’ set but not used [-Wunused-but-set-variable]
x86_64-pc-linux-gnu-g++ -Wl,-O1 -Wl,--as-needed -Wl,-O1 -o xfixes xfixes.o -L/usr/X11R6/lib -L/usr/lib64 -lXext -lX11 -lm
Xfixes enabled.
Xrandr auto-detection... ()
x86_64-pc-linux-gnu-g++ -c -pipe -O2 -pipe -O2 -Wall -W -I../../../mkspecs/linux-g++ -I. -I/usr/include/freetype2 -I/usr/X11R6/include -o xrandr.o xrandr.cpp
xrandr.cpp: In function ‘int main(int, char**)’:
xrandr.cpp:51:20: warning: variable ‘size’ set but not used [-Wunused-but-set-variable]
x86_64-pc-linux-gnu-g++ -Wl,-O1 -Wl,--as-needed -Wl,-O1 -o xrandr xrandr.o -L/usr/X11R6/lib -L/usr/lib64 -lXrender -lXrandr -lXext -lX11 -lm
Xrandr enabled.
Xrender auto-detection... ()
x86_64-pc-linux-gnu-g++ -c -pipe -O2 -pipe -O2 -Wall -W -I../../../mkspecs/linux-g++ -I. -I/usr/include/freetype2 -I/usr/X11R6/include -o xrender.o xrender.cpp
xrender.cpp: In function ‘int main(int, char**)’:
xrender.cpp:50:24: warning: variable ‘format’ set but not used [-Wunused-but-set-variable]
x86_64-pc-linux-gnu-g++ -Wl,-O1 -Wl,--as-needed -Wl,-O1 -o xrender xrender.o -L/usr/X11R6/lib -L/usr/lib64 -lXrender -lXext -lX11 -lm
Xrender enabled.
mitshm auto-detection... ()
x86_64-pc-linux-gnu-g++ -c -pipe -O2 -pipe -O2 -Wall -W -I../../../mkspecs/linux-g++ -I. -I/usr/include/freetype2 -I/usr/X11R6/include -o mitshm.o mitshm.cpp
x86_64-pc-linux-gnu-g++ -Wl,-O1 -Wl,--as-needed -Wl,-O1 -o mitshm mitshm.o -L/usr/X11R6/lib -L/usr/lib64 -lXext -lXext -lX11 -lm
mitshm enabled.
FontConfig auto-detection... ()
x86_64-pc-linux-gnu-g++ -c -pipe -O2 -pipe -O2 -Wall -W -I../../../mkspecs/linux-g++ -I. -I/usr/include/freetype2 -I/usr/X11R6/include -o fontconfig.o fontconfig.cpp
fontconfig.cpp: In function ‘int main(int, char**)’:
fontconfig.cpp:56:13: warning: variable ‘face’ set but not used [-Wunused-but-set-variable]
fontconfig.cpp:58:16: warning: variable ‘pattern’ set but not used [-Wunused-but-set-variable]
x86_64-pc-linux-gnu-g++ -Wl,-O1 -Wl,--as-needed -Wl,-O1 -o fontconfig fontconfig.o -L/usr/X11R6/lib -L/usr/lib64 -lfreetype -lfontconfig -lXext -lX11 -lm
FontConfig enabled.
Session Management auto-detection... ()
x86_64-pc-linux-gnu-g++ -c -pipe -O2 -pipe -O2 -Wall -W -I../../../mkspecs/linux-g++ -I. -I/usr/include/freetype2 -I/usr/X11R6/include -o sm.o sm.cpp
sm.cpp: In function ‘int main(int, char**)’:
sm.cpp:46:15: warning: variable ‘pointer’ set but not used [-Wunused-but-set-variable]
x86_64-pc-linux-gnu-g++ -Wl,-O1 -Wl,--as-needed -Wl,-O1 -o sm sm.o -L/usr/X11R6/lib -L/usr/lib64 -lSM -lICE -lXext -lX11 -lm
Session Management enabled.
XShape auto-detection... ()
x86_64-pc-linux-gnu-g++ -c -pipe -O2 -pipe -O2 -Wall -W -I../../../mkspecs/linux-g++ -I. -I/usr/include/freetype2 -I/usr/X11R6/include -o xshape.o xshape.cpp
xshape.cpp: In function ‘int main(int, char**)’:
xshape.cpp:48:17: warning: variable ‘shapeevent’ set but not used [-Wunused-but-set-variable]
x86_64-pc-linux-gnu-g++ -Wl,-O1 -Wl,--as-needed -Wl,-O1 -o xshape xshape.o -L/usr/X11R6/lib -L/usr/lib64 -lXext -lX11 -lm
XShape enabled.
XVideo auto-detection... ()
x86_64-pc-linux-gnu-g++ -c -pipe -O2 -pipe -O2 -Wall -W -I../../../mkspecs/linux-g++ -I. -I/usr/include/freetype2 -I/usr/X11R6/include -o xvideo.o xvideo.cpp
xvideo.cpp:46:5: warning: unused parameter ‘argc’ [-Wunused-parameter]
xvideo.cpp:46:5: warning: unused parameter ‘argv’ [-Wunused-parameter]
x86_64-pc-linux-gnu-g++ -Wl,-O1 -Wl,--as-needed -Wl,-O1 -o xvideo xvideo.o -L/usr/X11R6/lib -L/usr/lib64 -lXv -lXext -lX11 -lm
XVideo enabled.
XSync auto-detection... ()
x86_64-pc-linux-gnu-g++ -c -pipe -O2 -pipe -O2 -Wall -W -I../../../mkspecs/linux-g++ -I. -I/usr/include/freetype2 -I/usr/X11R6/include -o xsync.o xsync.cpp
xsync.cpp: In function ‘int main(int, char**)’:
xsync.cpp:51:28: warning: statement has no effect [-Wunused-value]
xsync.cpp:52:31: warning: statement has no effect [-Wunused-value]
xsync.cpp:50:16: warning: unused variable ‘value’ [-Wunused-variable]
x86_64-pc-linux-gnu-g++ -Wl,-O1 -Wl,--as-needed -Wl,-O1 -o xsync xsync.o -L/usr/X11R6/lib -L/usr/lib64 -lXext -lX11 -lm
XSync enabled.
Xinerama auto-detection... ()
x86_64-pc-linux-gnu-g++ -c -pipe -O2 -pipe -O2 -Wall -W -I../../../mkspecs/linux-g++ -I. -I/usr/include/freetype2 -I/usr/X11R6/include -o xinerama.o xinerama.cpp
xinerama.cpp: In function ‘int main(int, char**)’:
xinerama.cpp:47:25: warning: variable ‘info’ set but not used [-Wunused-but-set-variable]
x86_64-pc-linux-gnu-g++ -Wl,-O1 -Wl,--as-needed -Wl,-O1 -o xinerama xinerama.o -L/usr/X11R6/lib -L/usr/lib64 -lXinerama -lXext -lX11 -lm
Xinerama enabled.
XInput auto-detection... ()
x86_64-pc-linux-gnu-g++ -c -pipe -O2 -pipe -O2 -Wall -W -I../../../mkspecs/linux-g++ -I. -I/usr/include/freetype2 -I/usr/X11R6/include -o xinput.o xinput.cpp
xinput.cpp: In function ‘int main(int, char**)’:
xinput.cpp:55:25: warning: variable ‘event’ set but not used [-Wunused-but-set-variable]
x86_64-pc-linux-gnu-g++ -Wl,-O1 -Wl,--as-needed -Wl,-O1 -o xinput xinput.o -L/usr/X11R6/lib -L/usr/lib64 -lXi -lXext -lX11 -lm
XInput enabled.
XKB auto-detection... ()
x86_64-pc-linux-gnu-g++ -c -pipe -O2 -pipe -O2 -Wall -W -I../../../mkspecs/linux-g++ -I. -I/usr/include/freetype2 -I/usr/X11R6/include -o xkb.o xkb.cpp
x86_64-pc-linux-gnu-g++ -Wl,-O1 -Wl,--as-needed -Wl,-O1 -o xkb xkb.o -L/usr/X11R6/lib -L/usr/lib64 -lXext -lX11 -lm
XKB enabled.
Determining machine byte-order... (/var/tmp/portage/dev-qt/qtwebkit-4.8.4/work/qt-everywhere-opensource-src-4.8.4/mkspecs/linux-g++ yes /var/tmp/portage/dev-qt/qtwebkit-4.8.4/work/qt-everywhere-opensource-src-4.8.4 /var/tmp/portage/dev-qt/qtwebkit-4.8.4/work/qt-everywhere-opensource-src-4.8.4 )
x86_64-pc-linux-gnu-g++ -c -pipe -O2 -pipe -O2 -Wall -W -I../../../mkspecs/linux-g++ -I. -o endiantest.o endiantest.cpp
x86_64-pc-linux-gnu-g++ -Wl,-O1 -Wl,--as-needed -Wl,-O1 -o endiantest endiantest.o
Found 'LeastSignificantByteFirst' in binary
rm -f endiantest.o
rm -f *~ core *.core
rm -f endiantest
rm -f Makefile
Using little endian.
Determining machine byte-order... (/var/tmp/portage/dev-qt/qtwebkit-4.8.4/work/qt-everywhere-opensource-src-4.8.4/mkspecs/linux-g++ yes /var/tmp/portage/dev-qt/qtwebkit-4.8.4/work/qt-everywhere-opensource-src-4.8.4 /var/tmp/portage/dev-qt/qtwebkit-4.8.4/work/qt-everywhere-opensource-src-4.8.4)
x86_64-pc-linux-gnu-g++ -c -pipe -O2 -pipe -O2 -Wall -W -I../../../mkspecs/linux-g++ -I. -o endiantest.o endiantest.cpp
x86_64-pc-linux-gnu-g++ -Wl,-O1 -Wl,--as-needed -Wl,-O1 -o endiantest endiantest.o
Found 'LeastSignificantByteFirst' in binary
rm -f endiantest.o
rm -f *~ core *.core
rm -f endiantest
rm -f Makefile
Using little endian.
STL auto-detection... ()
x86_64-pc-linux-gnu-g++ -c -pipe -O2 -pipe -O2 -Wall -W -I../../../mkspecs/linux-g++ -I. -I/usr/include/freetype2 -o stltest.o stltest.cpp
stltest.cpp: In function ‘int main()’:
stltest.cpp:135:13: warning: variable ‘first’ set but not used [-Wunused-but-set-variable]
stltest.cpp:137:16: warning: variable ‘second’ set but not used [-Wunused-but-set-variable]
stltest.cpp:108:9: warning: variable ‘v1size’ set but not used [-Wunused-but-set-variable]
stltest.cpp:110:9: warning: variable ‘v1capacity’ set but not used [-Wunused-but-set-variable]
stltest.cpp:114:10: warning: variable ‘v1notfound’ set but not used [-Wunused-but-set-variable]
stltest.cpp:118:10: warning: variable ‘v1found’ set but not used [-Wunused-but-set-variable]
stltest.cpp:123:9: warning: variable ‘v2size’ set but not used [-Wunused-but-set-variable]
stltest.cpp:131:9: warning: variable ‘m1size’ set but not used [-Wunused-but-set-variable]
stltest.cpp:141:9: warning: variable ‘m2size’ set but not used [-Wunused-but-set-variable]
stltest.cpp:145:9: warning: unused variable ‘n’ [-Wunused-variable]
x86_64-pc-linux-gnu-g++ -Wl,-O1 -Wl,--as-needed -Wl,-O1 -o stl stltest.o -L/usr/lib64
STL enabled.
IPv6 auto-detection... ()
x86_64-pc-linux-gnu-g++ -c -pipe -O2 -pipe -O2 -Wall -W -I../../../mkspecs/linux-g++ -I. -I/usr/include/freetype2 -o ipv6test.o ipv6test.cpp
x86_64-pc-linux-gnu-g++ -Wl,-O1 -Wl,--as-needed -Wl,-O1 -o ipv6 ipv6test.o -L/usr/lib64
IPv6 enabled.
POSIX clock_gettime() auto-detection... ()
x86_64-pc-linux-gnu-g++ -c -pipe -O2 -pipe -O2 -Wall -W -I../../../mkspecs/linux-g++ -I. -I/usr/include/freetype2 -o clock-gettime.o clock-gettime.cpp
x86_64-pc-linux-gnu-g++ -Wl,-O1 -Wl,--as-needed -Wl,-O1 -o clock-gettime clock-gettime.o -L/usr/lib64 -lrt
POSIX clock_gettime() enabled.
POSIX Monotonic Clock auto-detection... ()
x86_64-pc-linux-gnu-g++ -c -pipe -O2 -pipe -O2 -Wall -W -I../../../mkspecs/linux-g++ -I. -I/usr/include/freetype2 -o clock-monotonic.o clock-monotonic.cpp
x86_64-pc-linux-gnu-g++ -Wl,-O1 -Wl,--as-needed -Wl,-O1 -o clock-monotonic clock-monotonic.o -L/usr/lib64 -lrt
POSIX Monotonic Clock enabled.
mremap auto-detection... ()
x86_64-pc-linux-gnu-g++ -c -pipe -O2 -pipe -O2 -Wall -W -I../../../mkspecs/linux-g++ -I. -I/usr/include/freetype2 -o mremap.o mremap.cpp
x86_64-pc-linux-gnu-g++ -Wl,-O1 -Wl,--as-needed -Wl,-O1 -o mremap mremap.o -L/usr/lib64
mremap enabled.
getaddrinfo auto-detection... ()
x86_64-pc-linux-gnu-g++ -c -pipe -O2 -pipe -O2 -Wall -W -I../../../mkspecs/linux-g++ -I. -I/usr/include/freetype2 -o getaddrinfotest.o getaddrinfotest.cpp
x86_64-pc-linux-gnu-g++ -Wl,-O1 -Wl,--as-needed -Wl,-O1 -o getaddrinfo getaddrinfotest.o -L/usr/lib64
getaddrinfo enabled.
inotify auto-detection... ()
x86_64-pc-linux-gnu-g++ -c -pipe -O2 -pipe -O2 -Wall -W -I../../../mkspecs/linux-g++ -I. -I/usr/include/freetype2 -o inotifytest.o inotifytest.cpp
x86_64-pc-linux-gnu-g++ -Wl,-O1 -Wl,--as-needed -Wl,-O1 -o inotify inotifytest.o -L/usr/lib64
inotify enabled.
IPv6 interface name auto-detection... ()
x86_64-pc-linux-gnu-g++ -c -pipe -O2 -pipe -O2 -Wall -W -I../../../mkspecs/linux-g++ -I. -I/usr/include/freetype2 -o ipv6ifname.o ipv6ifname.cpp
x86_64-pc-linux-gnu-g++ -Wl,-O1 -Wl,--as-needed -Wl,-O1 -o ipv6ifname ipv6ifname.o -L/usr/lib64
IPv6 interface name enabled.
getifaddrs auto-detection... ()
x86_64-pc-linux-gnu-g++ -c -pipe -O2 -pipe -O2 -Wall -W -I../../../mkspecs/linux-g++ -I. -I/usr/include/freetype2 -o getifaddrs.o getifaddrs.cpp
x86_64-pc-linux-gnu-g++ -Wl,-O1 -Wl,--as-needed -Wl,-O1 -o getifaddrs getifaddrs.o -L/usr/lib64
getifaddrs enabled.
OpenSSL auto-detection... ()
x86_64-pc-linux-gnu-g++ -c -pipe -O2 -pipe -O2 -Wall -W -I../../../mkspecs/linux-g++ -I. -I/usr/include/freetype2 -o openssl.o openssl.cpp
x86_64-pc-linux-gnu-g++ -Wl,-O1 -Wl,--as-needed -Wl,-O1 -o openssl openssl.o -L/usr/lib64
OpenSSL enabled.
OpenVG auto-detection... ()
x86_64-pc-linux-gnu-g++ -c -pipe -O2 -pipe -O2 -Wall -W -I../../../mkspecs/linux-g++ -I. -I/usr/include/freetype2 -o openvg.o openvg.cpp
openvg.cpp:48:23: fatal error: VG/openvg.h: No such file or directory
compilation terminated.
gmake: *** [openvg.o] Error 1
OpenVG disabled.
OpenVG auto-detection... ()
x86_64-pc-linux-gnu-g++ -c -pipe -O2 -pipe -O2 -Wall -W -I../../../mkspecs/linux-g++ -I. -I/usr/include/freetype2 -I/usr/X11R6/include -o openvg.o openvg.cpp
openvg.cpp:48:23: fatal error: VG/openvg.h: No such file or directory
compilation terminated.
gmake: *** [openvg.o] Error 1
OpenVG disabled.
OpenVG (lc includes) auto-detection... ()
x86_64-pc-linux-gnu-g++ -c -pipe -O2 -pipe -O2 -Wall -W -DQT_LOWER_CASE_VG_INCLUDES -I../../../mkspecs/linux-g++ -I. -I/usr/include/freetype2 -o openvg.o openvg.cpp
openvg.cpp:46:23: fatal error: vg/openvg.h: No such file or directory
compilation terminated.
gmake: *** [openvg.o] Error 1
OpenVG (lc includes) disabled.
OpenVG (lc includes) auto-detection... ()
x86_64-pc-linux-gnu-g++ -c -pipe -O2 -pipe -O2 -Wall -W -DQT_LOWER_CASE_VG_INCLUDES -I../../../mkspecs/linux-g++ -I. -I/usr/include/freetype2 -I/usr/X11R6/include -o openvg.o openvg.cpp
openvg.cpp:46:23: fatal error: vg/openvg.h: No such file or directory
compilation terminated.
gmake: *** [openvg.o] Error 1
OpenVG (lc includes) disabled.
alsa auto-detection... ()
x86_64-pc-linux-gnu-g++ -c -pipe -O2 -pipe -O2 -Wall -W -I../../../mkspecs/linux-g++ -I. -I/usr/include/freetype2 -o alsatest.o alsatest.cpp
alsatest.cpp:47:5: warning: unused parameter ‘argc’ [-Wunused-parameter]
alsatest.cpp:47:5: warning: unused parameter ‘argv’ [-Wunused-parameter]
x86_64-pc-linux-gnu-g++ -Wl,-O1 -Wl,--as-needed -Wl,-O1 -o alsa alsatest.o -L/usr/lib64 -lasound
alsa enabled.
Stdint auto-detection... ()
x86_64-pc-linux-gnu-g++ -c -pipe -O2 -pipe -O2 -Wall -W -D_LARGEFILE64_SOURCE -D_LARGEFILE_SOURCE -I../../../mkspecs/linux-g++ -I. -I/usr/include/freetype2 -o main.o main.cpp
x86_64-pc-linux-gnu-g++ -Wl,-O1 -Wl,--as-needed -Wl,-O1 -o stdint main.o -L/usr/lib64
Stdint enabled.
Testing size of pointers ... (/var/tmp/portage/dev-qt/qtwebkit-4.8.4/work/qt-everywhere-opensource-src-4.8.4/mkspecs/linux-g++ yes /var/tmp/portage/dev-qt/qtwebkit-4.8.4/work/qt-everywhere-opensource-src-4.8.4 /var/tmp/portage/dev-qt/qtwebkit-4.8.4/work/qt-everywhere-opensource-src-4.8.4)
rm -f ptrsizetest.o
rm -f *~ core *.core
x86_64-pc-linux-gnu-g++ -c -pipe -O2 -pipe -O2 -Wall -W -I../../../mkspecs/linux-g++ -I. -o ptrsizetest.o ptrsizetest.cpp
x86_64-pc-linux-gnu-g++ -Wl,-O1 -Wl,--as-needed -Wl,-O1 -o ptrsizetest ptrsizetest.o
Pointer size: 8
ln: failed to create symbolic link ‘/var/tmp/portage/dev-qt/qtwebkit-4.8.4/work/qt-everywhere-opensource-src-4.8.4/include/QtCore/qconfig.h’: File exists
ln: failed to create symbolic link ‘/var/tmp/portage/dev-qt/qtwebkit-4.8.4/work/qt-everywhere-opensource-src-4.8.4/include/Qt/qconfig.h’: File exists

This target is using the GNU C++ compiler (linux-g++).

Recent versions of this compiler automatically include code for
exceptions, which increase both the size of the Qt libraries and
the amount of memory taken by your applications.

You may choose to re-run configure with the -no-exceptions
option to compile Qt without exceptions. This is completely binary
compatible, and existing applications will continue to work.


Build type: linux-g++
Architecture: x86_64

qmake vars .......... cat: .qmake.vars: No such file or directory
qmake switches .........
Build .................. libs tools docs translations
Configuration .......... system-sqlite release shared dll largefile stl mmx 3dnow sse sse2 sse3 ssse3 sse4_1 sse4_2 avx minimal-config small-config medium-config large-config full-config qt3support phonon phonon-backend accessibility opengl reduce_exports reduce_relocations ipv6 clock-gettime clock-monotonic mremap getaddrinfo ipv6ifname getifaddrs inotify system-jpeg system-mng system-png png system-tiff system-freetype system-zlib nis cups iconv glib gstreamer dbus openssl x11sm xshape xvideo xsync xrender mitshm fontconfig xkb alsa concurrent xmlpatterns multimedia audio-backend svg script scripttools declarative release
Debug .................. no
Qt 3 compatibility ..... yes
QtDBus module .......... yes (run-time)
QtConcurrent code ...... yes
QtGui module ........... yes
QtScript module ........ yes
QtScriptTools module ... yes
QtXmlPatterns module ... yes
Phonon module .......... yes
Multimedia module ...... auto
SVG module ............. yes
WebKit module .......... yes
JavaScriptCore JIT ..... yes
Declarative module ..... yes
Declarative debugging ...yes
Support for S60 ........ no
Symbian DEF files ...... no
STL support ............ yes
PCH support ............ no
MMX/3DNOW/SSE/SSE2/SSE3. yes/yes/yes/yes/yes
SSSE3/SSE4.1/SSE4.2..... yes/yes/yes
AVX..................... yes
Graphics System ........ default
IPv6 support ........... yes
IPv6 ifname support .... yes
getaddrinfo support .... yes
getifaddrs support ..... yes
Accessibility .......... yes
NIS support ............ yes
CUPS support ........... yes
Iconv support .......... yes
Glib support ........... yes
GStreamer support ...... yes
PulseAudio support ..... no
Large File support ..... yes
GIF support ............ plugin
TIFF support ........... plugin (system)
JPEG support ........... plugin (system)
PNG support ............ yes (system)
MNG support ............ plugin (system)
zlib support ........... system
Session management ..... yes
OpenGL support ......... yes (Desktop OpenGL)
OpenVG support ......... no
NAS sound support ...... no
XShape support ......... yes
XVideo support ......... yes
XSync support .......... yes
Xinerama support ....... runtime
Xcursor support ........ runtime
Xfixes support ......... runtime
Xrandr support ......... runtime
Xrender support ........ yes
Xi support ............. runtime
MIT-SHM support ........ yes
FontConfig support ..... yes
XKB Support ............ yes
immodule support ....... yes
GTK theme support ...... yes
MySQL support .......... plugin
SQLite support ......... plugin (system)
OpenSSL support ........ yes (run-time)
Alsa support ........... yes
ICD support ............ no
libICU support ......... no
Use system proxies ..... no

* Running qmake in: src/3rdparty/webkit/Source/JavaScriptCore
* Running qmake in: src/3rdparty/webkit/Source/WebCore
* Running qmake in: src/3rdparty/webkit/Source/WebKit/qt
* Running qmake in: tools/designer/src/plugins/qwebview
>>> Source configured.
___________________________________________________________________________________________


These are last few lines of compilation and error message...

___________________________________________________________________________________________
JavaScriptCore/debugger -I../JavaScriptCore/interpreter -I../JavaScriptCore/jit -I../JavaScriptCore/parser -I../JavaScriptCore/profiler -I../JavaScriptCore/runtime -I../JavaScriptCore/wtf -I../JavaScriptCore/wtf/gobject -I/var/tmp/portage/dev-qt/qtwebkit-4.8.4/work/qt-everywhere-opensource-src-4.8.4/src/3rdparty/webkit/Source/JavaScriptCore/wtf/symbian -I../JavaScriptCore/wtf/unicode -I../JavaScriptCore/yarr -I../JavaScriptCore/API -I../JavaScriptCore/ForwardingHeaders -I../JavaScriptCore/generated -Ibridge/qt -Ipage/qt -Iplatform/graphics/qt -Iplatform/network/qt -Iplatform/qt -I../WebKit/qt/Api -I../WebKit/qt/WebCoreSupport -I. -Iaccessibility -Ibindings -Ibindings/generic -Ibridge -Icss -Idom -Idom/default -Iediting -Ifileapi -Ihistory -Ihtml -Ihtml/canvas -Ihtml/parser -Ihtml/shadow -Iinspector -Iloader -Iloader/appcache -Iloader/archive -Iloader/cache -Iloader/icon -Imathml -Inotifications -Ipage -Ipage/animation -Iplatform -Iplatform/animation -Iplatform/audio -Iplatform/graphics -Iplatform/graphics/filters -Iplatform/graphics/filters/arm -Iplatform/graphics/texmap -Iplatform/graphics/transforms -Iplatform/image-decoders -Iplatform/leveldb -Iplatform/mock -Iplatform/network -Iplatform/sql -Iplatform/text -Iplatform/text/transcoder -Iplugins -Irendering -Irendering/mathml -Irendering/style -Irendering/svg -Istorage -Isvg -Isvg/animation -Isvg/graphics -Isvg/graphics/filters -Isvg/properties -Itesting -Iwebaudio -Iwebsockets -I/var/tmp/portage/dev-qt/qtwebkit-4.8.4/work/qt-everywhere-opensource-src-4.8.4/src/3rdparty/webkit/Source/WebCore/wml -Iworkers -Ixml -Ibridge/jsc -Ibindings/js -I/var/tmp/portage/dev-qt/qtwebkit-4.8.4/work/qt-everywhere-opensource-src-4.8.4/src/3rdparty/webkit/Source/WebCore/bindings/js/specialization -Ibridge/c -Itesting/js -Igenerated -I../../Source -I../../include -I../include/QtWebKit -I../include -Iplatform/graphics/gstreamer -I/usr/include/glib-2.0 -I/usr/lib64/glib-2.0/include -I/usr/include/gstreamer-0.10 -I/usr/include/libxml2 -I/usr/X11R6/include -I.moc/release-static -o .obj/release-static/InspectorConsoleAgent.o inspector/InspectorConsoleAgent.cpp
x86_64-pc-linux-gnu-g++ -c -O2 -pipe -I/usr/include/freetype2 -Wall -Wextra -Wreturn-type -fno-strict-aliasing -Wcast-align -Wchar-subscripts -Wformat-security -Wreturn-type -Wno-unused-parameter -Wno-sign-compare -Wno-switch -Wno-switch-enum -Wundef -Wmissing-noreturn -Winit-self -Wno-c++0x-compat -ffunction-sections -fdata-sections -fPIC -fvisibility=hidden -fvisibility-inlines-hidden -pthread -pthread -pthread -pthread -pthread -pthread -pthread -pthread -I/usr/include/freetype2 -D_REENTRANT -DNDEBUG -DBUILDING_QT__=1 -DNDEBUG -DQT_ASCII_CAST_WARNINGS -DENABLE_JIT=1 -DENABLE_XSLT=0 -DENABLE_WEB_TIMING=0 -DENABLE_JAVASCRIPT_DEBUGGER=1 -DENABLE_DATABASE=1 -DENABLE_EVENTSOURCE=1 -DENABLE_OFFLINE_WEB_APPLICATIONS=1 -DENABLE_DOM_STORAGE=1 -DENABLE_ICONDATABASE=1 -DENABLE_CHANNEL_MESSAGING=1 -DENABLE_DIRECTORY_UPLOAD=0 -DENABLE_FILE_SYSTEM=0 -DENABLE_QUOTA=0 -DENABLE_SQLITE=1 -DENABLE_DASHBOARD_SUPPORT=0 -DENABLE_FILTERS=1 -DENABLE_XPATH=1 -DENABLE_WCSS=0 -DENABLE_SHARED_WORKERS=1 -DENABLE_WORKERS=1 -DENABLE_XHTMLMP=0 -DENABLE_DETAILS=1 -DENABLE_METER_TAG=1 -DENABLE_PROGRESS_TAG=1 -DENABLE_BLOB=1 -DENABLE_NOTIFICATIONS=1 -DENABLE_INPUT_SPEECH=0 -DENABLE_INSPECTOR=1 -DENABLE_3D_RENDERING=1 -DENABLE_WEB_AUDIO=0 -DENABLE_WEBGL=0 -DENABLE_MEDIA_STATISTICS=0 -DENABLE_VIDEO_TRACK=0 -DENABLE_TOUCH_ICON_LOADING=0 -DENABLE_ANIMATION_API=0 -DENABLE_SVG=1 -DENABLE_SVG_FONTS=1 -DENABLE_SVG_FOREIGN_OBJECT=1 -DENABLE_SVG_ANIMATION=1 -DENABLE_SVG_AS_IMAGE=1 -DENABLE_SVG_USE=1 -DENABLE_DATALIST=1 -DENABLE_TILED_BACKING_STORE=1 -DENABLE_NETSCAPE_PLUGIN_API=1 -DENABLE_WEB_SOCKETS=1 -DWTF_USE_QT_BEARER=1 -DENABLE_TOUCH_EVENTS=1 -DENABLE_VIDEO=1 -DWTF_USE_GSTREAMER=1 -DXP_UNIX -DENABLE_NETSCAPE_PLUGIN_METADATA_CACHE=1 -DENABLE_GLIB_SUPPORT=1 -DENABLE_JIT=1 -DBUILDING_JavaScriptCore -DBUILDING_WTF -DBUILDING_WEBKIT -DQT_MAKEDLL -D_LARGEFILE64_SOURCE -D_LARGEFILE_SOURCE -DQT_NO_DEBUG -DQT_GUI_LIB -DQT_NETWORK_LIB -DQT_CORE_LIB -DQT_HAVE_MMX -DQT_HAVE_3DNOW -DQT_HAVE_SSE -DQT_HAVE_MMXEXT -DQT_HAVE_SSE2 -DQT_HAVE_SSE3 -DQT_HAVE_SSSE3 -DQT_HAVE_SSE4_1 -DQT_HAVE_SSE4_2 -DQT_HAVE_AVX -DQT_SHARED -I../../../../../mkspecs/linux-g++ -I. -I../../../../../include/QtCore -I../../../../../include/QtNetwork -I../../../../../include/QtGui -I../../../../../include -I../JavaScriptCore -I../../Source -I../ThirdParty -I../JavaScriptCore/assembler -I../JavaScriptCore/bytecode -I../JavaScriptCore/bytecompiler -I../JavaScriptCore/heap -I../JavaScriptCore/dfg -I../JavaScriptCore/debugger -I../JavaScriptCore/interpreter -I../JavaScriptCore/jit -I../JavaScriptCore/parser -I../JavaScriptCore/profiler -I../JavaScriptCore/runtime -I../JavaScriptCore/wtf -I../JavaScriptCore/wtf/gobject -I/var/tmp/portage/dev-qt/qtwebkit-4.8.4/work/qt-everywhere-opensource-src-4.8.4/src/3rdparty/webkit/Source/JavaScriptCore/wtf/symbian -I../JavaScriptCore/wtf/unicode -I../JavaScriptCore/yarr -I../JavaScriptCore/API -I../JavaScriptCore/ForwardingHeaders -I../JavaScriptCore/generated -Ibridge/qt -Ipage/qt -Iplatform/graphics/qt -Iplatform/network/qt -Iplatform/qt -I../WebKit/qt/Api -I../WebKit/qt/WebCoreSupport -I. -Iaccessibility -Ibindings -Ibindings/generic -Ibridge -Icss -Idom -Idom/default -Iediting -Ifileapi -Ihistory -Ihtml -Ihtml/canvas -Ihtml/parser -Ihtml/shadow -Iinspector -Iloader -Iloader/appcache -Iloader/archive -Iloader/cache -Iloader/icon -Imathml -Inotifications -Ipage -Ipage/animation -Iplatform -Iplatform/animation -Iplatform/audio -Iplatform/graphics -Iplatform/graphics/filters -Iplatform/graphics/filters/arm -Iplatform/graphics/texmap -Iplatform/graphics/transforms -Iplatform/image-decoders -Iplatform/leveldb -Iplatform/mock -Iplatform/network -Iplatform/sql -Iplatform/text -Iplatform/text/transcoder -Iplugins -Irendering -Irendering/mathml -Irendering/style -Irendering/svg -Istorage -Isvg -Isvg/animation -Isvg/graphics -Isvg/graphics/filters -Isvg/properties -Itesting -Iwebaudio -Iwebsockets -I/var/tmp/portage/dev-qt/qtwebkit-4.8.4/work/qt-everywhere-opensource-src-4.8.4/src/3rdparty/webkit/Source/WebCore/wml -Iworkers -Ixml -Ibridge/jsc -Ibindings/js -I/var/tmp/portage/dev-qt/qtwebkit-4.8.4/work/qt-everywhere-opensource-src-4.8.4/src/3rdparty/webkit/Source/WebCore/bindings/js/specialization -Ibridge/c -Itesting/js -Igenerated -I../../Source -I../../include -I../include/QtWebKit -I../include -Iplatform/graphics/gstreamer -I/usr/include/glib-2.0 -I/usr/lib64/glib-2.0/include -I/usr/include/gstreamer-0.10 -I/usr/include/libxml2 -I/usr/X11R6/include -I.moc/release-static -o .obj/release-static/InspectorController.o inspector/InspectorController.cpp
x86_64-pc-linux-gnu-g++ -c -O2 -pipe -I/usr/include/freetype2 -Wall -Wextra -Wreturn-type -fno-strict-aliasing -Wcast-align -Wchar-subscripts -Wformat-security -Wreturn-type -Wno-unused-parameter -Wno-sign-compare -Wno-switch -Wno-switch-enum -Wundef -Wmissing-noreturn -Winit-self -Wno-c++0x-compat -ffunction-sections -fdata-sections -fPIC -fvisibility=hidden -fvisibility-inlines-hidden -pthread -pthread -pthread -pthread -pthread -pthread -pthread -pthread -I/usr/include/freetype2 -D_REENTRANT -DNDEBUG -DBUILDING_QT__=1 -DNDEBUG -DQT_ASCII_CAST_WARNINGS -DENABLE_JIT=1 -DENABLE_XSLT=0 -DENABLE_WEB_TIMING=0 -DENABLE_JAVASCRIPT_DEBUGGER=1 -DENABLE_DATABASE=1 -DENABLE_EVENTSOURCE=1 -DENABLE_OFFLINE_WEB_APPLICATIONS=1 -DENABLE_DOM_STORAGE=1 -DENABLE_ICONDATABASE=1 -DENABLE_CHANNEL_MESSAGING=1 -DENABLE_DIRECTORY_UPLOAD=0 -DENABLE_FILE_SYSTEM=0 -DENABLE_QUOTA=0 -DENABLE_SQLITE=1 -DENABLE_DASHBOARD_SUPPORT=0 -DENABLE_FILTERS=1 -DENABLE_XPATH=1 -DENABLE_WCSS=0 -DENABLE_SHARED_WORKERS=1 -DENABLE_WORKERS=1 -DENABLE_XHTMLMP=0 -DENABLE_DETAILS=1 -DENABLE_METER_TAG=1 -DENABLE_PROGRESS_TAG=1 -DENABLE_BLOB=1 -DENABLE_NOTIFICATIONS=1 -DENABLE_INPUT_SPEECH=0 -DENABLE_INSPECTOR=1 -DENABLE_3D_RENDERING=1 -DENABLE_WEB_AUDIO=0 -DENABLE_WEBGL=0 -DENABLE_MEDIA_STATISTICS=0 -DENABLE_VIDEO_TRACK=0 -DENABLE_TOUCH_ICON_LOADING=0 -DENABLE_ANIMATION_API=0 -DENABLE_SVG=1 -DENABLE_SVG_FONTS=1 -DENABLE_SVG_FOREIGN_OBJECT=1 -DENABLE_SVG_ANIMATION=1 -DENABLE_SVG_AS_IMAGE=1 -DENABLE_SVG_USE=1 -DENABLE_DATALIST=1 -DENABLE_TILED_BACKING_STORE=1 -DENABLE_NETSCAPE_PLUGIN_API=1 -DENABLE_WEB_SOCKETS=1 -DWTF_USE_QT_BEARER=1 -DENABLE_TOUCH_EVENTS=1 -DENABLE_VIDEO=1 -DWTF_USE_GSTREAMER=1 -DXP_UNIX -DENABLE_NETSCAPE_PLUGIN_METADATA_CACHE=1 -DENABLE_GLIB_SUPPORT=1 -DENABLE_JIT=1 -DBUILDING_JavaScriptCore -DBUILDING_WTF -DBUILDING_WEBKIT -DQT_MAKEDLL -D_LARGEFILE64_SOURCE -D_LARGEFILE_SOURCE -DQT_NO_DEBUG -DQT_GUI_LIB -DQT_NETWORK_LIB -DQT_CORE_LIB -DQT_HAVE_MMX -DQT_HAVE_3DNOW -DQT_HAVE_SSE -DQT_HAVE_MMXEXT -DQT_HAVE_SSE2 -DQT_HAVE_SSE3 -DQT_HAVE_SSSE3 -DQT_HAVE_SSE4_1 -DQT_HAVE_SSE4_2 -DQT_HAVE_AVX -DQT_SHARED -I../../../../../mkspecs/linux-g++ -I. -I../../../../../include/QtCore -I../../../../../include/QtNetwork -I../../../../../include/QtGui -I../../../../../include -I../JavaScriptCore -I../../Source -I../ThirdParty -I../JavaScriptCore/assembler -I../JavaScriptCore/bytecode -I../JavaScriptCore/bytecompiler -I../JavaScriptCore/heap -I../JavaScriptCore/dfg -I../JavaScriptCore/debugger -I../JavaScriptCore/interpreter -I../JavaScriptCore/jit -I../JavaScriptCore/parser -I../JavaScriptCore/profiler -I../JavaScriptCore/runtime -I../JavaScriptCore/wtf -I../JavaScriptCore/wtf/gobject -I/var/tmp/portage/dev-qt/qtwebkit-4.8.4/work/qt-everywhere-opensource-src-4.8.4/src/3rdparty/webkit/Source/JavaScriptCore/wtf/symbian -I../JavaScriptCore/wtf/unicode -I../JavaScriptCore/yarr -I../JavaScriptCore/API -I../JavaScriptCore/ForwardingHeaders -I../JavaScriptCore/generated -Ibridge/qt -Ipage/qt -Iplatform/graphics/qt -Iplatform/network/qt -Iplatform/qt -I../WebKit/qt/Api -I../WebKit/qt/WebCoreSupport -I. -Iaccessibility -Ibindings -Ibindings/generic -Ibridge -Icss -Idom -Idom/default -Iediting -Ifileapi -Ihistory -Ihtml -Ihtml/canvas -Ihtml/parser -Ihtml/shadow -Iinspector -Iloader -Iloader/appcache -Iloader/archive -Iloader/cache -Iloader/icon -Imathml -Inotifications -Ipage -Ipage/animation -Iplatform -Iplatform/animation -Iplatform/audio -Iplatform/graphics -Iplatform/graphics/filters -Iplatform/graphics/filters/arm -Iplatform/graphics/texmap -Iplatform/graphics/transforms -Iplatform/image-decoders -Iplatform/leveldb -Iplatform/mock -Iplatform/network -Iplatform/sql -Iplatform/text -Iplatform/text/transcoder -Iplugins -Irendering -Irendering/mathml -Irendering/style -Irendering/svg -Istorage -Isvg -Isvg/animation -Isvg/graphics -Isvg/graphics/filters -Isvg/properties -Itesting -Iwebaudio -Iwebsockets -I/var/tmp/portage/dev-qt/qtwebkit-4.8.4/work/qt-everywhere-opensource-src-4.8.4/src/3rdparty/webkit/Source/WebCore/wml -Iworkers -Ixml -Ibridge/jsc -Ibindings/js -I/var/tmp/portage/dev-qt/qtwebkit-4.8.4/work/qt-everywhere-opensource-src-4.8.4/src/3rdparty/webkit/Source/WebCore/bindings/js/specialization -Ibridge/c -Itesting/js -Igenerated -I../../Source -I../../include -I../include/QtWebKit -I../include -Iplatform/graphics/gstreamer -I/usr/include/glib-2.0 -I/usr/lib64/glib-2.0/include -I/usr/include/gstreamer-0.10 -I/usr/include/libxml2 -I/usr/X11R6/include -I.moc/release-static -o .obj/release-static/InspectorDatabaseAgent.o inspector/InspectorDatabaseAgent.cpp
x86_64-pc-linux-gnu-g++ -c -O2 -pipe -I/usr/include/freetype2 -Wall -Wextra -Wreturn-type -fno-strict-aliasing -Wcast-align -Wchar-subscripts -Wformat-security -Wreturn-type -Wno-unused-parameter -Wno-sign-compare -Wno-switch -Wno-switch-enum -Wundef -Wmissing-noreturn -Winit-self -Wno-c++0x-compat -ffunction-sections -fdata-sections -fPIC -fvisibility=hidden -fvisibility-inlines-hidden -pthread -pthread -pthread -pthread -pthread -pthread -pthread -pthread -I/usr/include/freetype2 -D_REENTRANT -DNDEBUG -DBUILDING_QT__=1 -DNDEBUG -DQT_ASCII_CAST_WARNINGS -DENABLE_JIT=1 -DENABLE_XSLT=0 -DENABLE_WEB_TIMING=0 -DENABLE_JAVASCRIPT_DEBUGGER=1 -DENABLE_DATABASE=1 -DENABLE_EVENTSOURCE=1 -DENABLE_OFFLINE_WEB_APPLICATIONS=1 -DENABLE_DOM_STORAGE=1 -DENABLE_ICONDATABASE=1 -DENABLE_CHANNEL_MESSAGING=1 -DENABLE_DIRECTORY_UPLOAD=0 -DENABLE_FILE_SYSTEM=0 -DENABLE_QUOTA=0 -DENABLE_SQLITE=1 -DENABLE_DASHBOARD_SUPPORT=0 -DENABLE_FILTERS=1 -DENABLE_XPATH=1 -DENABLE_WCSS=0 -DENABLE_SHARED_WORKERS=1 -DENABLE_WORKERS=1 -DENABLE_XHTMLMP=0 -DENABLE_DETAILS=1 -DENABLE_METER_TAG=1 -DENABLE_PROGRESS_TAG=1 -DENABLE_BLOB=1 -DENABLE_NOTIFICATIONS=1 -DENABLE_INPUT_SPEECH=0 -DENABLE_INSPECTOR=1 -DENABLE_3D_RENDERING=1 -DENABLE_WEB_AUDIO=0 -DENABLE_WEBGL=0 -DENABLE_MEDIA_STATISTICS=0 -DENABLE_VIDEO_TRACK=0 -DENABLE_TOUCH_ICON_LOADING=0 -DENABLE_ANIMATION_API=0 -DENABLE_SVG=1 -DENABLE_SVG_FONTS=1 -DENABLE_SVG_FOREIGN_OBJECT=1 -DENABLE_SVG_ANIMATION=1 -DENABLE_SVG_AS_IMAGE=1 -DENABLE_SVG_USE=1 -DENABLE_DATALIST=1 -DENABLE_TILED_BACKING_STORE=1 -DENABLE_NETSCAPE_PLUGIN_API=1 -DENABLE_WEB_SOCKETS=1 -DWTF_USE_QT_BEARER=1 -DENABLE_TOUCH_EVENTS=1 -DENABLE_VIDEO=1 -DWTF_USE_GSTREAMER=1 -DXP_UNIX -DENABLE_NETSCAPE_PLUGIN_METADATA_CACHE=1 -DENABLE_GLIB_SUPPORT=1 -DENABLE_JIT=1 -DBUILDING_JavaScriptCore -DBUILDING_WTF -DBUILDING_WEBKIT -DQT_MAKEDLL -D_LARGEFILE64_SOURCE -D_LARGEFILE_SOURCE -DQT_NO_DEBUG -DQT_GUI_LIB -DQT_NETWORK_LIB -DQT_CORE_LIB -DQT_HAVE_MMX -DQT_HAVE_3DNOW -DQT_HAVE_SSE -DQT_HAVE_MMXEXT -DQT_HAVE_SSE2 -DQT_HAVE_SSE3 -DQT_HAVE_SSSE3 -DQT_HAVE_SSE4_1 -DQT_HAVE_SSE4_2 -DQT_HAVE_AVX -DQT_SHARED -I../../../../../mkspecs/linux-g++ -I. -I../../../../../include/QtCore -I../../../../../include/QtNetwork -I../../../../../include/QtGui -I../../../../../include -I../JavaScriptCore -I../../Source -I../ThirdParty -I../JavaScriptCore/assembler -I../JavaScriptCore/bytecode -I../JavaScriptCore/bytecompiler -I../JavaScriptCore/heap -I../JavaScriptCore/dfg -I../JavaScriptCore/debugger -I../JavaScriptCore/interpreter -I../JavaScriptCore/jit -I../JavaScriptCore/parser -I../JavaScriptCore/profiler -I../JavaScriptCore/runtime -I../JavaScriptCore/wtf -I../JavaScriptCore/wtf/gobject -I/var/tmp/portage/dev-qt/qtwebkit-4.8.4/work/qt-everywhere-opensource-src-4.8.4/src/3rdparty/webkit/Source/JavaScriptCore/wtf/symbian -I../JavaScriptCore/wtf/unicode -I../JavaScriptCore/yarr -I../JavaScriptCore/API -I../JavaScriptCore/ForwardingHeaders -I../JavaScriptCore/generated -Ibridge/qt -Ipage/qt -Iplatform/graphics/qt -Iplatform/network/qt -Iplatform/qt -I../WebKit/qt/Api -I../WebKit/qt/WebCoreSupport -I. -Iaccessibility -Ibindings -Ibindings/generic -Ibridge -Icss -Idom -Idom/default -Iediting -Ifileapi -Ihistory -Ihtml -Ihtml/canvas -Ihtml/parser -Ihtml/shadow -Iinspector -Iloader -Iloader/appcache -Iloader/archive -Iloader/cache -Iloader/icon -Imathml -Inotifications -Ipage -Ipage/animation -Iplatform -Iplatform/animation -Iplatform/audio -Iplatform/graphics -Iplatform/graphics/filters -Iplatform/graphics/filters/arm -Iplatform/graphics/texmap -Iplatform/graphics/transforms -Iplatform/image-decoders -Iplatform/leveldb -Iplatform/mock -Iplatform/network -Iplatform/sql -Iplatform/text -Iplatform/text/transcoder -Iplugins -Irendering -Irendering/mathml -Irendering/style -Irendering/svg -Istorage -Isvg -Isvg/animation -Isvg/graphics -Isvg/graphics/filters -Isvg/properties -Itesting -Iwebaudio -Iwebsockets -I/var/tmp/portage/dev-qt/qtwebkit-4.8.4/work/qt-everywhere-opensource-src-4.8.4/src/3rdparty/webkit/Source/WebCore/wml -Iworkers -Ixml -Ibridge/jsc -Ibindings/js -I/var/tmp/portage/dev-qt/qtwebkit-4.8.4/work/qt-everywhere-opensource-src-4.8.4/src/3rdparty/webkit/Source/WebCore/bindings/js/specialization -Ibridge/c -Itesting/js -Igenerated -I../../Source -I../../include -I../include/QtWebKit -I../include -Iplatform/graphics/gstreamer -I/usr/include/glib-2.0 -I/usr/lib64/glib-2.0/include -I/usr/include/gstreamer-0.10 -I/usr/include/libxml2 -I/usr/X11R6/include -I.moc/release-static -o .obj/release-static/InspectorDatabaseResource.o inspector/InspectorDatabaseResource.cpp
inspector/DOMNodeHighlighter.cpp: In member function ‘float WebCore::FloatSize::height() const’:
inspector/DOMNodeHighlighter.cpp:304:1: internal compiler error: Segmentation fault
Please submit a full bug report,
with preprocessed source if appropriate.
See <https://bugs.gentoo.org/> for instructions.
make: *** [.obj/release-static/DOMNodeHighlighter.o] Error 1
make: *** Waiting for unfinished jobs....
* ERROR: dev-qt/qtwebkit-4.8.4 failed (compile phase):
* emake failed
*
* If you need support, post the output of `emerge --info '=dev-qt/qtwebkit-4.8.4'`,
* the complete build log and the output of `emerge -pqv '=dev-qt/qtwebkit-4.8.4'`.
* The complete build log is located at '/var/tmp/portage/dev-qt/qtwebkit-4.8.4/temp/build.log'.
* The ebuild environment file is located at '/var/tmp/portage/dev-qt/qtwebkit-4.8.4/temp/environment'.
* Working directory: '/var/tmp/portage/dev-qt/qtwebkit-4.8.4/work/qt-everywhere-opensource-src-4.8.4/src/3rdparty/webkit/Source/WebCore'
* S: '/var/tmp/portage/dev-qt/qtwebkit-4.8.4/work/qt-everywhere-opensource-src-4.8.4'
Back to top
View user's profile Send private message
DONAHUE
Watchman
Watchman


Joined: 09 Dec 2006
Posts: 6254
Location: Goose Creek SC

PostPosted: Mon Jun 24, 2013 7:43 am    Post subject: Reply with quote

memory failure or compiler bug are the frontrunners .
you might try MAKEOPTS="-j1" in make.conf while doing
Code:
emerge qtwebkit
if it runs to completion I'd suspect temperature related memory or cpu problem
or
Code:
emerge --keep-going -uND world
if only qtwebkit fails to emerge I'd suspect some really odd bug in qtwebkit source
or
emerge a newer version of gcc, 4.7.2-r1 in stable branch, http://www.gentoo.org/doc/en/gcc-upgrading.xml
or
put =dev-qt/qtwebkit-4.8.4 into /etc/portage/package.mask and see if an earlier version will run

a bug report exists suggesting qtwebkit source code may be the villain
_________________
Defund the FCC.
Back to top
View user's profile Send private message
Display posts from previous:   
Reply to topic    Gentoo Forums Forum Index Portage & Programming All times are GMT
Page 1 of 1

 
Jump to:  
You cannot post new topics in this forum
You cannot reply to topics in this forum
You cannot edit your posts in this forum
You cannot delete your posts in this forum
You cannot vote in polls in this forum