Gentoo Forums
Gentoo Forums
Gentoo Forums
Quick Search: in
Can't build guitarix
View unanswered posts
View posts from last 24 hours

 
Reply to topic    Gentoo Forums Forum Index Unsupported Software
View previous topic :: View next topic  
Author Message
russK
Tux's lil' helper
Tux's lil' helper


Joined: 27 Jun 2006
Posts: 110

PostPosted: Mon Apr 08, 2013 12:35 am    Post subject: Can't build guitarix Reply with quote

I've been trying for some time to build guitarix, from the proaudio overlay.

media-sound/guitarix2-0.25.2:0
media-sound/guitarix2-9999:0

Neither ebuild will build for me.

Here is the snippet where the error occurs with the 0.25.2 ebuild:

Code:

[140/299] cxx: build/default/libgxwmm/gxwmm/valuedisplay.cc -> build/default/libgxwmm/gxwmm/valuedisplay_83.o
[141/299] cxx: build/default/libgxwmm/gxwmm/simplevaluedisplay.cc -> build/default/libgxwmm/gxwmm/simplevaluedisplay_83.o
[142/299] cxx: build/default/libgxwmm/gxwmm/portdisplay.cc -> build/default/libgxwmm/gxwmm/portdisplay_83.o
[143/299] cxx: libgxwmm/gxwmm/init.cc -> build/default/libgxwmm/gxwmm/init_83.o
[144/299] cxx: build/default/libgxwmm/gxwmm/wrap_init.cc -> build/default/libgxwmm/gxwmm/wrap_init_83.o
In file included from /usr/include/gtkmm-2.4/gtkmm/main.h:33:0,
                 from ../libgxwmm/gxwmm/init.cc:19:
/usr/include/gdkmm-2.4/gdkmm/types.h:92:7: error: ‘Value’ is not a template
/usr/include/gdkmm-2.4/gdkmm/types.h:92:54: error: expected template-name before ‘<’ token
/usr/include/gdkmm-2.4/gdkmm/types.h:92:54: error: expected ‘{’ before ‘<’ token
/usr/include/gdkmm-2.4/gdkmm/types.h:92:54: error: expected unqualified-id before ‘<’ token
/usr/include/gdkmm-2.4/gdkmm/types.h:174:7: error: ‘Value’ is not a template
/usr/include/gdkmm-2.4/gdkmm/types.h:174:30: error: ‘Glib::Value’ is not a template type
/usr/include/gdkmm-2.4/gdkmm/types.h:174:58: error: expected template-name before ‘<’ token
/usr/include/gdkmm-2.4/gdkmm/types.h:207:7: error: ‘Value’ is not a template
/usr/include/gdkmm-2.4/gdkmm/types.h:207:24: error: ‘Glib::Value’ is not a template type
/usr/include/gdkmm-2.4/gdkmm/types.h:207:51: error: expected template-name before ‘<’ token
/usr/include/gdkmm-2.4/gdkmm/types.h:274:7: error: ‘Value’ is not a template
/usr/include/gdkmm-2.4/gdkmm/types.h:274:32: error: ‘Glib::Value’ is not a template type
/usr/include/gdkmm-2.4/gdkmm/types.h:274:60: error: expected template-name before ‘<’ token
/usr/include/gdkmm-2.4/gdkmm/types.h:357:9: error: ‘ArrayHandle’ in namespace ‘Glib’ does not name a type
/usr/include/gdkmm-2.4/gdkmm/types.h:358:9: error: ‘ListHandle’ in namespace ‘Glib’ does not name a type
In file included from ../libgxwmm/gxwmm/init.cc:19:0:
/usr/include/gtkmm-2.4/gtkmm/main.h:151:39: error: ‘Glib::OptionContext’ has not been declared
/usr/include/gtkmm-2.4/gtkmm/main.h:204:42: error: ‘Glib::OptionContext’ has not been declared
Waf: Leaving directory `/var/tmp/portage/media-sound/guitarix2-0.25.2/work/guitarix-0.25.2/build'
Build failed:  -> task failed (err #1):
   {task: cxx init.cc -> init_83.o}
 * ERROR: media-sound/guitarix2-0.25.2 failed (compile phase):
 *   build failed


Here is my emerge --info =media-sound/guitarix2-0.25.2:0

Code:

Portage 2.1.11.55 (default/linux/amd64/13.0/desktop/gnome, gcc-4.6.3, glibc-2.17, 3.7.9-gentoo x86_64)
=================================================================
                        System Settings
=================================================================
System uname: Linux-3.7.9-gentoo-x86_64-AMD_Phenom-tm-_II_X6_1045T_Processor-with-gentoo-2.1
KiB Mem:     8185408 total,    898484 free
KiB Swap:          0 total,         0 free
Timestamp of tree: Sun, 07 Apr 2013 11:00:01 +0000
ld GNU ld (GNU Binutils) 2.22
distcc 3.1 x86_64-pc-linux-gnu [disabled]
ccache version 3.1.9 [disabled]
app-shells/bash:          4.2_p37
dev-java/java-config:     2.1.12-r1
dev-lang/python:          2.7.3-r3, 3.2.3-r2
dev-util/ccache:          3.1.9
dev-util/cmake:           2.8.9
dev-util/pkgconfig:       0.28
sys-apps/baselayout:      2.1-r1
sys-apps/openrc:          0.11.8
sys-apps/sandbox:         2.5
sys-devel/autoconf:       2.13, 2.69
sys-devel/automake:       1.9.6-r3, 1.11.6, 1.12.6
sys-devel/binutils:       2.22-r1
sys-devel/gcc:            4.6.3
sys-devel/gcc-config:     1.7.3
sys-devel/libtool:        2.4-r1
sys-devel/make:           3.82-r4
sys-kernel/linux-headers: 3.7 (virtual/os-headers)
sys-libs/glibc:           2.17
Repositories: gentoo roslin squeezebox proaudio x-portage smunix seden
ACCEPT_KEYWORDS="amd64"
ACCEPT_LICENSE="* -@EULA"
CBUILD="x86_64-pc-linux-gnu"
CFLAGS="-march=amdfam10 -O2 -pipe"
CHOST="x86_64-pc-linux-gnu"
CONFIG_PROTECT="/etc /usr/share/config /usr/share/gnupg/qualified.txt /usr/share/polkit-1/actions"
CONFIG_PROTECT_MASK="${EPREFIX}/etc/gconf /etc/ca-certificates.conf /etc/dconf /etc/env.d /etc/fonts/fonts.conf /etc/gconf /etc/gentoo-release /etc/php/apache2-php5.3/ext-active/ /etc/php/apache2-php5.4/ext-active/ /etc/php/cgi-php5.3/ext-active/ /etc/php/cgi-php5.4/ext-active/ /etc/php/cli-php5.3/ext-active/ /etc/php/cli-php5.4/ext-active/ /etc/revdep-rebuild /etc/sandbox.d /etc/terminfo"
CXXFLAGS="-march=amdfam10 -O2 -pipe"
DISTDIR="/usr/portage/distfiles"
EMERGE_DEFAULT_OPTS="--quiet-build y --jobs 3"
FCFLAGS="-O2 -pipe"
FEATURES="assume-digests binpkg-logs config-protect-if-modified distlocks ebuild-locks fixlafiles merge-sync news parallel-fetch protect-owned sandbox sfperms strict unknown-features-warn unmerge-logs unmerge-orphans userfetch"
FFLAGS="-O2 -pipe"
GENTOO_MIRRORS="http://distfiles.gentoo.org"
LANG="en_US.utf8"
LDFLAGS="-Wl,-O1 -Wl,--as-needed"
MAKEOPTS="-j7"
PKGDIR="/usr/portage/packages"
PORTAGE_CONFIGROOT="/"
PORTAGE_RSYNC_OPTS="--recursive --links --safe-links --perms --times --compress --force --whole-file --delete --stats --human-readable --timeout=180 --exclude=/distfiles --exclude=/local --exclude=/packages"
PORTAGE_TMPDIR="/var/tmp"
PORTDIR="/usr/portage"
PORTDIR_OVERLAY="/var/lib/layman/roslin /var/lib/layman/squeezebox /var/lib/layman/pro-audio /usr/local/portage /usr/local/smunix/gentoo-overlay /usr/local/seden.git/seden"
SYNC="rsync://rsync.gentoo.org/gentoo-portage"
USE="3dnow 3dnowext X a52 aac acl acpi ads alsa amd64 apache2 autoipd automount avahi berkdb bindist bluetooth bluray branding bzip2 cairo cdda cddb cdr cli colord consolekit cracklib crypt css cups cxx dbus dri dts dvb dvd dvdr dvdread eds emboss encode esd evo exif exiv extensions fam ffmpeg firefox flac fluidsynth fortran g3dvl gcode gd gdbm gif git gnome gnome-keyring gnome-online-accounts gpm gsm gstreamer gtk gtk3 gudev httpd hwdb iconv introspection ipv6 jack jpeg json latin1 lcms ldap libnotify libsecret lirc lm_sensors lock lua mad mdnsresponder-compat midi mikmod minizip mjpeg mmx mmxext mng mod modules mp3 mp4 mpeg mudflap multilib mysql nautilus ncurses network nls nptl nsplugin nvidia oav ogg opengl openmp oss pam pango pcap pcre pdf perl php png policykit posix ppds pulseaudio python qt3support qt4 quicktime quotas readline samba sasl scanner sdl semantic-desktop server session sndfile snmp socialweb spell sqlite sse sse2 ssl startup-notification subversion svg swat tci tcpd theora thunar tiff timidity truetype udev udisks unicode upower usb v4l vdpau vhosts vlc vorbis webdav-neon wtap wxwidgets x264 xcb xine xml xnest xorg xv xvid zlib" ABI_X86="64" ALSA_CARDS="ali5451 als4000 atiixp atiixp-modem bt87x ca0106 cmipci emu10k1x ens1370 ens1371 es1938 es1968 fm801 hda-intel intel8x0 intel8x0m maestro3 trident usb-audio via82xx via82xx-modem ymfpci" ALSA_PCM_PLUGINS="adpcm alaw asym copy dmix dshare dsnoop empty extplug file hooks iec958 ioplug ladspa lfloat linear meter mmap_emul mulaw multi null plug rate route share shm softvol" APACHE2_MODULES="actions alias auth_basic authn_alias authn_anon authn_dbm authn_default authn_file authz_dbm authz_default authz_groupfile authz_host authz_owner authz_user autoindex cache cgi cgid dav dav_fs dav_lock deflate dir disk_cache env expires ext_filter file_cache filter headers include info log_config logio mem_cache mime mime_magic negotiation rewrite setenvif speling status unique_id userdir usertrack vhost_alias python" CALLIGRA_FEATURES="kexi words flow plan sheets stage tables krita karbon braindump" CAMERAS="ptp2" COLLECTD_PLUGINS="df interface irq load memory rrdtool swap syslog" ELIBC="glibc" GPSD_PROTOCOLS="ashtech aivdm earthmate evermore fv18 garmin garmintxt gpsclock itrax mtk3301 nmea ntrip navcom oceanserver oldstyle oncore rtcm104v2 rtcm104v3 sirf superstar2 timing tsip tripmate tnt ubx" INPUT_DEVICES="keyboard mouse evdev" KERNEL="linux" LCD_DEVICES="cfontz cfontz633 cfontzpacket" LIBREOFFICE_EXTENSIONS="presenter-console presenter-minimizer" LINGUAS="en en_US" LIRC_DEVICES="usb_uirt_raw" OFFICE_IMPLEMENTATION="libreoffice" PHP_TARGETS="php5-3" PYTHON_SINGLE_TARGET="python2_7" PYTHON_TARGETS="python2_7 python3_2" QEMU_SOFTMMU_TARGETS="x86_64 mips mipsel arm" QEMU_USER_TARGETS="arm armeb mips mipsel x86_64" RUBY_TARGETS="ruby18 ruby19" SANE_BACKENDS="hp hpaio" USERLAND="GNU" VIDEO_CARDS="nvidia" XTABLES_ADDONS="quota2 psd pknock lscan length2 ipv4options ipset ipp2p iface geoip fuzzy condition tee tarpit sysrq steal rawnat logmark ipmark dhcpmac delude chaos account"
Unset:  CPPFLAGS, CTARGET, INSTALL_MASK, LC_ALL, PORTAGE_BUNZIP2_COMMAND, PORTAGE_COMPRESS, PORTAGE_COMPRESS_FLAGS, PORTAGE_RSYNC_EXTRA_OPTS, USE_PYTHON


Thanks for any tips or info

russK
Back to top
View user's profile Send private message
megabaks
Apprentice
Apprentice


Joined: 22 Jan 2012
Posts: 237
Location: Russia && Saint-Petersburg

PostPosted: Mon Apr 08, 2013 2:35 am    Post subject: Reply with quote

again...
thread with same error ---> https://forums.gentoo.org/viewtopic-t-956334.html
simple fix ---> you need dev-cpp/gtkmm-2.24.2
_________________
sorry my bad english
Back to top
View user's profile Send private message
russK
Tux's lil' helper
Tux's lil' helper


Joined: 27 Jun 2006
Posts: 110

PostPosted: Mon Apr 08, 2013 11:56 am    Post subject: Reply with quote

Thanks, I downgraded gtkmm:2.4, but still an error. I have seen this one too on previous attempts, strange segmentation fault:

Code:

[142/299] cxx: build/default/libgxwmm/gxwmm/portdisplay.cc -> build/default/libgxwmm/gxwmm/portdisplay_83.o
[143/299] cxx: libgxwmm/gxwmm/init.cc -> build/default/libgxwmm/gxwmm/init_83.o
[144/299] cxx: build/default/libgxwmm/gxwmm/wrap_init.cc -> build/default/libgxwmm/gxwmm/wrap_init_83.o
[145/299] cxx_link: build/default/libgxwmm/gxwmm/controlparameter_83.o build/default/libgxwmm/gxwmm/switch_83.o build/default/libgxwmm/gxwmm/regler_83.o build/default/libgxwmm/gxwmm/knob_83.o build/default/libgxwmm/gxwmm/bigknob_83.o build/default/libgxwmm/gxwmm/smallknob_83.o build/default/libgxwmm/gxwmm/smallknobr_83.o build/default/libgxwmm/gxwmm/tuner_83.o build/default/libgxwmm/gxwmm/racktuner_83.o build/default/libgxwmm/gxwmm/fastmeter_83.o build/default/libgxwmm/gxwmm/waveview_83.o build/default/libgxwmm/gxwmm/selector_83.o build/default/libgxwmm/gxwmm/toggleimage_83.o build/default/libgxwmm/gxwmm/iredit_83.o build/default/libgxwmm/gxwmm/radiobutton_83.o build/default/libgxwmm/gxwmm/wheel_83.o build/default/libgxwmm/gxwmm/wheelvertical_83.o build/default/libgxwmm/gxwmm/hslider_83.o build/default/libgxwmm/gxwmm/minislider_83.o build/default/libgxwmm/gxwmm/vslider_83.o build/default/libgxwmm/gxwmm/eqslider_83.o build/default/libgxwmm/gxwmm/levelslider_83.o build/default/libgxwmm/gxwmm/paintbox_83.o build/default/libgxwmm/gxwmm/meterscale_83.o build/default/libgxwmm/gxwmm/valuedisplay_83.o build/default/libgxwmm/gxwmm/simplevaluedisplay_83.o build/default/libgxwmm/gxwmm/portdisplay_83.o build/default/libgxwmm/gxwmm/init_83.o build/default/libgxwmm/gxwmm/wrap_init_83.o -> build/default/libgxwmm/gxwmm/libgxwmm.so
[146/299] fakelibtool: build/default/libgxwmm/gxwmm/libgxwmm.so -> build/default/libgxwmm/gxwmm/libgxwmm.la
[147/299] vnum: build/default/libgxwmm/gxwmm/libgxwmm.so -> build/default/libgxwmm/gxwmm/libgxwmm.so.0
[148/299] cxx: libgxwmm/gxw_demo.cc -> build/default/libgxwmm/gxw_demo_1.o
[149/299] cxx_link: build/default/libgxwmm/gxw_demo_1.o -> build/default/libgxwmm/gxw_demo
[150/299] h2defs: libgxw/gxw/GxTuner.h libgxw/gxw/GxFastMeter.h libgxw/gxw/GxWaveView.h libgxw/gxw/GxRegler.h libgxw/gxw/GxSelector.h libgxw/gxw/GxSwitch.h libgxw/gxw/GxToggleImage.h libgxw/gxw/GxControlParameter.h libgxw/gxw/GxIREdit.h libgxw/gxw/GxRadioButton.h libgxw/gxw/GxWheel.h libgxw/gxw/GxWheelVertical.h libgxw/gxw/GxKnob.h libgxw/gxw/GxBigKnob.h libgxw/gxw/GxSmallKnob.h libgxw/gxw/GxSmallKnobR.h libgxw/gxw/GxHSlider.h libgxw/gxw/GxMiniSlider.h libgxw/gxw/GxVSlider.h libgxw/gxw/GxEQSlider.h libgxw/gxw/GxLevelSlider.h libgxw/gxw/GxPaintBox.h libgxw/gxw/GxMeterScale.h libgxw/gxw/GxGradient.h libgxw/gxw/GxValueDisplay.h libgxw/gxw/GxRackTuner.h -> build/default/pygxw/gxw.defs
/bin/sh: line 1: 15564 Segmentation fault      python '/usr/lib64/python2.7/site-packages/gtk-2.0/codegen'/defsgen.py -m gx -l default/libgxw/gxw/libgxw.so -f '../pygxw/gxw-manual.defs' '../libgxw/gxw/GxTuner.h' '../libgxw/gxw/GxFastMeter.h' '../libgxw/gxw/GxWaveView.h' '../libgxw/gxw/GxRegler.h' '../libgxw/gxw/GxSelector.h' '../libgxw/gxw/GxSwitch.h' '../libgxw/gxw/GxToggleImage.h' '../libgxw/gxw/GxControlParameter.h' '../libgxw/gxw/GxIREdit.h' '../libgxw/gxw/GxRadioButton.h' '../libgxw/gxw/GxWheel.h' '../libgxw/gxw/GxWheelVertical.h' '../libgxw/gxw/GxKnob.h' '../libgxw/gxw/GxBigKnob.h' '../libgxw/gxw/GxSmallKnob.h' '../libgxw/gxw/GxSmallKnobR.h' '../libgxw/gxw/GxHSlider.h' '../libgxw/gxw/GxMiniSlider.h' '../libgxw/gxw/GxVSlider.h' '../libgxw/gxw/GxEQSlider.h' '../libgxw/gxw/GxLevelSlider.h' '../libgxw/gxw/GxPaintBox.h' '../libgxw/gxw/GxMeterScale.h' '../libgxw/gxw/GxGradient.h' '../libgxw/gxw/GxValueDisplay.h' '../libgxw/gxw/GxRackTuner.h' > 'default/pygxw/gxw.defs'
Waf: Leaving directory `/var/tmp/portage/media-sound/guitarix2-0.25.2/work/guitarix-0.25.2/build'
Build failed:  -> task failed (err #139):
   {task: h2defs GxTuner.h,GxFastMeter.h,GxWaveView.h,GxRegler.h,GxSelector.h,GxSwitch.h,GxToggleImage.h,GxControlParameter.h,GxIREdit.h,GxRadioButton.h,GxWheel.h,GxWheelVertical.h,GxKnob.h,GxBigKnob.h,GxSmallKnob.h,GxSmallKnobR.h,GxHSlider.h,GxMiniSlider.h,GxVSlider.h,GxEQSlider.h,GxLevelSlider.h,GxPaintBox.h,GxMeterScale.h,GxGradient.h,GxValueDisplay.h,GxRackTuner.h -> gxw.defs}
 * ERROR: media-sound/guitarix2-0.25.2 failed (compile phase):
 *   build failed
 *
Back to top
View user's profile Send private message
megabaks
Apprentice
Apprentice


Joined: 22 Jan 2012
Posts: 237
Location: Russia && Saint-Petersburg

PostPosted: Mon Apr 08, 2013 12:03 pm    Post subject: Reply with quote

revdep-rebuild
python-updater
_________________
sorry my bad english
Back to top
View user's profile Send private message
russK
Tux's lil' helper
Tux's lil' helper


Joined: 27 Jun 2006
Posts: 110

PostPosted: Tue Apr 09, 2013 11:59 pm    Post subject: Reply with quote

megabaks wrote:
revdep-rebuild
python-updater


Thanks but it didnt' work. I have even done 'emerge -e @world', I am still getting the segfault.

Any other ideas?

I did an strace -f of the "./waf build" and there is a lot of output, I'm not sure what to look for, but I noticed something about locales.
I can post the output if it would help.


Thanks
Back to top
View user's profile Send private message
russK
Tux's lil' helper
Tux's lil' helper


Joined: 27 Jun 2006
Posts: 110

PostPosted: Wed Apr 10, 2013 11:10 pm    Post subject: Reply with quote

I finally got the emerge to succeed by putting -python in the USE flags for the package. I think it should be ok for me, I just want to play guitar. :D
Back to top
View user's profile Send private message
Jimmy Jazz
Apprentice
Apprentice


Joined: 04 Oct 2004
Posts: 273
Location: Strasbourg

PostPosted: Thu Apr 11, 2013 5:08 pm    Post subject: Re: Can't build guitarix Reply with quote

russK wrote:
I've been trying for some time to build guitarix, from the proaudio overlay.

media-sound/guitarix2-0.25.2:0
media-sound/guitarix2-9999:0

Neither ebuild will build for me.

Here is the snippet where the error occurs with the 0.25.2 ebuild:


I have opened a bug report. Perhaps it will resolve your issue.
https://bugs.gentoo.org/show_bug.cgi?id=465550
_________________
« La seule condition au triomphe du mal, c'est l'inaction des gens de bien » E.Burke
Code:

+----+----+----+
|    |::::|    |
|    |::::|    |
+----+----+----+

motto: WeLCRO
WritE Less Code, Repeat Often
Back to top
View user's profile Send private message
Display posts from previous:   
Reply to topic    Gentoo Forums Forum Index Unsupported Software All times are GMT
Page 1 of 1

 
Jump to:  
You cannot post new topics in this forum
You cannot reply to topics in this forum
You cannot edit your posts in this forum
You cannot delete your posts in this forum
You cannot vote in polls in this forum