Gentoo Forums
Gentoo Forums
Gentoo Forums
Quick Search: in
Gnome 3 install and net-libs/webkit-gtk-2.4.4-r1
View unanswered posts
View posts from last 24 hours

 
Reply to topic    Gentoo Forums Forum Index Desktop Environments
View previous topic :: View next topic  
Author Message
kinappynow
n00b
n00b


Joined: 20 Oct 2014
Posts: 6

PostPosted: Sat Oct 25, 2014 5:58 pm    Post subject: Gnome 3 install and net-libs/webkit-gtk-2.4.4-r1 Reply with quote

Hi All,

Can anybody advise the best way around this?

Thanks


Source/WebKit/gtk/webkit/webkitversion.h:37: Warning: WebKit: symbol='WEBKITGTK_API_VERSION': Unknown namespace for symbol 'WEBKITGTK_API_VERSION'
/var/tmp/portage/net-libs/webkit-gtk-2.4.4-r1/work/webkitgtk-2.4.4/.libs/libwebkitgtk-3.0.so: undefined reference to `_ZNSt6chrono12steady_clock3nowEv@GLIBCXX_3.4.17'
collect2: error: ld returned 1 exit status
linking of temporary binary failed: Command '['/bin/sh', './libtool', '--mode=link', '--tag=CC', '--silent', 'x86_64-pc-linux-gnu-gcc', '-o', '/var/tmp/portage/net-libs/webkit-gtk-2.4.4-r1/work/webkitgtk-2.4.4/tmp-introspectFsVfdk/WebKit-3.0', '-export-dynamic', '-march=native', '-O2', '-pipe', '-pthread', '-std=c99', '-Wno-deprecated-declarations', '-Wl,-O1', '-Wl,--as-needed', '-Wl,--no-keep-memory', '-Wl,--reduce-memory-overheads', '-Wl,--no-demangle', '/var/tmp/portage/net-libs/webkit-gtk-2.4.4-r1/work/webkitgtk-2.4.4/tmp-introspectFsVfdk/WebKit-3.0.o', '-L.', '-lwebkitgtk-3.0', '-ljavascriptcoregtk-3.0', '-Wl,--export-dynamic', '-lgmodule-2.0', '-pthread', '-lgtk-3', '-lgdk-3', '-lpangocairo-1.0', '-lpango-1.0', '-latk-1.0', '-lcairo-gobject', '-lcairo', '-lgdk_pixbuf-2.0', '-lsoup-2.4', '-lgio-2.0', '-lgobject-2.0', '-lglib-2.0']' returned non-zero exit status 1
GNUmakefile:82177: recipe for target 'WebKit-3.0.gir' failed
make[1]: *** [WebKit-3.0.gir] Error 1
libtool: link: (cd ".libs" && rm -f "libwebkit2gtk-3.0.so.25" && ln -s "libwebkit2gtk-3.0.so.25.10.7" "libwebkit2gtk-3.0.so.25")
libtool: link: (cd ".libs" && rm -f "libwebkit2gtk-3.0.so" && ln -s "libwebkit2gtk-3.0.so.25.10.7" "libwebkit2gtk-3.0.so")
libtool: link: ( cd ".libs" && rm -f "libwebkit2gtk-3.0.la" && ln -s "../libwebkit2gtk-3.0.la" "libwebkit2gtk-3.0.la" )
make[1]: Leaving directory '/var/tmp/portage/net-libs/webkit-gtk-2.4.4-r1/work/webkitgtk-2.4.4'
GNUmakefile:25562: recipe for target 'all' failed
make: *** [all] Error 2
* ERROR: net-libs/webkit-gtk-2.4.4-r1::gentoo failed (compile phase):
* emake failed
*
* If you need support, post the output of `emerge --info '=net-libs/webkit-gtk-2.4.4-r1::gentoo'`,
* the complete build log and the output of `emerge -pqv '=net-libs/webkit-gtk-2.4.4-r1::gentoo'`.
* The complete build log is located at '/var/tmp/portage/net-libs/webkit-gtk-2.4.4-r1/temp/build.log'.
* The ebuild environment file is located at '/var/tmp/portage/net-libs/webkit-gtk-2.4.4-r1/temp/environment'.
* Working directory: '/var/tmp/portage/net-libs/webkit-gtk-2.4.4-r1/work/webkitgtk-2.4.4'
* S: '/var/tmp/portage/net-libs/webkit-gtk-2.4.4-r1/work/webkitgtk-2.4.4'

>>> Failed to emerge net-libs/webkit-gtk-2.4.4-r1, Log file:

>>> '/var/tmp/portage/net-libs/webkit-gtk-2.4.4-r1/temp/build.log'

* Messages for package net-libs/webkit-gtk-2.4.4-r1:

* ERROR: net-libs/webkit-gtk-2.4.4-r1::gentoo failed (compile phase):
* emake failed
*
* If you need support, post the output of `emerge --info '=net-libs/webkit-gtk-2.4.4-r1::gentoo'`,
* the complete build log and the output of `emerge -pqv '=net-libs/webkit-gtk-2.4.4-r1::gentoo'`.
* The complete build log is located at '/var/tmp/portage/net-libs/webkit-gtk-2.4.4-r1/temp/build.log'.
* The ebuild environment file is located at '/var/tmp/portage/net-libs/webkit-gtk-2.4.4-r1/temp/environment'.
* Working directory: '/var/tmp/portage/net-libs/webkit-gtk-2.4.4-r1/work/webkitgtk-2.4.4'
* S: '/var/tmp/portage/net-libs/webkit-gtk-2.4.4-r1/work/webkitgtk-2.4.4'





emerge --info '=net-libs/webkit-gtk-2.4.4-r1::gentoo'
Portage 2.2.8-r2 (default/linux/amd64/13.0/desktop/gnome/systemd, gcc-4.7.3, glibc-2.19-r1, 3.16.5-gentoo x86_64)
=================================================================
System Settings
=================================================================
System uname: Linux-3.16.5-gentoo-x86_64-Intel-R-_Core-TM-_i5-3570_CPU_@_3.40GHz-with-gentoo-2.2
KiB Mem: 16339376 total, 12493016 free
KiB Swap: 16777212 total, 16777212 free
Timestamp of tree: Sat, 25 Oct 2014 11:00:01 +0000
ld GNU ld (Gentoo 2.23.2 p1.0) 2.23.2
app-shells/bash: 4.2_p53
dev-lang/perl: 5.18.2-r2
dev-lang/python: 2.7.7, 3.3.5-r1, 3.4.1
dev-util/cmake: 2.8.12.2-r1
dev-util/pkgconfig: 0.28-r1
sys-apps/baselayout: 2.2
sys-apps/openrc: 0.12.4
sys-apps/sandbox: 2.6-r1
sys-devel/autoconf: 2.13, 2.69
sys-devel/automake: 1.11.6, 1.13.4
sys-devel/binutils: 2.23.2
sys-devel/gcc: 4.7.3-r1, 4.8.3
sys-devel/gcc-config: 1.7.3
sys-devel/libtool: 2.4.2-r1
sys-devel/make: 4.0-r1
sys-kernel/linux-headers: 3.13 (virtual/os-headers)
sys-libs/glibc: 2.19-r1
Repositories: gentoo
ACCEPT_KEYWORDS="amd64"
ACCEPT_LICENSE="* -@EULA"
CBUILD="x86_64-pc-linux-gnu"
CFLAGS="-march=native -O2 -pipe"
CHOST="x86_64-pc-linux-gnu"
CONFIG_PROTECT="/etc /usr/share/gnupg/qualified.txt"
CONFIG_PROTECT_MASK="/etc/ca-certificates.conf /etc/dconf /etc/env.d /etc/fonts/fonts.conf /etc/gconf /etc/gentoo-release /etc/sandbox.d /etc/terminfo"
CXXFLAGS="-march=native -O2 -pipe"
DISTDIR="/usr/portage/distfiles"
FCFLAGS="-O2 -pipe"
FEATURES="assume-digests binpkg-logs config-protect-if-modified distlocks ebuild-locks fixlafiles merge-sync news parallel-fetch preserve-libs protect-owned sandbox sfperms strict unknown-features-warn unmerge-logs unmerge-orphans userfetch userpriv usersandbox usersync"
FFLAGS="-O2 -pipe"
GENTOO_MIRRORS="http://distfiles.gentoo.org"
LDFLAGS="-Wl,-O1 -Wl,--as-needed"
MAKEOPTS="-j5"
PKGDIR="/usr/portage/packages"
PORTAGE_CONFIGROOT="/"
PORTAGE_RSYNC_OPTS="--recursive --links --safe-links --perms --times --omit-dir-times --compress --force --whole-file --delete --stats --human-readable --timeout=180 --exclude=/distfiles --exclude=/local --exclude=/packages"
PORTAGE_TMPDIR="/var/tmp"
PORTDIR="/usr/portage"
PORTDIR_OVERLAY=""
USE="X a52 aac acl acpi alsa amd64 berkdb bluetooth branding bzip2 cairo cdda cdr cli colord cracklib crypt cups cxx dbus dri dts dvd dvdr eds emboss encode evo exif fam firefox flac fortran gdbm gif glamor gnome gnome-keyring gnome-online-accounts gpm gstreamer gtk iconv introspection ipv6 jpeg lcms ldap libnotify libsecret mad mmx mng modules mp3 mp4 mpeg multilib nautilus ncurses nls nptl ogg opengl openmp pam pango pcre pdf png policykit ppds pulseaudio qt3support readline sdl session socialweb spell sse sse2 ssl startup-notification svg systemd tcpd tiff truetype udev udisks unicode upower usb vorbis wxwidgets x264 xcb xml xv xvid zlib" ABI_X86="64" ALSA_CARDS="ali5451 als4000 atiixp atiixp-modem bt87x ca0106 cmipci emu10k1x ens1370 ens1371 es1938 es1968 fm801 hda-intel intel8x0 intel8x0m maestro3 trident usb-audio via82xx via82xx-modem ymfpci" APACHE2_MODULES="authn_core authz_core socache_shmcb unixd actions alias auth_basic authn_alias authn_anon authn_dbm authn_default authn_file authz_dbm authz_default authz_groupfile authz_host authz_owner authz_user autoindex cache cgi cgid dav dav_fs dav_lock deflate dir disk_cache env expires ext_filter file_cache filter headers include info log_config logio mem_cache mime mime_magic negotiation rewrite setenvif speling status unique_id userdir usertrack vhost_alias" CALLIGRA_FEATURES="kexi words flow plan sheets stage tables krita karbon braindump author" CAMERAS="ptp2" COLLECTD_PLUGINS="df interface irq load memory rrdtool swap syslog" ELIBC="glibc" GPSD_PROTOCOLS="ashtech aivdm earthmate evermore fv18 garmin garmintxt gpsclock itrax mtk3301 nmea ntrip navcom oceanserver oldstyle oncore rtcm104v2 rtcm104v3 sirf superstar2 timing tsip tripmate tnt ublox ubx" INPUT_DEVICES="evdev" KERNEL="linux" LCD_DEVICES="bayrad cfontz cfontz633 glk hd44780 lb216 lcdm001 mtxorb ncurses text" LIBREOFFICE_EXTENSIONS="presenter-console presenter-minimizer" OFFICE_IMPLEMENTATION="libreoffice" PHP_TARGETS="php5-5" PYTHON_SINGLE_TARGET="python2_7" PYTHON_TARGETS="python2_7 python3_3" RUBY_TARGETS="ruby19 ruby20" USERLAND="GNU" VIDEO_CARDS="nvidia" XTABLES_ADDONS="quota2 psd pknock lscan length2 ipv4options ipset ipp2p iface geoip fuzzy condition tee tarpit sysrq steal rawnat logmark ipmark dhcpmac delude chaos account"
Unset: CPPFLAGS, CTARGET, EMERGE_DEFAULT_OPTS, INSTALL_MASK, LANG, LC_ALL, PORTAGE_BUNZIP2_COMMAND, PORTAGE_COMPRESS, PORTAGE_COMPRESS_FLAGS, PORTAGE_RSYNC_EXTRA_OPTS, SYNC, USE_PYTHON





emerge -pqv '=net-libs/webkit-gtk-2.4.4-r1::gentoo'
[ebuild N ] net-libs/webkit-gtk-2.4.4-r1 USE="X egl geoloc gstreamer introspection jit libsecret opengl spell webgl (-aqua) -coverage -debug -gles2 {-test} -wayland"

* IMPORTANT: 8 news items need reading for repository 'gentoo'.
* Use eselect news to read news items.
Back to top
View user's profile Send private message
comprookie2000
Developer
Developer


Joined: 25 Jul 2004
Posts: 919
Location: Sun City Center, Florida

PostPosted: Sat Oct 25, 2014 8:03 pm    Post subject: Reply with quote

Looks like BUG 513386
https://bugs.gentoo.org/show_bug.cgi?id=513386
_________________
http://dev.gentoo.org/~dabbott/
Back to top
View user's profile Send private message
harryrage
n00b
n00b


Joined: 28 Oct 2014
Posts: 9

PostPosted: Tue Oct 28, 2014 4:48 pm    Post subject: Reply with quote

using gcc-4.8.3 worked for me as it is recommended @ the bugreport which was pointed out by comprookie2000.

check if gcc-4.8.3 is installed:
gcc-config -l

you will get something like:
[1] armv6j-hardfloat-linux-gnueabi-4.7.3 *
[2] armv6j-hardfloat-linux-gnueabi-4.7.3-hardenednopie
[3] armv6j-hardfloat-linux-gnueabi-4.7.3-hardenednopiessp
[4] armv6j-hardfloat-linux-gnueabi-4.7.3-hardenednossp
[5] armv6j-hardfloat-linux-gnueabi-4.7.3-vanilla
[6] armv6j-hardfloat-linux-gnueabi-4.8.3
[7] armv6j-hardfloat-linux-gnueabi-4.8.3-hardenednopie
[8] armv6j-hardfloat-linux-gnueabi-4.8.3-hardenednopiessp
[9] armv6j-hardfloat-linux-gnueabi-4.8.3-hardenednossp
[10] armv6j-hardfloat-linux-gnueabi-4.8.3-vanilla

[11] x86_64-pc-linux-gnu-4.7.3
[12] x86_64-pc-linux-gnu-4.7.3-hardenednopie
[13] x86_64-pc-linux-gnu-4.7.3-hardenednopiessp
[14] x86_64-pc-linux-gnu-4.7.3-hardenednossp
[15] x86_64-pc-linux-gnu-4.7.3-vanilla
[16] x86_64-pc-linux-gnu-4.8.3
[17] x86_64-pc-linux-gnu-4.8.3-hardenednopie
[18] x86_64-pc-linux-gnu-4.8.3-hardenednopiessp
[19] x86_64-pc-linux-gnu-4.8.3-hardenednossp *
[20] x86_64-pc-linux-gnu-4.8.3-vanilla

choose the appropriate gcc-profile for your configuration. For most cases it is:
gcc-config 16
. /etc/profile && env-update
emerge -avuDN net-libs/webkit-gtk
Back to top
View user's profile Send private message
kinappynow
n00b
n00b


Joined: 20 Oct 2014
Posts: 6

PostPosted: Tue Oct 28, 2014 10:56 pm    Post subject: Reply with quote

Same for me also.

I change to gcc-4.8.3 and everything went ok afterwards.

I also read that an emerge -e was not required but as this was a spare drive I decided to try it and the whole emerge went ok.
Back to top
View user's profile Send private message
Mgiese
Veteran
Veteran


Joined: 23 Mar 2005
Posts: 1411
Location: indiana

PostPosted: Sat Jan 03, 2015 12:42 pm    Post subject: Reply with quote

thanks for the info! same problem here with net-libs/webkit-gtk-2.4.7 :

Code:
Source/WebKit/gtk/webkit/webkitversion.h:37: Warning: WebKit: symbol='WEBKITGTK_API_VERSION': Unknown namespace for symbol 'WEBKITGTK_API_VERSION'
/var/tmp/portage/net-libs/webkit-gtk-2.4.7/work/webkitgtk-2.4.7/.libs/libwebkitgtk-3.0.so: undefined reference to `_ZNSt6chrono12steady_clock3nowEv@GLIBCXX_3.4.17'
collect2: error: ld returned 1 exit status
linking of temporary binary failed: Command '['/bin/sh', './libtool', '--mode=link', '--tag=CC', '--silent', 'x86_64-pc-linux-gnu-gcc', '-o', '/var/tmp/portage/net-libs/webkit-gtk-2.4.7/work/webkitgtk-2.4.7/tmp-introspectgl8gyy/WebKit-3.0', '-export-dynamic', '-O3', '-pipe', '-march=native', '-pthread', '-std=c99', '-Wno-deprecated-declarations', '-Wl,-O1', '-Wl,--as-needed', '-Wl,--no-keep-memory', '-Wl,--reduce-memory-overheads', '-Wl,--no-demangle', '/var/tmp/portage/net-libs/webkit-gtk-2.4.7/work/webkitgtk-2.4.7/tmp-introspectgl8gyy/WebKit-3.0.o', '-L.', '-lwebkitgtk-3.0', '-ljavascriptcoregtk-3.0', '-Wl,--export-dynamic', '-lgmodule-2.0', '-pthread', '-lgtk-3', '-lgdk-3', '-lpangocairo-1.0', '-lpango-1.0', '-latk-1.0', '-lcairo-gobject', '-lcairo', '-lgdk_pixbuf-2.0', '-lsoup-2.4', '-lgio-2.0', '-lgobject-2.0', '-lglib-2.0']' returned non-zero exit status 1
GNUmakefile:82185: recipe for target 'WebKit-3.0.gir' failed
make[1]: *** [WebKit-3.0.gir] Error 1
libtool: link: (cd ".libs" && rm -f "libwebkit2gtk-3.0.so.25" && ln -s "libwebkit2gtk-3.0.so.25.10.10" "libwebkit2gtk-3.0.so.25")
libtool: link: (cd ".libs" && rm -f "libwebkit2gtk-3.0.so" && ln -s "libwebkit2gtk-3.0.so.25.10.10" "libwebkit2gtk-3.0.so")
libtool: link: ( cd ".libs" && rm -f "libwebkit2gtk-3.0.la" && ln -s "../libwebkit2gtk-3.0.la" "libwebkit2gtk-3.0.la" )
make[1]: Leaving directory '/var/tmp/portage/net-libs/webkit-gtk-2.4.7/work/webkitgtk-2.4.7'
GNUmakefile:25575: recipe for target 'all' failed
make: *** [all] Error 2


can not yet confirm if the above mentioned fix will help.. still compiling


edit : It worked. Thank you!
_________________
I do not have a Superman complex, for I am God not Superman :D
Back to top
View user's profile Send private message
Display posts from previous:   
Reply to topic    Gentoo Forums Forum Index Desktop Environments All times are GMT
Page 1 of 1

 
Jump to:  
You cannot post new topics in this forum
You cannot reply to topics in this forum
You cannot edit your posts in this forum
You cannot delete your posts in this forum
You cannot vote in polls in this forum