Gentoo Forums
Gentoo Forums
Gentoo Forums
Quick Search: in
emerge failed on sys-libs/glibc-2.14.1-r3 (sparc) [RESOLVED]
View unanswered posts
View posts from last 24 hours

 
Reply to topic    Gentoo Forums Forum Index Portage & Programming
View previous topic :: View next topic  
Author Message
brianakee
Tux's lil' helper
Tux's lil' helper


Joined: 16 Aug 2002
Posts: 78

PostPosted: Wed Jun 13, 2012 8:41 pm    Post subject: emerge failed on sys-libs/glibc-2.14.1-r3 (sparc) [RESOLVED] Reply with quote

while updating my system I have run into a few issues, one of which is that while trying to update glibc, I get some errors:
Code:
.././scripts/mkinstalldirs /var/tmp/portage/sys-libs/glibc-2.14.1-r3/work/build-sparc32-sparc-unknown-linux-gnu-nptl/sunrpc/rpcsvc
CPP='sparc-unknown-linux-gnu-gcc  -E -x c-header'  /var/tmp/portage/sys-libs/glibc-2.14.1-r3/work/build-sparc32-sparc-unknown-linux-gnu-nptl/elf/ld-linux.so.2 --library-path /var/tmp/portage/sys-libs/glibc-2.14.1-r3/work/build-sparc32-sparc-unknown-linux-gnu-nptl:/var/tmp/portage/sys-libs/glibc-2.14.1-r3/work/build-sparc32-sparc-unknown-linux-gnu-nptl/math:/var/tmp/portage/sys-libs/glibc-2.14.1-r3/work/build-sparc32-sparc-unknown-linux-gnu-nptl/elf:/var/tmp/portage/sys-libs/glibc-2.14.1-r3/work/build-sparc32-sparc-unknown-linux-gnu-nptl/dlfcn:/var/tmp/portage/sys-libs/glibc-2.14.1-r3/work/build-sparc32-sparc-unknown-linux-gnu-nptl/nss:/var/tmp/portage/sys-libs/glibc-2.14.1-r3/work/build-sparc32-sparc-unknown-linux-gnu-nptl/nis:/var/tmp/portage/sys-libs/glibc-2.14.1-r3/work/build-sparc32-sparc-unknown-linux-gnu-nptl/rt:/var/tmp/portage/sys-libs/glibc-2.14.1-r3/work/build-sparc32-sparc-unknown-linux-gnu-nptl/resolv:/var/tmp/portage/sys-libs/glibc-2.14.1-r3/work/build-sparc32-sparc-unknown-linux-gnu-nptl/crypt:/var/tmp/portage/sys-libs/glibc-2.14.1-r3/work/build-sparc32-sparc-unknown-linux-gnu-nptl/nptl /var/tmp/portage/sys-libs/glibc-2.14.1-r3/work/build-sparc32-sparc-unknown-linux-gnu-nptl/sunrpc/rpcgen -Y ../scripts -c rpcsvc/bootparam_prot.x -o /var/tmp/portage/sys-libs/glibc-2.14.1-r3/work/build-sparc32-sparc-unknown-linux-gnu-nptl/sunrpc/xbootparam_prot.T
mkdir /var/tmp/portage/sys-libs/glibc-2.14.1-r3/work/build-sparc32-sparc-unknown-linux-gnu-nptl/sunrpc/rpcsvc
CPP='sparc-unknown-linux-gnu-gcc  -E -x c-header'  /var/tmp/portage/sys-libs/glibc-2.14.1-r3/work/build-sparc32-sparc-unknown-linux-gnu-nptl/elf/ld-linux.so.2 --library-path /var/tmp/portage/sys-libs/glibc-2.14.1-r3/work/build-sparc32-sparc-unknown-linux-gnu-nptl:/var/tmp/portage/sys-libs/glibc-2.14.1-r3/work/build-sparc32-sparc-unknown-linux-gnu-nptl/math:/var/tmp/portage/sys-libs/glibc-2.14.1-r3/work/build-sparc32-sparc-unknown-linux-gnu-nptl/elf:/var/tmp/portage/sys-libs/glibc-2.14.1-r3/work/build-sparc32-sparc-unknown-linux-gnu-nptl/dlfcn:/var/tmp/portage/sys-libs/glibc-2.14.1-r3/work/build-sparc32-sparc-unknown-linux-gnu-nptl/nss:/var/tmp/portage/sys-libs/glibc-2.14.1-r3/work/build-sparc32-sparc-unknown-linux-gnu-nptl/nis:/var/tmp/portage/sys-libs/glibc-2.14.1-r3/work/build-sparc32-sparc-unknown-linux-gnu-nptl/rt:/var/tmp/portage/sys-libs/glibc-2.14.1-r3/work/build-sparc32-sparc-unknown-linux-gnu-nptl/resolv:/var/tmp/portage/sys-libs/glibc-2.14.1-r3/work/build-sparc32-sparc-unknown-linux-gnu-nptl/crypt:/var/tmp/portage/sys-libs/glibc-2.14.1-r3/work/build-sparc32-sparc-unknown-linux-gnu-nptl/nptl /var/tmp/portage/sys-libs/glibc-2.14.1-r3/work/build-sparc32-sparc-unknown-linux-gnu-nptl/sunrpc/rpcgen -Y ../scripts -h rpcsvc/bootparam_prot.x -o /var/tmp/portage/sys-libs/glibc-2.14.1-r3/work/build-sparc32-sparc-unknown-linux-gnu-nptl/sunrpc/rpcsvc/bootparam_prot.T
make[2]: *** [/var/tmp/portage/sys-libs/glibc-2.14.1-r3/work/build-sparc32-sparc-unknown-linux-gnu-nptl/sunrpc/rpcsvc/bootparam_prot.stmp] Segmentation fault
make[2]: *** Waiting for unfinished jobs....
make[2]: *** [/var/tmp/portage/sys-libs/glibc-2.14.1-r3/work/build-sparc32-sparc-unknown-linux-gnu-nptl/sunrpc/xbootparam_prot.stmp] Segmentation fault
make[2]: Leaving directory `/var/tmp/portage/sys-libs/glibc-2.14.1-r3/work/glibc-2.14.1/sunrpc'
make[1]: *** [sunrpc/others] Error 2
make[1]: Leaving directory `/var/tmp/portage/sys-libs/glibc-2.14.1-r3/work/glibc-2.14.1'
make: *** [all] Error 2
emake failed
 * ERROR: sys-libs/glibc-2.14.1-r3 failed (compile phase):
 *   make for sparc32 failed
 *
 * Call stack:
 *           ebuild.sh, line   85:  Called src_compile
 *         environment, line 3479:  Called eblit-run 'src_compile'
 *         environment, line  875:  Called eblit-glibc-src_compile
 *   src_compile.eblit, line  219:  Called toolchain-glibc_src_compile
 *   src_compile.eblit, line  130:  Called die
 * The specific snippet of code:
 *              emake || die "make for ${ABI} failed"
 *
 * If you need support, post the output of 'emerge --info =sys-libs/glibc-2.14.1-r3',
 * the complete build log and the output of 'emerge -pqv =sys-libs/glibc-2.14.1-r3'.
 * The complete build log is located at '/var/tmp/portage/sys-libs/glibc-2.14.1-r3/temp/build.log'.
 * The ebuild environment file is located at '/var/tmp/portage/sys-libs/glibc-2.14.1-r3/temp/environment'.
 * S: '/var/tmp/portage/sys-libs/glibc-2.14.1-r3/work/glibc-2.14.1'

>>> Failed to emerge sys-libs/glibc-2.14.1-r3, Log file:

>>>  '/var/tmp/portage/sys-libs/glibc-2.14.1-r3/temp/build.log'

 * Messages for package sys-libs/glibc-2.14.1-r3:

 * ERROR: sys-libs/glibc-2.14.1-r3 failed (compile phase):
 *   make for sparc32 failed
 *
 * Call stack:
 *           ebuild.sh, line   85:  Called src_compile
 *         environment, line 3479:  Called eblit-run 'src_compile'
 *         environment, line  875:  Called eblit-glibc-src_compile
 *   src_compile.eblit, line  219:  Called toolchain-glibc_src_compile
 *   src_compile.eblit, line  130:  Called die
 * The specific snippet of code:
 *              emake || die "make for ${ABI} failed"
 *
 * If you need support, post the output of 'emerge --info =sys-libs/glibc-2.14.1-r3',
 * the complete build log and the output of 'emerge -pqv =sys-libs/glibc-2.14.1-r3'.
 * The complete build log is located at '/var/tmp/portage/sys-libs/glibc-2.14.1-r3/temp/build.log'.
 * The ebuild environment file is located at '/var/tmp/portage/sys-libs/glibc-2.14.1-r3/temp/environment'.
 * S: '/var/tmp/portage/sys-libs/glibc-2.14.1-r3/work/glibc-2.14.1'


emerge --info =sys-libs/glibc-2.14.1-r3:
Code:
Portage 2.1.10.49 (default/linux/sparc/10.0/server, gcc-4.5.3, glibc-2.13-r4, 2.6.38-gentoo-r6 sparc64)
=================================================================
                        System Settings
=================================================================
System uname: Linux-2.6.38-gentoo-r6-sparc64-sun4u-with-gentoo-2.0.3
Timestamp of tree: Tue, 12 Jun 2012 18:15:01 +0000
app-shells/bash:          4.2_p20
dev-lang/python:          2.7.2-r3
dev-util/pkgconfig:       0.26
sys-apps/baselayout:      2.0.3
sys-apps/openrc:          0.9.8.4
sys-apps/sandbox:         2.5
sys-devel/autoconf:       2.68
sys-devel/automake:       1.11.1
sys-devel/binutils:       2.21.1-r1
sys-devel/gcc:            4.5.3-r1
sys-devel/gcc-config:     1.5-r2
sys-devel/libtool:        2.4-r1
sys-devel/make:           3.82-r1
sys-kernel/linux-headers: 3.1 (virtual/os-headers)
sys-libs/glibc:           2.13-r4
Repositories: gentoo
ACCEPT_KEYWORDS="sparc"
ACCEPT_LICENSE="* -@EULA"
CBUILD="sparc-unknown-linux-gnu"
CFLAGS="-O2 -mcpu=ultrasparc -mtune=ultrasparc -pipe"
CHOST="sparc-unknown-linux-gnu"
CONFIG_PROTECT="/etc /var/bind"
CONFIG_PROTECT_MASK="/etc/ca-certificates.conf /etc/env.d /etc/gconf /etc/gentoo-release /etc/revdep-rebuild /etc/sandbox.d /etc/terminfo"
CXXFLAGS="-O2 -mcpu=ultrasparc -mtune=ultrasparc -pipe"
DISTDIR="/usr/portage/distfiles"
FEATURES="assume-digests binpkg-logs distlocks ebuild-locks fixlafiles news parallel-fetch protect-owned sandbox sfperms strict unknown-features-warn unmerge-logs unmerge-orphans userfetch"
FFLAGS=""
GENTOO_MIRRORS="http://www.gtlib.gatech.edu/pub/gentoo rsync://rsync.gtlib.gatech.edu/gentoo ftp://ftp.gtlib.gatech.edu/pub/gentoo ftp://distro.ibiblio.org/pub/linux/distributions/gentoo/ http://distro.ibiblio.org/pub/linux/distributions/gentoo/ rsync://distro.ibiblio.org/pub/linux/distributions/gentoo/ http://gentoo.cites.uiuc.edu/pub/gentoo/ ftp://gentoo.cites.uiuc.edu/pub/gentoo/"
LDFLAGS="-Wl,-O1 -Wl,--as-needed"
MAKEOPTS="-j2"
PKGDIR="/usr/portage/packages"
PORTAGE_CONFIGROOT="/"
PORTAGE_RSYNC_OPTS="--recursive --links --safe-links --perms --times --compress --force --whole-file --delete --stats --human-readable --timeout=180 --exclude=/distfiles --exclude=/local --exclude=/packages"
PORTAGE_TMPDIR="/var/tmp"
PORTDIR="/usr/portage"
PORTDIR_OVERLAY=""
SYNC="rsync://rsync.us.gentoo.org/gentoo-portage"
USE="acl berkdb bzip2 cli cracklib crypt cups cxx dlz dri fortran gcc64 gdbm iconv minimal modules mudflap ncurses nls nptl openmp pam pcre perl pppd readline session snmp sparc spoof-source ssl syslog tcpd truetype unicode vim-syntax xml xorg zlib" ALSA_PCM_PLUGINS="adpcm alaw asym copy dmix dshare dsnoop empty extplug file hooks iec958 ioplug ladspa lfloat linear meter mmap_emul mulaw multi null plug rate route share shm softvol" APACHE2_MODULES="actions alias auth_basic authn_alias authn_anon authn_dbm authn_default authn_file authz_dbm authz_default authz_groupfile authz_host authz_owner authz_user autoindex cache cgi cgid dav dav_fs dav_lock deflate dir disk_cache env expires ext_filter file_cache filter headers include info log_config logio mem_cache mime mime_magic negotiation rewrite setenvif speling status unique_id userdir usertrack vhost_alias" CALLIGRA_FEATURES="kexi words flow plan sheets stage tables krita karbon braindump" CAMERAS="ptp2" COLLECTD_PLUGINS="df interface irq load memory rrdtool swap syslog" ELIBC="glibc" GPSD_PROTOCOLS="ashtech aivdm earthmate evermore fv18 garmin garmintxt gpsclock itrax mtk3301 nmea ntrip navcom oceanserver oldstyle oncore rtcm104v2 rtcm104v3 sirf superstar2 timing tsip tripmate tnt ubx" INPUT_DEVICES="keyboard mouse evdev" KERNEL="linux" LCD_DEVICES="bayrad cfontz cfontz633 glk hd44780 lb216 lcdm001 mtxorb ncurses text" LIBREOFFICE_EXTENSIONS="presenter-console presenter-minimizer" PHP_TARGETS="php5-3" PYTHON_TARGETS="python2_7" RUBY_TARGETS="ruby18 ruby19" USERLAND="GNU" VIDEO_CARDS="fbdev glint mach64 mga r128 radeon sunbw2 suncg14 suncg3 suncg6 sunffb sunleo tdfx dummy v4l" XTABLES_ADDONS="quota2 psd pknock lscan length2 ipv4options ipset ipp2p iface geoip fuzzy condition tee tarpit sysrq steal rawnat logmark ipmark dhcpmac delude chaos account"
Unset:  CPPFLAGS, CTARGET, EMERGE_DEFAULT_OPTS, INSTALL_MASK, LANG, LC_ALL, LINGUAS, PORTAGE_BUNZIP2_COMMAND, PORTAGE_COMPRESS, PORTAGE_COMPRESS_FLAGS, PORTAGE_RSYNC_EXTRA_OPTS, USE_PYTHON


emerge -pqv =sys-libs/glibc-2.14.1-r3
Code:
[ebuild     U ] sys-libs/glibc-2.14.1-r3 [2.13-r4] USE="-debug -gd (-hardened) (-multilib) -profile (-selinux) -vanilla"



I also have the build environment and the full build logs available.


Last edited by brianakee on Tue Aug 14, 2012 7:24 pm; edited 1 time in total
Back to top
View user's profile Send private message
brianakee
Tux's lil' helper
Tux's lil' helper


Joined: 16 Aug 2002
Posts: 78

PostPosted: Thu Jun 14, 2012 11:57 pm    Post subject: Reply with quote

It may be a waste of time, but I am going to try to update gcc, and see if this will help. I am having some kernel compile issues as well. Maybe it's related.
Back to top
View user's profile Send private message
brianakee
Tux's lil' helper
Tux's lil' helper


Joined: 16 Aug 2002
Posts: 78

PostPosted: Fri Jun 15, 2012 7:56 pm    Post subject: Reply with quote

I was able to successfully update gcc, however this does not seem to have helped with glibc. When I retried the glibc update, it seems to have failed in exactly the same place as before.

Code:
.././scripts/mkinstalldirs /var/tmp/portage/sys-libs/glibc-2.14.1-r3/work/build-sparc32-sparc-unknown-linux-gnu-nptl/sunrpc/rpcsvc
CPP='sparc-unknown-linux-gnu-gcc  -E -x c-header'  /var/tmp/portage/sys-libs/glibc-2.14.1-r3/work/build-sparc32-sparc-unknown-linux-gnu-nptl/elf/ld-linux.so.2 --library-path /var/tmp/portage/sys-libs/glibc-2.14.1-r3/work/build-sparc32-sparc-unknown-linux-gnu-nptl:/var/tmp/portage/sys-libs/glibc-2.14.1-r3/work/build-sparc32-sparc-unknown-linux-gnu-nptl/math:/var/tmp/portage/sys-libs/glibc-2.14.1-r3/work/build-sparc32-sparc-unknown-linux-gnu-nptl/elf:/var/tmp/portage/sys-libs/glibc-2.14.1-r3/work/build-sparc32-sparc-unknown-linux-gnu-nptl/dlfcn:/var/tmp/portage/sys-libs/glibc-2.14.1-r3/work/build-sparc32-sparc-unknown-linux-gnu-nptl/nss:/var/tmp/portage/sys-libs/glibc-2.14.1-r3/work/build-sparc32-sparc-unknown-linux-gnu-nptl/nis:/var/tmp/portage/sys-libs/glibc-2.14.1-r3/work/build-sparc32-sparc-unknown-linux-gnu-nptl/rt:/var/tmp/portage/sys-libs/glibc-2.14.1-r3/work/build-sparc32-sparc-unknown-linux-gnu-nptl/resolv:/var/tmp/portage/sys-libs/glibc-2.14.1-r3/work/build-sparc32-sparc-unknown-linux-gnu-nptl/crypt:/var/tmp/portage/sys-libs/glibc-2.14.1-r3/work/build-sparc32-sparc-unknown-linux-gnu-nptl/nptl /var/tmp/portage/sys-libs/glibc-2.14.1-r3/work/build-sparc32-sparc-unknown-linux-gnu-nptl/sunrpc/rpcgen -Y ../scripts -c rpcsvc/bootparam_prot.x -o /var/tmp/portage/sys-libs/glibc-2.14.1-r3/work/build-sparc32-sparc-unknown-linux-gnu-nptl/sunrpc/xbootparam_prot.T
mkdir /var/tmp/portage/sys-libs/glibc-2.14.1-r3/work/build-sparc32-sparc-unknown-linux-gnu-nptl/sunrpc/rpcsvc
CPP='sparc-unknown-linux-gnu-gcc  -E -x c-header'  /var/tmp/portage/sys-libs/glibc-2.14.1-r3/work/build-sparc32-sparc-unknown-linux-gnu-nptl/elf/ld-linux.so.2 --library-path /var/tmp/portage/sys-libs/glibc-2.14.1-r3/work/build-sparc32-sparc-unknown-linux-gnu-nptl:/var/tmp/portage/sys-libs/glibc-2.14.1-r3/work/build-sparc32-sparc-unknown-linux-gnu-nptl/math:/var/tmp/portage/sys-libs/glibc-2.14.1-r3/work/build-sparc32-sparc-unknown-linux-gnu-nptl/elf:/var/tmp/portage/sys-libs/glibc-2.14.1-r3/work/build-sparc32-sparc-unknown-linux-gnu-nptl/dlfcn:/var/tmp/portage/sys-libs/glibc-2.14.1-r3/work/build-sparc32-sparc-unknown-linux-gnu-nptl/nss:/var/tmp/portage/sys-libs/glibc-2.14.1-r3/work/build-sparc32-sparc-unknown-linux-gnu-nptl/nis:/var/tmp/portage/sys-libs/glibc-2.14.1-r3/work/build-sparc32-sparc-unknown-linux-gnu-nptl/rt:/var/tmp/portage/sys-libs/glibc-2.14.1-r3/work/build-sparc32-sparc-unknown-linux-gnu-nptl/resolv:/var/tmp/portage/sys-libs/glibc-2.14.1-r3/work/build-sparc32-sparc-unknown-linux-gnu-nptl/crypt:/var/tmp/portage/sys-libs/glibc-2.14.1-r3/work/build-sparc32-sparc-unknown-linux-gnu-nptl/nptl /var/tmp/portage/sys-libs/glibc-2.14.1-r3/work/build-sparc32-sparc-unknown-linux-gnu-nptl/sunrpc/rpcgen -Y ../scripts -h rpcsvc/bootparam_prot.x -o /var/tmp/portage/sys-libs/glibc-2.14.1-r3/work/build-sparc32-sparc-unknown-linux-gnu-nptl/sunrpc/rpcsvc/bootparam_prot.T
make[2]: *** [/var/tmp/portage/sys-libs/glibc-2.14.1-r3/work/build-sparc32-sparc-unknown-linux-gnu-nptl/sunrpc/xbootparam_prot.stmp] Segmentation fault
make[2]: *** Waiting for unfinished jobs....
make[2]: *** [/var/tmp/portage/sys-libs/glibc-2.14.1-r3/work/build-sparc32-sparc-unknown-linux-gnu-nptl/sunrpc/rpcsvc/bootparam_prot.stmp] Segmentation fault
make[2]: Leaving directory `/var/tmp/portage/sys-libs/glibc-2.14.1-r3/work/glibc-2.14.1/sunrpc'
make[1]: *** [sunrpc/others] Error 2
make[1]: Leaving directory `/var/tmp/portage/sys-libs/glibc-2.14.1-r3/work/glibc-2.14.1'
make: *** [all] Error 2
emake failed
 * ERROR: sys-libs/glibc-2.14.1-r3 failed (compile phase):
 *   make for sparc32 failed
 *
 * Call stack:
 *           ebuild.sh, line   85:  Called src_compile
 *         environment, line 3478:  Called eblit-run 'src_compile'
 *         environment, line  875:  Called eblit-glibc-src_compile
 *   src_compile.eblit, line  219:  Called toolchain-glibc_src_compile
 *   src_compile.eblit, line  130:  Called die
 * The specific snippet of code:
 *              emake || die "make for ${ABI} failed"
 *
 * If you need support, post the output of 'emerge --info =sys-libs/glibc-2.14.1-r3',
 * the complete build log and the output of 'emerge -pqv =sys-libs/glibc-2.14.1-r3'.
 * The complete build log is located at '/var/tmp/portage/sys-libs/glibc-2.14.1-r3/temp/build.log'.
 * The ebuild environment file is located at '/var/tmp/portage/sys-libs/glibc-2.14.1-r3/temp/environment'.
 * S: '/var/tmp/portage/sys-libs/glibc-2.14.1-r3/work/glibc-2.14.1'

>>> Failed to emerge sys-libs/glibc-2.14.1-r3, Log file:

>>>  '/var/tmp/portage/sys-libs/glibc-2.14.1-r3/temp/build.log'

 * Messages for package sys-libs/glibc-2.14.1-r3:

 * ERROR: sys-libs/glibc-2.14.1-r3 failed (compile phase):
 *   make for sparc32 failed
 *
 * Call stack:
 *           ebuild.sh, line   85:  Called src_compile
 *         environment, line 3478:  Called eblit-run 'src_compile'
 *         environment, line  875:  Called eblit-glibc-src_compile
 *   src_compile.eblit, line  219:  Called toolchain-glibc_src_compile
 *   src_compile.eblit, line  130:  Called die
 * The specific snippet of code:
 *              emake || die "make for ${ABI} failed"
 *
 * If you need support, post the output of 'emerge --info =sys-libs/glibc-2.14.1-r3',
 * the complete build log and the output of 'emerge -pqv =sys-libs/glibc-2.14.1-r3'.
 * The complete build log is located at '/var/tmp/portage/sys-libs/glibc-2.14.1-r3/temp/build.log'.
 * The ebuild environment file is located at '/var/tmp/portage/sys-libs/glibc-2.14.1-r3/temp/environment'.
 * S: '/var/tmp/portage/sys-libs/glibc-2.14.1-r3/work/glibc-2.14.1'



Anyone have any ideas on this one?
Back to top
View user's profile Send private message
aderesch
Tux's lil' helper
Tux's lil' helper


Joined: 06 Mar 2010
Posts: 123
Location: Berlin, Germany

PostPosted: Sat Jun 16, 2012 8:07 am    Post subject: Reply with quote

brianakee wrote:
Anyone have any ideas on this one?

Not really, at least I was too lazy to investigate. Looking at genlop output it seems I never built a 2.14 version -- I went from 2.13-r4 to 2.15-r1 (being on multilib with ~sparc). Don't know how important staying on stable is to you, but you might consider pulling in 2.15 (or just mask ~2.14).

ad
Back to top
View user's profile Send private message
brianakee
Tux's lil' helper
Tux's lil' helper


Joined: 16 Aug 2002
Posts: 78

PostPosted: Tue Aug 14, 2012 7:23 pm    Post subject: Reply with quote

This looks like it was a transient issue. I updated world today, and everything compiled without issue.

I am guessing that some dependency or issue was resolved in a bug fix, or update since the last time I updated.

Thanks goes out to those who resolved the issues! :D
Back to top
View user's profile Send private message
Display posts from previous:   
Reply to topic    Gentoo Forums Forum Index Portage & Programming All times are GMT
Page 1 of 1

 
Jump to:  
You cannot post new topics in this forum
You cannot reply to topics in this forum
You cannot edit your posts in this forum
You cannot delete your posts in this forum
You cannot vote in polls in this forum