Gentoo Forums
Gentoo Forums
Gentoo Forums
Quick Search: in
[solved] compiz-plugins-extra-0.9.2 compile error after
View unanswered posts
View posts from last 24 hours

 
Reply to topic    Gentoo Forums Forum Index Desktop Environments
View previous topic :: View next topic  
Author Message
bzImage
n00b
n00b


Joined: 14 Oct 2002
Posts: 35

PostPosted: Mon Sep 26, 2011 12:16 am    Post subject: [solved] compiz-plugins-extra-0.9.2 compile error after Reply with quote

After doing an emerge --sync and emerge -u world i get this error on compiz-plugins-extra.0.9.2


Code:

# emerge -u world

Calculating dependencies... done!

>>> Verifying ebuild manifests

>>> Starting parallel fetch

>>> Emerging (1 of 6) x11-plugins/compiz-plugins-extra-0.9.2 from desktop-effects
 * compiz-plugins-extra-0.9.2.tar.bz2 RMD160 SHA1 SHA256 size ;-) ...    [ ok ]
>>> Unpacking source...
>>> Unpacking compiz-plugins-extra-0.9.2.tar.bz2 to /var/tmp/portage/x11-plugins/compiz-plugins-extra-0.9.2/work
>>> Source unpacked in /var/tmp/portage/x11-plugins/compiz-plugins-extra-0.9.2/work
>>> Preparing source in /var/tmp/portage/x11-plugins/compiz-plugins-extra-0.9.2/work/plugins-extra ...
>>> Source prepared.
>>> Configuring source in /var/tmp/portage/x11-plugins/compiz-plugins-extra-0.9.2/work/plugins-extra ...
>>> Working in BUILD_DIR: "/var/tmp/portage/x11-plugins/compiz-plugins-extra-0.9.2/work/compiz-plugins-extra-0.9.2_build"
cmake --no-warn-unused-cli -C /var/tmp/portage/x11-plugins/compiz-plugins-extra-0.9.2/temp/gentoo_common_config.cmake -DCMAKE_INSTALL_PREFIX=/usr -DCOMPIZ_DISABLE_SCHEMAS_INSTALL=ON -DCMAKE_BUILD_TYPE=Gentoo -DCMAKE_INSTALL_DO_STRIP=OFF -DCMAKE_USER_MAKE_RULES_OVERRIDE=/var/tmp/portage/x11-plugins/compiz-plugins-extra-0.9.2/temp/gentoo_rules.cmake  /var/tmp/portage/x11-plugins/compiz-plugins-extra-0.9.2/work/plugins-extra
Not searching for unused variables given on the command line.
loading initial cache file /var/tmp/portage/x11-plugins/compiz-plugins-extra-0.9.2/temp/gentoo_common_config.cmake
-- The C compiler identification is GNU
-- The CXX compiler identification is GNU
-- Check for working C compiler: /usr/bin/x86_64-pc-linux-gnu-gcc
-- Check for working C compiler: /usr/bin/x86_64-pc-linux-gnu-gcc -- works
-- Detecting C compiler ABI info
-- Detecting C compiler ABI info - done
-- Check for working CXX compiler: /usr/bin/x86_64-pc-linux-gnu-g++
-- Check for working CXX compiler: /usr/bin/x86_64-pc-linux-gnu-g++ -- works
-- Detecting CXX compiler ABI info
-- Detecting CXX compiler ABI info - done
-- checking for module 'compiz'
--   found compiz, version 0.9.0
-- Performing Test HAVE_SCANDIR_POSIX
-- Performing Test HAVE_SCANDIR_POSIX - Success
-- Boost version: 1.46.1
-- Found the following Boost libraries:
--   serialization
-- checking for module 'compiz-composite'
--   found compiz-composite, version 0.9.0
-- checking for module 'compiz-opengl'
--   found compiz-opengl, version 0.9.0
-- checking for module 'compiz'
--   found compiz, version 0.9.0
-- checking for module 'compiz-mousepoll'
--   found compiz-mousepoll, version 0.9.0
-- checking for module 'compiz-scale'
--   found compiz-scale, version 0.9.0
-- checking for module 'compiz-text'
--   found compiz-text, version 0.9.0
-- checking for module 'libnotify'
--   found libnotify, version 0.7.4
-- checking for module 'gtk+-2.0'
--   found gtk+-2.0, version 2.24.6
-- checking for module 'cairo'
--   found cairo, version 1.10.2
-- checking for module 'cairo-xlib-xrender'
--   found cairo-xlib-xrender, version 1.10.2
-- checking for module 'compiz-cube'
--   found compiz-cube, version 0.9.0
-- Looking for XOpenDisplay in /usr/lib64/libX11.so;/usr/lib64/libXext.so
-- Looking for XOpenDisplay in /usr/lib64/libX11.so;/usr/lib64/libXext.so - found
-- Looking for gethostbyname
-- Looking for gethostbyname - found
-- Looking for connect
-- Looking for connect - found
-- Looking for remove
-- Looking for remove - found
-- Looking for shmat
-- Looking for shmat - found
-- Looking for IceConnectionNumber in ICE
-- Looking for IceConnectionNumber in ICE - found
-- Found X11: /usr/lib64/libX11.so
-- Found OpenGL: /usr/lib64/libGL.so
-- checking for module 'compiz-animation'
--   found compiz-animation, version 0.9.0

************************************************************
* Compiz Buildsystem                                       *
*                                                          *
* Package : Compiz Plugins Extra                           *
* Version : 0.9.0                                          *
************************************************************

Plugin configure check results:

  wallpaper     : Yes
  trailfocus    : Yes
  splash        : Yes
  showmouse     : Yes
  shelf         : Yes
  scalefilter   : Yes
  reflex        : Yes
  notification  : Yes
  loginout      : Yes
  group         : Yes
  grid          : Yes
  gears         : Yes
  firepaint     : Yes
  fadedesktop   : Yes
  extrawm       : Yes
  cubeaddon     : Yes
  crashhandler  : Yes
  bench         : Yes
  animationaddon: Yes
  td            : Yes
  widget        : Yes
  showdesktop   : Yes
  bicubic       : Yes
  maximumize    : Yes
  mblur         : Yes
  addhelper     : Yes

************************************************************

-- <<< Gentoo configuration >>>
Build type      Gentoo
Install path    /usr
Compiler flags:
C               -Wall
C++             -Wall
Linker flags:
Executable       -Wl,-O1 -Wl,--as-needed
Module           -Wl,-O1 -Wl,--as-needed
Shared           -Wl,-O1 -Wl,--as-needed

-- Configuring done
-- Generating done
-- Build files have been written to: /var/tmp/portage/x11-plugins/compiz-plugins-extra-0.9.2/work/compiz-plugins-extra-0.9.2_build
>>> Source configured.
>>> Compiling source in /var/tmp/portage/x11-plugins/compiz-plugins-extra-0.9.2/work/plugins-extra ...
>>> Working in BUILD_DIR: "/var/tmp/portage/x11-plugins/compiz-plugins-extra-0.9.2/work/compiz-plugins-extra-0.9.2_build"
make
[  1%] Generating ../generated/wallpaper.xml
[  2%] Generating ../generated/wallpaper_options.h
[  2%] Generating ../generated/wallpaper_options.cpp
Scanning dependencies of target wallpaper
[  2%] Building CXX object wallpaper/CMakeFiles/wallpaper.dir/src/wallpaper.cpp.o
[  3%] Building CXX object wallpaper/CMakeFiles/wallpaper.dir/__/generated/wallpaper_options.cpp.o
/var/tmp/portage/x11-plugins/compiz-plugins-extra-0.9.2/work/compiz-plugins-extra-0.9.2_build/generated/wallpaper_options.cpp: In constructor 'WallpaperOptions::WallpaperOptions()':
/var/tmp/portage/x11-plugins/compiz-plugins-extra-0.9.2/work/compiz-plugins-extra-0.9.2_build/generated/wallpaper_options.cpp:21:27: warning: unused variable 'color'
Linking CXX shared library libwallpaper.so
[  3%] Built target wallpaper
[  4%] Generating ../generated/trailfocus.xml
[  4%] Generating ../generated/trailfocus_options.h
[  5%] Generating ../generated/trailfocus_options.cpp
Scanning dependencies of target trailfocus
[  6%] Building CXX object trailfocus/CMakeFiles/trailfocus.dir/src/trailfocus.cpp.o
[  7%] Building CXX object trailfocus/CMakeFiles/trailfocus.dir/__/generated/trailfocus_options.cpp.o
Linking CXX shared library libtrailfocus.so
[  7%] Built target trailfocus
[  8%] Generating ../generated/splash.xml
[  9%] Generating ../generated/splash_options.h
[  9%] Generating ../generated/splash_options.cpp
Scanning dependencies of target splash
[  9%] Building CXX object splash/CMakeFiles/splash.dir/src/splash.cpp.o
[ 10%] Building CXX object splash/CMakeFiles/splash.dir/__/generated/splash_options.cpp.o
Linking CXX shared library libsplash.so
[ 10%] Built target splash
[ 11%] Generating ../generated/showmouse.xml
[ 11%] Generating ../generated/showmouse_options.h
[ 12%] Generating ../generated/showmouse_options.cpp
Scanning dependencies of target showmouse
[ 13%] Building CXX object showmouse/CMakeFiles/showmouse.dir/src/showmouse.cpp.o
In file included from /usr/include/boost-1_46/boost/serialization/static_warning.hpp:73:0,
                 from /usr/include/boost-1_46/boost/serialization/extended_type_info_typeid.hpp:27,
                 from /usr/include/boost-1_46/boost/archive/detail/iserializer.hpp:47,
                 from /usr/include/boost-1_46/boost/archive/detail/interface_iarchive.hpp:22,
                 from /usr/include/boost-1_46/boost/archive/detail/common_iarchive.hpp:23,
                 from /usr/include/boost-1_46/boost/archive/basic_text_iarchive.hpp:31,
                 from /usr/include/boost-1_46/boost/archive/text_iarchive.hpp:24,
                 from /usr/include/compiz/core/serialization.h:36,
                 from /var/tmp/portage/x11-plugins/compiz-plugins-extra-0.9.2/work/plugins-extra/showmouse/src/showmouse.h:26,
                 from /var/tmp/portage/x11-plugins/compiz-plugins-extra-0.9.2/work/plugins-extra/showmouse/src/showmouse.cpp:27:
/usr/include/boost-1_46/boost/mpl/print.hpp: In instantiation of 'boost::mpl::print<boost::serialization::BOOST_SERIALIZATION_STATIC_WARNING_LINE<98> >':
/usr/include/boost-1_46/boost/serialization/static_warning.hpp:92:13:   instantiated from 'boost::serialization::static_warning_test<false, 98>'
/usr/include/boost-1_46/boost/archive/detail/check.hpp:98:1:   instantiated from 'void boost::archive::detail::check_object_tracking() [with T = PluginStateWriter<ShowmouseScreen>]'
/usr/include/boost-1_46/boost/archive/detail/oserializer.hpp:313:9:   instantiated from 'static void boost::archive::detail::save_non_pointer_type<Archive>::invoke(Archive&, T&) [with T = PluginStateWriter<ShowmouseScreen>, Archive = boost::archive::text_oarchive]'
/usr/include/boost-1_46/boost/archive/detail/oserializer.hpp:525:5:   instantiated from 'void boost::archive::save(Archive&, T&) [with Archive = boost::archive::text_oarchive, T = PluginStateWriter<ShowmouseScreen>]'
/usr/include/boost-1_46/boost/archive/detail/common_oarchive.hpp:69:9:   instantiated from 'void boost::archive::detail::common_oarchive<Archive>::save_override(T&, int) [with T = PluginStateWriter<ShowmouseScreen>, Archive = boost::archive::text_oarchive]'
/usr/include/boost-1_46/boost/archive/basic_text_oarchive.hpp:80:9:   instantiated from 'void boost::archive::basic_text_oarchive<Archive>::save_override(T&, int) [with T = PluginStateWriter<ShowmouseScreen>, Archive = boost::archive::text_oarchive]'
/usr/include/boost-1_46/boost/archive/detail/interface_oarchive.hpp:63:9:   instantiated from 'Archive& boost::archive::detail::interface_oarchive<Archive>::operator<<(T&) [with T = PluginStateWriter<ShowmouseScreen>, Archive = boost::archive::text_oarchive]'
/usr/include/compiz/core/serialization.h:122:6:   instantiated from 'void PluginStateWriter<T>::writeSerializedData() [with T = ShowmouseScreen]'
/var/tmp/portage/x11-plugins/compiz-plugins-extra-0.9.2/work/plugins-extra/showmouse/src/showmouse.cpp:701:5:   instantiated from here
/usr/include/boost-1_46/boost/mpl/print.hpp:55:5: warning: comparison between signed and unsigned integer expressions
[ 14%] Building CXX object showmouse/CMakeFiles/showmouse.dir/__/generated/showmouse_options.cpp.o
Linking CXX shared library libshowmouse.so
[ 14%] Built target showmouse
[ 15%] Generating ../generated/shelf.xml
[ 16%] Generating ../generated/shelf_options.h
[ 16%] Generating ../generated/shelf_options.cpp
Scanning dependencies of target shelf
[ 16%] Building CXX object shelf/CMakeFiles/shelf.dir/src/shelf.cpp.o
[ 17%] Building CXX object shelf/CMakeFiles/shelf.dir/__/generated/shelf_options.cpp.o
Linking CXX shared library libshelf.so
[ 17%] Built target shelf
[ 18%] Generating ../generated/scalefilter.xml
[ 18%] Generating ../generated/scalefilter_options.h
[ 19%] Generating ../generated/scalefilter_options.cpp
Scanning dependencies of target scalefilter
[ 20%] Building CXX object scalefilter/CMakeFiles/scalefilter.dir/src/scalefilter.cpp.o
[ 21%] Building CXX object scalefilter/CMakeFiles/scalefilter.dir/__/generated/scalefilter_options.cpp.o
Linking CXX shared library libscalefilter.so
[ 21%] Built target scalefilter
[ 21%] Generating ../generated/reflex.xml
[ 22%] Generating ../generated/reflex_options.h
[ 23%] Generating ../generated/reflex_options.cpp
Scanning dependencies of target reflex
[ 24%] Building CXX object reflex/CMakeFiles/reflex.dir/src/reflex.cpp.o
[ 24%] Building CXX object reflex/CMakeFiles/reflex.dir/__/generated/reflex_options.cpp.o
Linking CXX shared library libreflex.so
[ 24%] Built target reflex
[ 25%] Generating ../generated/notification.xml
[ 26%] Generating ../generated/notification_options.h
[ 26%] Generating ../generated/notification_options.cpp
Scanning dependencies of target notification
[ 26%] Building CXX object notification/CMakeFiles/notification.dir/src/notification.cpp.o
 /var/tmp/portage/x11-plugins/compiz-plugins-extra-0.9.2/work/plugins-extra/notification/src/notification.cpp: In member function 'virtual void NotificationScreen::logMessage(const char*, CompLogLevel, const char*)':
/var/tmp/portage/x11-plugins/compiz-plugins-extra-0.9.2/work/plugins-extra/notification/src/notification.cpp:58:28: error: too many arguments to function 'NotifyNotification* notify_notification_new(const char*, const char*, const char*)'
/usr/include/libnotify/notification.h:114:21: note: declared here
make[2]: *** [notification/CMakeFiles/notification.dir/src/notification.cpp.o] Error 1
make[1]: *** [notification/CMakeFiles/notification.dir/all] Error 2
make: *** [all] Error 2
emake failed
 * ERROR: x11-plugins/compiz-plugins-extra-0.9.2 failed (compile phase):
 *   Make failed!
 *
 * Call stack:
 *     ebuild.sh, line   91:  Called src_compile
 *   environment, line 2898:  Called cmake-utils_src_compile
 *   environment, line  795:  Called _execute_optionaly 'src_compile'
 *   environment, line  248:  Called enable_cmake-utils_src_compile
 *   environment, line 1034:  Called cmake-utils_src_make
 *   environment, line  814:  Called die
 * The specific snippet of code:
 *           emake "$@" || die "Make failed!";
 *
 * If you need support, post the output of 'emerge --info =x11-plugins/compiz-plugins-extra-0.9.2',
 * the complete build log and the output of 'emerge -pqv =x11-plugins/compiz-plugins-extra-0.9.2'.
 * This ebuild is from an overlay named 'desktop-effects': '/var/lib/layman/desktop-effects/'
 * The complete build log is located at '/var/tmp/portage/x11-plugins/compiz-plugins-extra-0.9.2/temp/build.log'.
 * The ebuild environment file is located at '/var/tmp/portage/x11-plugins/compiz-plugins-extra-0.9.2/temp/environment'.
 * S: '/var/tmp/portage/x11-plugins/compiz-plugins-extra-0.9.2/work/plugins-extra'

>>> Failed to emerge x11-plugins/compiz-plugins-extra-0.9.2, Log file:

>>>  '/var/tmp/portage/x11-plugins/compiz-plugins-extra-0.9.2/temp/build.log'

 * Messages for package x11-plugins/compiz-plugins-extra-0.9.2:

 * ERROR: x11-plugins/compiz-plugins-extra-0.9.2 failed (compile phase):
 *   Make failed!
 *
 * Call stack:
 *     ebuild.sh, line   91:  Called src_compile
 *   environment, line 2898:  Called cmake-utils_src_compile
 *   environment, line  795:  Called _execute_optionaly 'src_compile'
 *   environment, line  248:  Called enable_cmake-utils_src_compile
 *   environment, line 1034:  Called cmake-utils_src_make
 *   environment, line  814:  Called die
 * The specific snippet of code:
 *           emake "$@" || die "Make failed!";
 *
 * If you need support, post the output of 'emerge --info =x11-plugins/compiz-plugins-extra-0.9.2',
 * the complete build log and the output of 'emerge -pqv =x11-plugins/compiz-plugins-extra-0.9.2'.
 * This ebuild is from an overlay named 'desktop-effects': '/var/lib/layman/desktop-effects/'
 * The complete build log is located at '/var/tmp/portage/x11-plugins/compiz-plugins-extra-0.9.2/temp/build.log'.
 * The ebuild environment file is located at '/var/tmp/portage/x11-plugins/compiz-plugins-extra-0.9.2/temp/environment'.
 * S: '/var/tmp/portage/x11-plugins/compiz-plugins-extra-0.9.2/work/plugins-extra'



Help.. please..


Last edited by bzImage on Mon Sep 26, 2011 1:26 pm; edited 1 time in total
Back to top
View user's profile Send private message
bzImage
n00b
n00b


Joined: 14 Oct 2002
Posts: 35

PostPosted: Mon Sep 26, 2011 1:26 pm    Post subject: Reply with quote

Found that compiz & emerald were compiling from a layman, so deleted the layman "desktop-effects" (layman -d desktop-effects), and emerged world (emerge -uDavN world)
Back to top
View user's profile Send private message
Display posts from previous:   
Reply to topic    Gentoo Forums Forum Index Desktop Environments All times are GMT
Page 1 of 1

 
Jump to:  
You cannot post new topics in this forum
You cannot reply to topics in this forum
You cannot edit your posts in this forum
You cannot delete your posts in this forum
You cannot vote in polls in this forum