Gentoo Forums
Gentoo Forums
Gentoo Forums
Quick Search: in
cmake fails with missing libraries (Solved)
View unanswered posts
View posts from last 24 hours

 
Reply to topic    Gentoo Forums Forum Index Portage & Programming
View previous topic :: View next topic  
Author Message
progo
n00b
n00b


Joined: 22 May 2006
Posts: 27

PostPosted: Tue Sep 06, 2011 8:30 am    Post subject: cmake fails with missing libraries (Solved) Reply with quote

Hi. This has been bugging me for a couple of weeks now: cmake-2.8.4-r1 and 2.8.5 fail with similar missing libraries problem.

Code:
[ 77%] Building CXX object Source/CMakeFiles/CTestLib.dir/CTest/cmCTestMultiProcessHandler.cxx.o
/usr/local/lib/libcurl.a(strerror.o): In function `Curl_idn_strerror':
strerror.c:(.text+0x2bb): undefined reference to `idna_strerror'
/usr/local/lib/libcurl.a(timeval.o): In function `curlx_tvnow':
timeval.c:(.text+0xc9): undefined reference to `clock_gettime'
/usr/local/lib/libcurl.a(url.o): In function `fix_hostname':
url.c:(.text+0xce8): undefined reference to `stringprep_check_version'
url.c:(.text+0xd0b): undefined reference to `idna_to_ascii_lz'
url.c:(.text+0xd12): undefined reference to `stringprep_locale_charset'
url.c:(.text+0xd4a): undefined reference to `idna_to_unicode_lzlz'
url.c:(.text+0xdaa): undefined reference to `tld_check_lz'
url.c:(.text+0xdbf): undefined reference to `idn_free'
url.c:(.text+0xdc9): undefined reference to `tld_strerror'
/usr/local/lib/libcurl.a(url.o): In function `Curl_disconnect':
url.c:(.text+0x1421): undefined reference to `idn_free'
url.c:(.text+0x1433): undefined reference to `idn_free'
/usr/local/lib/libcurl.a(ldap.o): In function `Curl_ldap':
ldap.c:(.text+0x92): undefined reference to `ldap_url_parse'
ldap.c:(.text+0xaa): undefined reference to `ldap_err2string'
ldap.c:(.text+0xdf): undefined reference to `ldap_msgfree'
ldap.c:(.text+0xf4): undefined reference to `ldap_free_urldesc'
ldap.c:(.text+0x106): undefined reference to `ldap_unbind_s'
ldap.c:(.text+0x1db): undefined reference to `ldap_set_option'
ldap.c:(.text+0x1ef): undefined reference to `ldap_set_option'
ldap.c:(.text+0x20a): undefined reference to `ldap_init'
ldap.c:(.text+0x28d): undefined reference to `ldap_set_option'
ldap.c:(.text+0x2a6): undefined reference to `ldap_set_option'
ldap.c:(.text+0x2d8): undefined reference to `ldap_simple_bind_s'
ldap.c:(.text+0x308): undefined reference to `ldap_set_option'
ldap.c:(.text+0x32f): undefined reference to `ldap_simple_bind_s'
ldap.c:(.text+0x349): undefined reference to `ldap_err2string'
ldap.c:(.text+0x3a4): undefined reference to `ldap_search_s'
ldap.c:(.text+0x3bd): undefined reference to `ldap_err2string'
ldap.c:(.text+0x407): undefined reference to `ldap_first_entry'
ldap.c:(.text+0x441): undefined reference to `ldap_get_dn'
ldap.c:(.text+0x4bb): undefined reference to `ldap_first_attribute'
ldap.c:(.text+0x4e5): undefined reference to `ldap_get_values_len'
ldap.c:(.text+0x668): undefined reference to `ldap_value_free_len'
ldap.c:(.text+0x699): undefined reference to `ldap_memfree'
ldap.c:(.text+0x6b2): undefined reference to `ldap_next_attribute'
ldap.c:(.text+0x6c8): undefined reference to `ldap_memfree'
ldap.c:(.text+0x6dd): undefined reference to `ber_free'
ldap.c:(.text+0x6ef): undefined reference to `ldap_next_entry'
/usr/local/lib/libcurl.a(ssluse.o): In function `Curl_ossl_recv':
ssluse.c:(.text+0x269): undefined reference to `SSL_read'
ssluse.c:(.text+0x293): undefined reference to `SSL_get_error'
/usr/local/lib/libcurl.a(ssluse.o): In function `Curl_ossl_send':
ssluse.c:(.text+0x343): undefined reference to `SSL_write'
ssluse.c:(.text+0x363): undefined reference to `SSL_get_error'
/usr/local/lib/libcurl.a(ssluse.o): In function `Curl_ossl_data_pending':
ssluse.c:(.text+0x412): undefined reference to `SSL_pending'
/usr/local/lib/libcurl.a(ssluse.o): In function `servercert':
ssluse.c:(.text+0x107d): undefined reference to `SSL_get_peer_certificate'
ssluse.c:(.text+0x10cb): undefined reference to `SSL_get_peer_cert_chain'
ssluse.c:(.text+0x2604): undefined reference to `SSL_get_verify_result'
/usr/local/lib/libcurl.a(ssluse.o): In function `Curl_ossl_close':
ssluse.c:(.text+0x2767): undefined reference to `SSL_shutdown'
ssluse.c:(.text+0x2772): undefined reference to `SSL_set_connect_state'
ssluse.c:(.text+0x277d): undefined reference to `SSL_free'
ssluse.c:(.text+0x2793): undefined reference to `SSL_CTX_free'
/usr/local/lib/libcurl.a(ssluse.o): In function `Curl_ossl_shutdown':
ssluse.c:(.text+0x2847): undefined reference to `SSL_read'
ssluse.c:(.text+0x2859): undefined reference to `SSL_get_error'
ssluse.c:(.text+0x28cc): undefined reference to `SSL_free'
ssluse.c:(.text+0x292d): undefined reference to `SSL_get_shutdown'
ssluse.c:(.text+0x29c7): undefined reference to `SSL_shutdown'
/usr/local/lib/libcurl.a(ssluse.o): In function `Curl_ossl_check_cxn':
ssluse.c:(.text+0x2bf3): undefined reference to `SSL_peek'
/usr/local/lib/libcurl.a(ssluse.o): In function `Curl_ossl_init':
ssluse.c:(.text+0x2c3c): undefined reference to `SSL_load_error_strings'
ssluse.c:(.text+0x2c41): undefined reference to `SSL_library_init'
/usr/local/lib/libcurl.a(ssluse.o): In function `ossl_connect_common':
ssluse.c:(.text+0x2e40): undefined reference to `SSL_connect'
ssluse.c:(.text+0x2e58): undefined reference to `SSL_get_error'
ssluse.c:(.text+0x2f40): undefined reference to `SSL_get_current_cipher'
ssluse.c:(.text+0x2f48): undefined reference to `SSL_CIPHER_get_name'
ssluse.c:(.text+0x30e3): undefined reference to `SSLv23_client_method'
ssluse.c:(.text+0x30f4): undefined reference to `SSL_CTX_free'
ssluse.c:(.text+0x30fc): undefined reference to `SSL_CTX_new'
ssluse.c:(.text+0x3147): undefined reference to `SSL_CTX_ctrl'
ssluse.c:(.text+0x31d2): undefined reference to `SSL_CTX_set_default_passwd_cb_userdata'
ssluse.c:(.text+0x31e9): undefined reference to `SSL_CTX_set_default_passwd_cb'
ssluse.c:(.text+0x3291): undefined reference to `SSLv2_client_method'
ssluse.c:(.text+0x32bb): undefined reference to `SSL_CTX_ctrl'
ssluse.c:(.text+0x33ca): undefined reference to `SSL_CTX_callback_ctrl'
ssluse.c:(.text+0x3409): undefined reference to `SSL_CTX_use_certificate_file'
ssluse.c:(.text+0x343c): undefined reference to `SSLv3_client_method'
ssluse.c:(.text+0x3462): undefined reference to `SSL_CTX_set_cipher_list'
ssluse.c:(.text+0x349d): undefined reference to `SSL_CTX_load_verify_locations'
ssluse.c:(.text+0x3502): undefined reference to `TLSv1_client_method'
ssluse.c:(.text+0x35b7): undefined reference to `SSL_CTX_ctrl'
ssluse.c:(.text+0x3662): undefined reference to `SSL_CTX_use_certificate_chain_file'
ssluse.c:(.text+0x367f): undefined reference to `SSL_get1_session'
ssluse.c:(.text+0x3785): undefined reference to `SSL_new'
ssluse.c:(.text+0x37a1): undefined reference to `SSL_get_certificate'
ssluse.c:(.text+0x37c0): undefined reference to `SSL_get_privatekey'
ssluse.c:(.text+0x37e2): undefined reference to `SSL_free'
ssluse.c:(.text+0x37f0): undefined reference to `SSL_CTX_check_private_key'
ssluse.c:(.text+0x3864): undefined reference to `SSL_CTX_use_PrivateKey_file'
ssluse.c:(.text+0x39f8): undefined reference to `SSL_CTX_set_verify'
ssluse.c:(.text+0x3a35): undefined reference to `SSL_free'
ssluse.c:(.text+0x3a40): undefined reference to `SSL_new'
ssluse.c:(.text+0x3a56): undefined reference to `SSL_set_connect_state'
ssluse.c:(.text+0x3aae): undefined reference to `SSL_set_session'
ssluse.c:(.text+0x3b17): undefined reference to `SSL_CTX_use_certificate'
ssluse.c:(.text+0x3bb8): undefined reference to `SSL_set_fd'
ssluse.c:(.text+0x3c6b): undefined reference to `SSL_CTX_use_PrivateKey'
ssluse.c:(.text+0x3ce7): undefined reference to `SSL_ctrl'
ssluse.c:(.text+0x3d86): undefined reference to `SSL_CTX_use_PrivateKey'
ssluse.c:(.text+0x3e64): undefined reference to `SSL_CTX_check_private_key'
ssluse.c:(.text+0x3ecd): undefined reference to `SSL_CTX_add_client_CA'
ssluse.c:(.text+0x3f15): undefined reference to `SSL_CTX_ctrl'
/usr/local/lib/libcurl.a(ssluse.o): In function `Curl_ossl_session_free':
ssluse.c:(.text+0x2735): undefined reference to `SSL_SESSION_free'
collect2: ld returned 1 exit status
make[2]: *** [bin/cmake] Error 1
make[1]: *** [Source/CMakeFiles/cmake.dir/all] Error 2
-----
[ 92%] Building CXX object Source/QtDialog/CMakeFiles/cmake-gui.dir/moc_QCMake.cxx.o
/usr/local/lib/libcurl.a(strerror.o): In function `Curl_idn_strerror':
strerror.c:(.text+0x2bb): undefined reference to `idna_strerror'
/usr/local/lib/libcurl.a(timeval.o): In function `curlx_tvnow':
timeval.c:(.text+0xc9): undefined reference to `clock_gettime'
/usr/local/lib/libcurl.a(url.o): In function `fix_hostname':
url.c:(.text+0xce8): undefined reference to `stringprep_check_version'
url.c:(.text+0xd0b): undefined reference to `idna_to_ascii_lz'
url.c:(.text+0xd12): undefined reference to `stringprep_locale_charset'
url.c:(.text+0xd4a): undefined reference to `idna_to_unicode_lzlz'
url.c:(.text+0xdaa): undefined reference to `tld_check_lz'
url.c:(.text+0xdbf): undefined reference to `idn_free'
url.c:(.text+0xdc9): undefined reference to `tld_strerror'
/usr/local/lib/libcurl.a(url.o): In function `Curl_disconnect':
url.c:(.text+0x1421): undefined reference to `idn_free'
url.c:(.text+0x1433): undefined reference to `idn_free'
/usr/local/lib/libcurl.a(ldap.o): In function `Curl_ldap':
ldap.c:(.text+0x92): undefined reference to `ldap_url_parse'
ldap.c:(.text+0xaa): undefined reference to `ldap_err2string'
ldap.c:(.text+0xdf): undefined reference to `ldap_msgfree'
ldap.c:(.text+0xf4): undefined reference to `ldap_free_urldesc'
ldap.c:(.text+0x106): undefined reference to `ldap_unbind_s'
ldap.c:(.text+0x1db): undefined reference to `ldap_set_option'
ldap.c:(.text+0x1ef): undefined reference to `ldap_set_option'
ldap.c:(.text+0x20a): undefined reference to `ldap_init'
ldap.c:(.text+0x28d): undefined reference to `ldap_set_option'
ldap.c:(.text+0x2a6): undefined reference to `ldap_set_option'
ldap.c:(.text+0x2d8): undefined reference to `ldap_simple_bind_s'
ldap.c:(.text+0x308): undefined reference to `ldap_set_option'
ldap.c:(.text+0x32f): undefined reference to `ldap_simple_bind_s'
ldap.c:(.text+0x349): undefined reference to `ldap_err2string'
ldap.c:(.text+0x3a4): undefined reference to `ldap_search_s'
ldap.c:(.text+0x3bd): undefined reference to `ldap_err2string'
ldap.c:(.text+0x407): undefined reference to `ldap_first_entry'
ldap.c:(.text+0x441): undefined reference to `ldap_get_dn'
ldap.c:(.text+0x4bb): undefined reference to `ldap_first_attribute'
ldap.c:(.text+0x4e5): undefined reference to `ldap_get_values_len'
ldap.c:(.text+0x668): undefined reference to `ldap_value_free_len'
ldap.c:(.text+0x699): undefined reference to `ldap_memfree'
ldap.c:(.text+0x6b2): undefined reference to `ldap_next_attribute'
ldap.c:(.text+0x6c8): undefined reference to `ldap_memfree'
ldap.c:(.text+0x6dd): undefined reference to `ber_free'
ldap.c:(.text+0x6ef): undefined reference to `ldap_next_entry'
/usr/local/lib/libcurl.a(ssluse.o): In function `Curl_ossl_recv':
ssluse.c:(.text+0x269): undefined reference to `SSL_read'
ssluse.c:(.text+0x293): undefined reference to `SSL_get_error'
/usr/local/lib/libcurl.a(ssluse.o): In function `Curl_ossl_send':
ssluse.c:(.text+0x343): undefined reference to `SSL_write'
ssluse.c:(.text+0x363): undefined reference to `SSL_get_error'
/usr/local/lib/libcurl.a(ssluse.o): In function `Curl_ossl_data_pending':
ssluse.c:(.text+0x412): undefined reference to `SSL_pending'
/usr/local/lib/libcurl.a(ssluse.o): In function `servercert':
ssluse.c:(.text+0x107d): undefined reference to `SSL_get_peer_certificate'
ssluse.c:(.text+0x10cb): undefined reference to `SSL_get_peer_cert_chain'
ssluse.c:(.text+0x2604): undefined reference to `SSL_get_verify_result'
/usr/local/lib/libcurl.a(ssluse.o): In function `Curl_ossl_close':
ssluse.c:(.text+0x2767): undefined reference to `SSL_shutdown'
ssluse.c:(.text+0x2772): undefined reference to `SSL_set_connect_state'
ssluse.c:(.text+0x277d): undefined reference to `SSL_free'
ssluse.c:(.text+0x2793): undefined reference to `SSL_CTX_free'
/usr/local/lib/libcurl.a(ssluse.o): In function `Curl_ossl_shutdown':
ssluse.c:(.text+0x2847): undefined reference to `SSL_read'
ssluse.c:(.text+0x2859): undefined reference to `SSL_get_error'
ssluse.c:(.text+0x28cc): undefined reference to `SSL_free'
ssluse.c:(.text+0x292d): undefined reference to `SSL_get_shutdown'
ssluse.c:(.text+0x29c7): undefined reference to `SSL_shutdown'
/usr/local/lib/libcurl.a(ssluse.o): In function `Curl_ossl_check_cxn':
ssluse.c:(.text+0x2bf3): undefined reference to `SSL_peek'
/usr/local/lib/libcurl.a(ssluse.o): In function `Curl_ossl_init':
ssluse.c:(.text+0x2c3c): undefined reference to `SSL_load_error_strings'
ssluse.c:(.text+0x2c41): undefined reference to `SSL_library_init'
/usr/local/lib/libcurl.a(ssluse.o): In function `ossl_connect_common':
ssluse.c:(.text+0x2e40): undefined reference to `SSL_connect'
ssluse.c:(.text+0x2e58): undefined reference to `SSL_get_error'
ssluse.c:(.text+0x2f40): undefined reference to `SSL_get_current_cipher'
ssluse.c:(.text+0x2f48): undefined reference to `SSL_CIPHER_get_name'
ssluse.c:(.text+0x30e3): undefined reference to `SSLv23_client_method'
ssluse.c:(.text+0x30f4): undefined reference to `SSL_CTX_free'
ssluse.c:(.text+0x30fc): undefined reference to `SSL_CTX_new'
ssluse.c:(.text+0x3147): undefined reference to `SSL_CTX_ctrl'
ssluse.c:(.text+0x31d2): undefined reference to `SSL_CTX_set_default_passwd_cb_userdata'
ssluse.c:(.text+0x31e9): undefined reference to `SSL_CTX_set_default_passwd_cb'
ssluse.c:(.text+0x3291): undefined reference to `SSLv2_client_method'
ssluse.c:(.text+0x32bb): undefined reference to `SSL_CTX_ctrl'
ssluse.c:(.text+0x33ca): undefined reference to `SSL_CTX_callback_ctrl'
ssluse.c:(.text+0x3409): undefined reference to `SSL_CTX_use_certificate_file'
ssluse.c:(.text+0x343c): undefined reference to `SSLv3_client_method'
ssluse.c:(.text+0x3462): undefined reference to `SSL_CTX_set_cipher_list'
ssluse.c:(.text+0x349d): undefined reference to `SSL_CTX_load_verify_locations'
ssluse.c:(.text+0x3502): undefined reference to `TLSv1_client_method'
ssluse.c:(.text+0x35b7): undefined reference to `SSL_CTX_ctrl'
ssluse.c:(.text+0x3662): undefined reference to `SSL_CTX_use_certificate_chain_file'
ssluse.c:(.text+0x367f): undefined reference to `SSL_get1_session'
ssluse.c:(.text+0x3785): undefined reference to `SSL_new'
ssluse.c:(.text+0x37a1): undefined reference to `SSL_get_certificate'
ssluse.c:(.text+0x37c0): undefined reference to `SSL_get_privatekey'
ssluse.c:(.text+0x37e2): undefined reference to `SSL_free'
ssluse.c:(.text+0x37f0): undefined reference to `SSL_CTX_check_private_key'
ssluse.c:(.text+0x3864): undefined reference to `SSL_CTX_use_PrivateKey_file'
ssluse.c:(.text+0x39f8): undefined reference to `SSL_CTX_set_verify'
ssluse.c:(.text+0x3a35): undefined reference to `SSL_free'
ssluse.c:(.text+0x3a40): undefined reference to `SSL_new'
ssluse.c:(.text+0x3a56): undefined reference to `SSL_set_connect_state'
ssluse.c:(.text+0x3aae): undefined reference to `SSL_set_session'
ssluse.c:(.text+0x3b17): undefined reference to `SSL_CTX_use_certificate'
ssluse.c:(.text+0x3bb8): undefined reference to `SSL_set_fd'
ssluse.c:(.text+0x3c6b): undefined reference to `SSL_CTX_use_PrivateKey'
ssluse.c:(.text+0x3ce7): undefined reference to `SSL_ctrl'
ssluse.c:(.text+0x3d86): undefined reference to `SSL_CTX_use_PrivateKey'
ssluse.c:(.text+0x3e64): undefined reference to `SSL_CTX_check_private_key'
ssluse.c:(.text+0x3ecd): undefined reference to `SSL_CTX_add_client_CA'
ssluse.c:(.text+0x3f15): undefined reference to `SSL_CTX_ctrl'
/usr/local/lib/libcurl.a(ssluse.o): In function `Curl_ossl_session_free':
ssluse.c:(.text+0x2735): undefined reference to `SSL_SESSION_free'
collect2: ld returned 1 exit status
make[2]: *** [bin/ccmake] Error 1
make[1]: *** [Source/CMakeFiles/ccmake.dir/all] Error 2
[ 92%] Building CXX object Source/QtDialog/CMakeFiles/cmake-gui.dir/moc_QCMakeCacheView.cxx.o
[ 93%] Building CXX object Source/QtDialog/CMakeFiles/cmake-gui.dir/moc_QCMakeWidgets.cxx.o
[ 93%] Building CXX object Source/QtDialog/CMakeFiles/cmake-gui.dir/moc_QMacInstallDialog.cxx.o
[ 94%] Building CXX object Source/QtDialog/CMakeFiles/cmake-gui.dir/qrc_CMakeSetup.cxx.o
Linking CXX executable ../../bin/cmake-gui
/usr/local/lib/libcurl.a(strerror.o): In function `Curl_idn_strerror':
strerror.c:(.text+0x2bb): undefined reference to `idna_strerror'
/usr/local/lib/libcurl.a(url.o): In function `fix_hostname':
url.c:(.text+0xce8): undefined reference to `stringprep_check_version'
url.c:(.text+0xd0b): undefined reference to `idna_to_ascii_lz'
url.c:(.text+0xd12): undefined reference to `stringprep_locale_charset'
url.c:(.text+0xd4a): undefined reference to `idna_to_unicode_lzlz'
url.c:(.text+0xdaa): undefined reference to `tld_check_lz'
url.c:(.text+0xdbf): undefined reference to `idn_free'
url.c:(.text+0xdc9): undefined reference to `tld_strerror'
/usr/local/lib/libcurl.a(url.o): In function `Curl_disconnect':
url.c:(.text+0x1421): undefined reference to `idn_free'
url.c:(.text+0x1433): undefined reference to `idn_free'
/usr/local/lib/libcurl.a(ldap.o): In function `Curl_ldap':
ldap.c:(.text+0x92): undefined reference to `ldap_url_parse'
ldap.c:(.text+0xaa): undefined reference to `ldap_err2string'
ldap.c:(.text+0xdf): undefined reference to `ldap_msgfree'
ldap.c:(.text+0xf4): undefined reference to `ldap_free_urldesc'
ldap.c:(.text+0x106): undefined reference to `ldap_unbind_s'
ldap.c:(.text+0x1db): undefined reference to `ldap_set_option'
ldap.c:(.text+0x1ef): undefined reference to `ldap_set_option'
ldap.c:(.text+0x20a): undefined reference to `ldap_init'
ldap.c:(.text+0x28d): undefined reference to `ldap_set_option'
ldap.c:(.text+0x2a6): undefined reference to `ldap_set_option'
ldap.c:(.text+0x2d8): undefined reference to `ldap_simple_bind_s'
ldap.c:(.text+0x308): undefined reference to `ldap_set_option'
ldap.c:(.text+0x32f): undefined reference to `ldap_simple_bind_s'
ldap.c:(.text+0x349): undefined reference to `ldap_err2string'
ldap.c:(.text+0x3a4): undefined reference to `ldap_search_s'
ldap.c:(.text+0x3bd): undefined reference to `ldap_err2string'
ldap.c:(.text+0x407): undefined reference to `ldap_first_entry'
ldap.c:(.text+0x441): undefined reference to `ldap_get_dn'
ldap.c:(.text+0x4bb): undefined reference to `ldap_first_attribute'
ldap.c:(.text+0x4e5): undefined reference to `ldap_get_values_len'
ldap.c:(.text+0x668): undefined reference to `ldap_value_free_len'
ldap.c:(.text+0x699): undefined reference to `ldap_memfree'
ldap.c:(.text+0x6b2): undefined reference to `ldap_next_attribute'
ldap.c:(.text+0x6c8): undefined reference to `ldap_memfree'
ldap.c:(.text+0x6dd): undefined reference to `ber_free'
ldap.c:(.text+0x6ef): undefined reference to `ldap_next_entry'
/usr/local/lib/libcurl.a(ssluse.o): In function `Curl_ossl_recv':
ssluse.c:(.text+0x269): undefined reference to `SSL_read'
ssluse.c:(.text+0x293): undefined reference to `SSL_get_error'
/usr/local/lib/libcurl.a(ssluse.o): In function `Curl_ossl_send':
ssluse.c:(.text+0x343): undefined reference to `SSL_write'
ssluse.c:(.text+0x363): undefined reference to `SSL_get_error'
/usr/local/lib/libcurl.a(ssluse.o): In function `Curl_ossl_data_pending':
ssluse.c:(.text+0x412): undefined reference to `SSL_pending'
/usr/local/lib/libcurl.a(ssluse.o): In function `servercert':
ssluse.c:(.text+0x107d): undefined reference to `SSL_get_peer_certificate'
ssluse.c:(.text+0x10cb): undefined reference to `SSL_get_peer_cert_chain'
ssluse.c:(.text+0x2604): undefined reference to `SSL_get_verify_result'
/usr/local/lib/libcurl.a(ssluse.o): In function `Curl_ossl_close':
ssluse.c:(.text+0x2767): undefined reference to `SSL_shutdown'
ssluse.c:(.text+0x2772): undefined reference to `SSL_set_connect_state'
ssluse.c:(.text+0x277d): undefined reference to `SSL_free'
ssluse.c:(.text+0x2793): undefined reference to `SSL_CTX_free'
/usr/local/lib/libcurl.a(ssluse.o): In function `Curl_ossl_shutdown':
ssluse.c:(.text+0x2847): undefined reference to `SSL_read'
ssluse.c:(.text+0x2859): undefined reference to `SSL_get_error'
ssluse.c:(.text+0x28cc): undefined reference to `SSL_free'
ssluse.c:(.text+0x292d): undefined reference to `SSL_get_shutdown'
ssluse.c:(.text+0x29c7): undefined reference to `SSL_shutdown'
/usr/local/lib/libcurl.a(ssluse.o): In function `Curl_ossl_check_cxn':
ssluse.c:(.text+0x2bf3): undefined reference to `SSL_peek'
/usr/local/lib/libcurl.a(ssluse.o): In function `Curl_ossl_init':
ssluse.c:(.text+0x2c3c): undefined reference to `SSL_load_error_strings'
ssluse.c:(.text+0x2c41): undefined reference to `SSL_library_init'
/usr/local/lib/libcurl.a(ssluse.o): In function `ossl_connect_common':
ssluse.c:(.text+0x2e40): undefined reference to `SSL_connect'
ssluse.c:(.text+0x2e58): undefined reference to `SSL_get_error'
ssluse.c:(.text+0x2f40): undefined reference to `SSL_get_current_cipher'
ssluse.c:(.text+0x2f48): undefined reference to `SSL_CIPHER_get_name'
ssluse.c:(.text+0x30e3): undefined reference to `SSLv23_client_method'
ssluse.c:(.text+0x30f4): undefined reference to `SSL_CTX_free'
ssluse.c:(.text+0x30fc): undefined reference to `SSL_CTX_new'
ssluse.c:(.text+0x3147): undefined reference to `SSL_CTX_ctrl'
ssluse.c:(.text+0x31d2): undefined reference to `SSL_CTX_set_default_passwd_cb_userdata'
ssluse.c:(.text+0x31e9): undefined reference to `SSL_CTX_set_default_passwd_cb'
ssluse.c:(.text+0x3291): undefined reference to `SSLv2_client_method'
ssluse.c:(.text+0x32bb): undefined reference to `SSL_CTX_ctrl'
ssluse.c:(.text+0x33ca): undefined reference to `SSL_CTX_callback_ctrl'
ssluse.c:(.text+0x3409): undefined reference to `SSL_CTX_use_certificate_file'
ssluse.c:(.text+0x343c): undefined reference to `SSLv3_client_method'
ssluse.c:(.text+0x3462): undefined reference to `SSL_CTX_set_cipher_list'
ssluse.c:(.text+0x349d): undefined reference to `SSL_CTX_load_verify_locations'
ssluse.c:(.text+0x3502): undefined reference to `TLSv1_client_method'
ssluse.c:(.text+0x35b7): undefined reference to `SSL_CTX_ctrl'
ssluse.c:(.text+0x3662): undefined reference to `SSL_CTX_use_certificate_chain_file'
ssluse.c:(.text+0x367f): undefined reference to `SSL_get1_session'
ssluse.c:(.text+0x3785): undefined reference to `SSL_new'
ssluse.c:(.text+0x37a1): undefined reference to `SSL_get_certificate'
ssluse.c:(.text+0x37c0): undefined reference to `SSL_get_privatekey'
ssluse.c:(.text+0x37e2): undefined reference to `SSL_free'
ssluse.c:(.text+0x37f0): undefined reference to `SSL_CTX_check_private_key'
ssluse.c:(.text+0x3864): undefined reference to `SSL_CTX_use_PrivateKey_file'
ssluse.c:(.text+0x39f8): undefined reference to `SSL_CTX_set_verify'
ssluse.c:(.text+0x3a35): undefined reference to `SSL_free'
ssluse.c:(.text+0x3a40): undefined reference to `SSL_new'
ssluse.c:(.text+0x3a56): undefined reference to `SSL_set_connect_state'
ssluse.c:(.text+0x3aae): undefined reference to `SSL_set_session'
ssluse.c:(.text+0x3b17): undefined reference to `SSL_CTX_use_certificate'
ssluse.c:(.text+0x3bb8): undefined reference to `SSL_set_fd'
ssluse.c:(.text+0x3c6b): undefined reference to `SSL_CTX_use_PrivateKey'
ssluse.c:(.text+0x3ce7): undefined reference to `SSL_ctrl'
ssluse.c:(.text+0x3d86): undefined reference to `SSL_CTX_use_PrivateKey'
ssluse.c:(.text+0x3e64): undefined reference to `SSL_CTX_check_private_key'
ssluse.c:(.text+0x3ecd): undefined reference to `SSL_CTX_add_client_CA'
ssluse.c:(.text+0x3f15): undefined reference to `SSL_CTX_ctrl'
/usr/local/lib/libcurl.a(ssluse.o): In function `Curl_ossl_session_free':
ssluse.c:(.text+0x2735): undefined reference to `SSL_SESSION_free'
collect2: ld returned 1 exit status
make[2]: *** [bin/cmake-gui] Error 1
make[1]: *** [Source/QtDialog/CMakeFiles/cmake-gui.dir/all] Error 2
make: *** [all] Error 2
 ERROR: dev-util/cmake-2.8.5 failed (compile phase):


cmake 'found' a libcurl.so somewhere along the paths, but it didn't belong to the actual curl package. I think it uses an outdated libcurl.a now, but re-emerging curl or openldap won't help this matter.

Thanks :)


Edit: nevermind. Solved this by removing the libcurl.a. I should have followed my suspision of it being outdated.
Back to top
View user's profile Send private message
Display posts from previous:   
Reply to topic    Gentoo Forums Forum Index Portage & Programming All times are GMT
Page 1 of 1

 
Jump to:  
You cannot post new topics in this forum
You cannot reply to topics in this forum
You cannot edit your posts in this forum
You cannot delete your posts in this forum
You cannot vote in polls in this forum