Gentoo Forums
Gentoo Forums
Gentoo Forums
Quick Search: in
kde, kdeaddons - falha ao compilar
View unanswered posts
View posts from last 24 hours
View posts from last 7 days

 
Reply to topic    Gentoo Forums Forum Index Portuguese
View previous topic :: View next topic  
Author Message
jcarlos
n00b
n00b


Joined: 13 Sep 2003
Posts: 70
Location: Sao Paulo/SP - Brazil

PostPosted: Mon Sep 22, 2003 3:01 pm    Post subject: kde, kdeaddons - falha ao compilar Reply with quote

instalando o kde 3.1.3 do zero, e faltando APENAS 2 pacotes /p terminar a instalação, /c o seguinte comando me aconteceu isso:

root@ampere portage # USE="+arts -esd -gnome -gtk -xmms -pam -svga -sdl" emerge kde

passa um tempo da compilação e os erros:


depmode=gcc3 /bin/sh ../../admin/depcomp \
/bin/sh ../../libtool --silent --mode=compile --tag=CXX g++ -DHAVE_CONFIG_H -I. -I. -I../.. -I/usr/kde/3.1/include -I/usr/qt/3/include -I/usr/X11R6/include -DQT_THREAD_SUPPORT -D_REENTRANT -Wnon-virtual-dtor -Wno-long-long -Wundef -Wall -pedantic -W -Wpointer-arith -Wwrite-strings -ansi -D_XOPEN_SOURCE=500 -D_BSD_SOURCE -Wcast-align -Wconversion -O2 -march=athlon-xp -O2 -pipe -fomit-frame-pointer -fno-exceptions -fno-check-new -DQT_CLEAN_NAMESPACE -DQT_NO_COMPAT -DQT_NO_ASCII_CAST -c -o plugin_katehtmltools.lo `test -f 'plugin_katehtmltools.cpp' || echo './'`plugin_katehtmltools.cpp
In file included from plugin_katehtmltools.cpp:18:
plugin_katehtmltools.h:23:25: kate/plugin.h: No such file or directory
plugin_katehtmltools.h:24:30: kate/application.h: No such file or directory
plugin_katehtmltools.h:27:34: kate/documentmanager.h: No such file or directory
plugin_katehtmltools.h:28:29: kate/mainwindow.h: No such file or directory
plugin_katehtmltools.h:29:30: kate/viewmanager.h: No such file or directory
In file included from plugin_katehtmltools.cpp:18:
plugin_katehtmltools.h:48: `Plugin' is not a class or namespace
plugin_katehtmltools.h:54: `MainWindow' undeclared in namespace `Kate'
plugin_katehtmltools.h:54: `win' was not declared in this scope
plugin_katehtmltools.h:54: invalid data member initialization
plugin_katehtmltools.h:54: (use `=' to initialize static data members)
plugin_katehtmltools.h:54: variable or field `addView' declared void
plugin_katehtmltools.h:55: `MainWindow' undeclared in namespace `Kate'
plugin_katehtmltools.h:55: `win' was not declared in this scope
plugin_katehtmltools.h:55: invalid data member initialization
plugin_katehtmltools.h:55: variable or field `removeView' declared void
In file included from plugin_katehtmltools.cpp:19:
plugin_katehtmltools.moc: In static member function `static QMetaObject*
PluginKateHtmlTools::staticMetaObject()':
plugin_katehtmltools.moc:127: no class template named `Plugin' in `Kate'
plugin_katehtmltools.moc: In member function `virtual void*
PluginKateHtmlTools::qt_cast(const char*)':
plugin_katehtmltools.moc:149: `Plugin' undeclared (first use this function)
plugin_katehtmltools.moc:149: (Each undeclared identifier is reported only once
for each function it appears in.)
plugin_katehtmltools.moc:149: syntax error before `::' token
In file included from plugin_katehtmltools.cpp:19:
plugin_katehtmltools.moc: In member function `virtual bool
PluginKateHtmlTools::qt_invoke(int, QUObject*)':
plugin_katehtmltools.moc:157: syntax error before `::' token
In file included from plugin_katehtmltools.cpp:19:
plugin_katehtmltools.moc:153: warning: unused parameter `QUObject*_o'
plugin_katehtmltools.moc: In member function `virtual bool
PluginKateHtmlTools::qt_emit(int, QUObject*)':
plugin_katehtmltools.moc:164: syntax error before `::' token
plugin_katehtmltools.moc:163: warning: unused parameter `int _id'
plugin_katehtmltools.moc:163: warning: unused parameter `QUObject*_o'
plugin_katehtmltools.moc: In member function `virtual bool
PluginKateHtmlTools::qt_property(int, int, QVariant*)':
plugin_katehtmltools.moc:170: syntax error before `::' token
plugin_katehtmltools.moc:169: warning: unused parameter `int id'
plugin_katehtmltools.moc:169: warning: unused parameter `int f'
plugin_katehtmltools.moc:169: warning: unused parameter `QVariant*v'
plugin_katehtmltools.cpp: At global scope:
plugin_katehtmltools.cpp:32: syntax error before `*' token
plugin_katehtmltools.cpp: In member function `virtual QObject*
KatePluginFactory::createObject(QObject*, const char*, const char*, const
QStringList&)':
plugin_katehtmltools.cpp:56: cannot convert `PluginKateHtmlTools*' to `QObject*
' in return
plugin_katehtmltools.cpp: In constructor
`PluginKateHtmlTools::PluginKateHtmlTools(QObject*, const char*)':
plugin_katehtmltools.cpp:62: `Plugin' is not a class or namespace
plugin_katehtmltools.cpp:62: `Application' undeclared in namespace `Kate'
plugin_katehtmltools.cpp:62: syntax error before `)' token
plugin_katehtmltools.cpp: In member function
`PluginKateHtmlTools::PluginKateHtmlTools(QObject*, const char*)':
plugin_katehtmltools.cpp:62: warning: unused parameter `QObject*parent'
plugin_katehtmltools.cpp:62: warning: unused parameter `const char*name'
plugin_katehtmltools.cpp: At global scope:
plugin_katehtmltools.cpp:70: `MainWindow' undeclared in namespace `Kate'
plugin_katehtmltools.cpp:70: `win' was not declared in this scope
plugin_katehtmltools.cpp:71: `void PluginKateHtmlTools::addView' is not a
static member of `class PluginKateHtmlTools'
plugin_katehtmltools.cpp:71: variable `void PluginKateHtmlTools::addView' has
initializer but incomplete type
plugin_katehtmltools.cpp:71: syntax error before `{' token
plugin_katehtmltools.cpp:78: syntax error before `->' token
plugin_katehtmltools.cpp:79: syntax error before `->' token
plugin_katehtmltools.cpp:80: syntax error before `->' token
plugin_katehtmltools.cpp:81: syntax error before `->' token
plugin_katehtmltools.cpp:83: syntax error before `.' token
plugin_katehtmltools.cpp:86: `MainWindow' undeclared in namespace `Kate'
plugin_katehtmltools.cpp:86: `win' was not declared in this scope
plugin_katehtmltools.cpp:87: warning: extra qualification `PluginKateHtmlTools
::' on member `removeView' ignored
plugin_katehtmltools.cpp:87: variable or field `removeView' declared void
plugin_katehtmltools.cpp:87: `int PluginKateHtmlTools::removeView' is not a
static member of `class PluginKateHtmlTools'
plugin_katehtmltools.cpp:87: syntax error before `{' token
plugin_katehtmltools.cpp:88: invalid use of member `
PluginKateHtmlTools::m_views'
plugin_katehtmltools.cpp:88: syntax error before `;' token
plugin_katehtmltools.cpp:88: syntax error before `++' token
plugin_katehtmltools.cpp:92: syntax error before `.' token
plugin_katehtmltools.cpp:93: syntax error before `->' token
plugin_katehtmltools.cpp:100: warning: extra qualification `PluginKateHtmlTools
::' on member `slotEditHTMLtag' ignored
plugin_katehtmltools.cpp: In member function `void
PluginKateHtmlTools::slotEditHTMLtag()':
plugin_katehtmltools.cpp:101: `application' undeclared (first use this
function)
plugin_katehtmltools.cpp: At global scope:
plugin_katehtmltools.cpp:121: warning: extra qualification `PluginKateHtmlTools
::' on member `KatePrompt' ignored
plugin_katehtmltools.cpp:136: warning: extra qualification `PluginKateHtmlTools
::' on member `slipInHTMLtag' ignored
make[3]: *** [plugin_katehtmltools.lo] Error 1
make[3]: Leaving directory `/var/tmp/portage/kdeaddons-3.1.3/work/kdeaddons-3.1.3/kate/htmltools'
make[2]: *** [all-recursive] Error 1
make[2]: Leaving directory `/var/tmp/portage/kdeaddons-3.1.3/work/kdeaddons-3.1.3/kate'
make[1]: *** [all-recursive] Error 1
make[1]: Leaving directory `/var/tmp/portage/kdeaddons-3.1.3/work/kdeaddons-3.1.3'
make: *** [all] Error 2

!!! ERROR: kde-base/kdeaddons-3.1.3 failed.
!!! Function kde_src_compile, Line 137, Exitcode 2
!!! died running emake, kde_src_compile:make

root@ampere portage #


faltam 2 pacotes /p terminar a instalação do kde, o que falhou, e o kdeartwork.. tentei já ir compilando o kdeartwork /p ver se já comia o tempo de compilação, mas também deu alguns erros...

se alguém puder ajudar... agradeço desde já
_________________
--------------------------------
João Medrado
http://blog.joaomedrado.com
Back to top
View user's profile Send private message
jcarlos
n00b
n00b


Joined: 13 Sep 2003
Posts: 70
Location: Sao Paulo/SP - Brazil

PostPosted: Mon Sep 29, 2003 2:05 am    Post subject: Reply with quote

ao compilar o kde-3.1.4 q foi liberado como estavel esses dias no portage ñ tive nenhum problema.. e ñ tenho a menor idéia de qual é/era o problema no kde-3.1.3...
_________________
--------------------------------
João Medrado
http://blog.joaomedrado.com
Back to top
View user's profile Send private message
Display posts from previous:   
Reply to topic    Gentoo Forums Forum Index Portuguese All times are GMT
Page 1 of 1

 
Jump to:  
You cannot post new topics in this forum
You cannot reply to topics in this forum
You cannot edit your posts in this forum
You cannot delete your posts in this forum
You cannot vote in polls in this forum