Gentoo Forums
Gentoo Forums
Gentoo Forums
Quick Search: in
LibreOffice 3.3
View unanswered posts
View posts from last 24 hours

Goto page 1, 2, 3 ... 23, 24, 25  Next  
Reply to topic    Gentoo Forums Forum Index Other Things Gentoo
View previous topic :: View next topic  
Author Message
geki
Advocate
Advocate


Joined: 13 May 2004
Posts: 2325
Location: Germania

PostPosted: Wed Nov 25, 2009 5:42 pm    Post subject: LibreOffice 3.3 Reply with quote

http://code.google.com/p/gekis-playground/source/browse/

app-office/libreoffice-3.3.0.4 released!

!! info about split build of boost !!

why do you want it over portage version?
· no gtk dep for kde-only
· jemalloc allocator
· more useflags
· ... whatever I forgot to mention

known issues
· module sdext/presenter fails; afterwards, run ebuild /path/to/ebuild install qmerge
honzulak1 wrote:
# cd /var/tmp/portage/app-office/libreoffice-3.2.99.2/work/libreoffice-build-3.2.99.2/build/libreoffice-3.2.99.2/sdext/source/presenter
# sed -i 's/%2F/\//' ../../unxlngx6.pro/misc/PresenterScreen.dpz
# mkdir ../../unxlngx6.pro/misc/PresenterScreen/help/en-US/caption/com.sun.PresenterScreen-linux_x86_64
# mv ../../unxlngx6.pro/misc/PresenterScreen/help/en-US/caption/com.sun.PresenterScreen-linux_x86_64%2Fpresenter.xhp ../../unxlngx6.pro/misc/PresenterScreen/help/en-US/caption/com.sun.PresenterScreen-linux_x86_64/presenter.xhp
# mkdir ../../unxlngx6.pro/misc/PresenterScreen/help/en-US/content/com.sun.PresenterScreen-linux_x86_64
# mv ../../unxlngx6.pro/misc/PresenterScreen/help/en-US/content/com.sun.PresenterScreen-linux_x86_64/com.sun.PresenterScreen-linux_x86_64%2Fpresenter.xhp ../../unxlngx6.pro/misc/PresenterScreen/help/en-US/content/com.sun.PresenterScreen-linux_x86_64/presenter.xhp
will be fixed as soon as you identify the problem!

status:
mkyral wrote:
The problematic line is from sdext/source/presenter/makefile.mk
Code:
COMPONENT_HELP=                                                                 \
    $(ZIP1DIR)$/help/component.txt                              \
    $(foreach,l,$(alllangiso) $(ZIP1DIR)$/help$/$l$/com.sun.PresenterScreen-$(PLATFORMID)$/presenter.xhp)


It generates this:
Code:
# grep "%" ../unxlngx6.pro/misc/PresenterScreen.dpz
        ../../unxlngx6.pro/misc/PresenterScreen/help$/cs$/caption$/com.sun.PresenterScreen-linux_x86_64%2Fpresenter.xhp \
        ../../unxlngx6.pro/misc/PresenterScreen/help$/en-US$/caption$/com.sun.PresenterScreen-linux_x86_64%2Fpresenter.xhp \
        ../../unxlngx6.pro/misc/PresenterScreen/help$/cs$/content$/com.sun.PresenterScreen-linux_x86_64%2Fpresenter.xhp \
        ../../unxlngx6.pro/misc/PresenterScreen/help$/en-US$/content$/com.sun.PresenterScreen-linux_x86_64%2Fpresenter.xhp \

geki wrote:
hmm, the slash variable ( '$/' ) is not replaced at all.

___
it could be this?! just a wild guess ... could not be ...
http://cgit.freedesktop.org/libreoffice/extensions/tree/sdext/source/presenter/makefile.mk?id=64f237d17d28af99bfab19628afedbc1aaae8135#n284

n285 | n287 | n294: you see the '$/' strings

n298: you see the '/' strings - missing the '$'


___
log
http://cgit.freedesktop.org/libreoffice/build/log/

news/issues
http://planet.documentfoundation.org/

openoffice wiki
http://wiki.services.openoffice.org/wiki/Main_Page

___
it is just insane to restart from scratch usually.
ask me for a patch. or what configure flag to tweak. or ...
but, please, do not start from scratch!

=> ebuild /path/to/ebuild install qmerge
_________________
boost|select libs to build|slotable|python-buildid

hear hear


Last edited by geki on Thu Jan 20, 2011 10:29 pm; edited 54 times in total
Back to top
View user's profile Send private message
albright
Advocate
Advocate


Joined: 16 Nov 2003
Posts: 2542
Location: Near Toronto

PostPosted: Wed Nov 25, 2009 9:11 pm    Post subject: Reply with quote

after adding openoffice-geki overlay I get this error when emerge
tries to get openoffice files:

Code:
('Failed on RMD160 verification', '33fc1a3d65bb8060091c1274a43e09cd5c13927d', '3285b9715fb05fdfe6e31b164d54b7b77bf8122d')
!!! Fetched file: ooo-build-a96dab3afc2d47da4cabf2890e3c8215187e96a6.tar.gz VERIFY FAILED!                               
!!! Reason: Failed on RMD160 verification                                                                               
!!! Got:      33fc1a3d65bb8060091c1274a43e09cd5c13927d                                                                   
!!! Expected: 3285b9715fb05fdfe6e31b164d54b7b77bf8122d
Refetching... File renamed to '/usr/portage/distfiles/ooo-build-a96dab3afc2d47da4cabf2890e3c8215187e96a6.tar.gz._checksum_failure_.zErxSO'

!!! Couldn't download 'ooo-build-a96dab3afc2d47da4cabf2890e3c8215187e96a6.tar.gz'. Aborting.
 * Fetch failed for 'app-office/openoffice-3.1.1.19_pre20090929', Log file:
 *  '/mnt/sdb1/tmp/portage/app-office/openoffice-3.1.1.19_pre20090929/temp/build.log'

_________________
.... there is nothing - absolutely nothing - half so much worth
doing as simply messing about with Linux ...
(apologies to Kenneth Graeme)
Back to top
View user's profile Send private message
geki
Advocate
Advocate


Joined: 13 May 2004
Posts: 2325
Location: Germania

PostPosted: Wed Nov 25, 2009 10:26 pm    Post subject: Reply with quote

hmm, I knew I would forget something! :o

this is known, and I have not had this problem with portage-2.2_rc51 today.

- grab ooo-build tarball manually with wget
- edit Manifest file; remove ooo-build-... line
- run 'ebuild /path/to/ebuild digest'

and you should be fine then.

edit #1 and 'app-office/openoffice-3.1.1.19_pre20090929' is the old one, huh?! :roll:
_________________
boost|select libs to build|slotable|python-buildid

hear hear
Back to top
View user's profile Send private message
albright
Advocate
Advocate


Joined: 16 Nov 2003
Posts: 2542
Location: Near Toronto

PostPosted: Thu Nov 26, 2009 1:35 am    Post subject: Reply with quote

thanks for that - got the 3.2 file and emerged for about
50 minutes (which is almost done on my machine)
but then, sadly:

Code:
2 module(s):
        sysui
        sc   
need(s) to be rebuilt

Reason(s):

ERROR: error 65280 occurred while making /mnt/sdb1/tmp/portage/app-office/openoffice-3.2.0.5_pre20091125/work/ooo-build-292da4610b27cd0a9c307136345276d2a8276fe2/build/OOO320_m5/sc/util                                                                                               
ERROR: error 65280 occurred while making /mnt/sdb1/tmp/portage/app-office/openoffice-3.2.0.5_pre20091125/work/ooo-build-292da4610b27cd0a9c307136345276d2a8276fe2/build/OOO320_m5/sysui/util                                                                                             

Attention: if you build and deliver the above module(s) you may prolongue your the build issuing command "build --from sysui sc"

rmdir /mnt/sdb1/tmp/portage/app-office/openoffice-3.2.0.5_pre20091125/temp/QT9LK1vlr5
make: *** [stamp/build] Error 1         


any advice on this?
_________________
.... there is nothing - absolutely nothing - half so much worth
doing as simply messing about with Linux ...
(apologies to Kenneth Graeme)
Back to top
View user's profile Send private message
geki
Advocate
Advocate


Joined: 13 May 2004
Posts: 2325
Location: Germania

PostPosted: Thu Nov 26, 2009 10:27 am    Post subject: Reply with quote

any advice, hmm, upload the build.log somewhen and link it here, please! :)

I hope it is not the dev-perl/Archive-Zip issue! :?
_________________
boost|select libs to build|slotable|python-buildid

hear hear
Back to top
View user's profile Send private message
albright
Advocate
Advocate


Joined: 16 Nov 2003
Posts: 2542
Location: Near Toronto

PostPosted: Thu Nov 26, 2009 2:43 pm    Post subject: Reply with quote

you can get the build log at

www.utsc.utoronto.ca/~seager/oobuildlog.tar.bz2

if you get a chance to look at it that would be great but
I know it's a lot to ask ...
_________________
.... there is nothing - absolutely nothing - half so much worth
doing as simply messing about with Linux ...
(apologies to Kenneth Graeme)
Back to top
View user's profile Send private message
geki
Advocate
Advocate


Joined: 13 May 2004
Posts: 2325
Location: Germania

PostPosted: Thu Nov 26, 2009 3:56 pm    Post subject: Reply with quote

I knew it. anyone, please ...
Quote:
Can't call method "desiredCompressionLevel" on an undefined value at /usr/lib64/perl5/vendor_perl/5.8.8/Archive/Zip/Archive.pm line 249.
dmake: Error code 2, while making 'build_extn'
what the heck is up with Archive-Zip?! :?

edit #1
okay, Archive::Zip got pedantic. :o
a patch is in queue and soon in overlay.
_________________
boost|select libs to build|slotable|python-buildid

hear hear
Back to top
View user's profile Send private message
geki
Advocate
Advocate


Joined: 13 May 2004
Posts: 2325
Location: Germania

PostPosted: Sat Nov 28, 2009 1:09 am    Post subject: Reply with quote

yay, fixed patch apply and updated overlay. :oops:
_________________
boost|select libs to build|slotable|python-buildid

hear hear
Back to top
View user's profile Send private message
geki
Advocate
Advocate


Joined: 13 May 2004
Posts: 2325
Location: Germania

PostPosted: Sat Nov 28, 2009 3:41 am    Post subject: Reply with quote

yay, OOo 3.2 is freed from evil gtk+ depend! :o
USE="-gnome -gtk -nsplugin -gstreamer" will present you a glib, gdk and gtk+ free OOo.

for USE="nsplugin" I will ask the kde4 porter to check Firefox/Qt4 and OOo plugin code.
Maybe, I get his attention. :lol:

edit #1
ahem, I forgot about bug 289879. :)
time to add it to my overlay.
_________________
boost|select libs to build|slotable|python-buildid

hear hear
Back to top
View user's profile Send private message
asturm
Developer
Developer


Joined: 05 Apr 2007
Posts: 7108
Location: Austria

PostPosted: Sat Nov 28, 2009 10:55 am    Post subject: Reply with quote

woohoo! melikes 8)

emerging soon...

EDIT: As always, it wouldn't compile without moving into my overlay and modifying Manifest for ooo-build, but oh well... 8)
_________________
backend.cpp:92:2: warning: #warning TODO - this error message is about as useful as a cooling unit in the arctic
Back to top
View user's profile Send private message
geki
Advocate
Advocate


Joined: 13 May 2004
Posts: 2325
Location: Germania

PostPosted: Sat Nov 28, 2009 3:14 pm    Post subject: Reply with quote

yes, that was added to known issues. :D
_________________
boost|select libs to build|slotable|python-buildid

hear hear
Back to top
View user's profile Send private message
albright
Advocate
Advocate


Joined: 16 Nov 2003
Posts: 2542
Location: Near Toronto

PostPosted: Sat Nov 28, 2009 6:19 pm    Post subject: Reply with quote

my build still fails :(

this time the message is

Code:
Module 'sw' delivered successfully. 264 files copied, 0 files unchanged                                                                     

1 module(s):
        sysui
need(s) to be rebuilt

Reason(s):

ERROR: error 65280 occurred while making /mnt/sdb1/tmp/portage/app-office/openoffice-3.2.0.5_pre20091126/work/ooo-build-b7978f95483f9eee8c6a0f4e029f455e158bf8ab/build/OOO320_m5/sysui/util                                                                                             

Attention: if you build and deliver the above module(s) you may prolongue your the build issuing command "build --from sysui"

rmdir /mnt/sdb1/tmp/portage/app-office/openoffice-3.2.0.5_pre20091126/temp/jSWEtfRYF2
make: *** [stamp/build] Error 1                                                     
 *                                                                                   
 * ERROR: app-office/openoffice-3.2.0.5_pre20091126 failed.


Inside the build.log I find suspicious lines:

Code:
Entering /mnt/sdb1/tmp/portage/app-office/openoffice-3.2.0.5_pre20091126/work/ooo-build-b7978f95483f9eee8c6a0f4e029f455e158bf8ab/build/OOO320_m5/sysui/desktop/util

Entering /mnt/sdb1/tmp/portage/app-office/openoffice-3.2.0.5_pre20091126/work/ooo-build-b7978f95483f9eee8c6a0f4e029f455e158bf8ab/build/OOO320_m5/sysui/util
/usr/bin/perl checksize.pl
Checking:../unxlngx6.pro/
Error: ../unxlngx6.pro/misc/sysui/desktop/share/localize.sdf 0 Bytes!
Error: 1 damaged files encountered
dmake:  Error code 1, while making '../unxlngx6.pro/misc/checksize.done'

_________________
.... there is nothing - absolutely nothing - half so much worth
doing as simply messing about with Linux ...
(apologies to Kenneth Graeme)
Back to top
View user's profile Send private message
asturm
Developer
Developer


Joined: 05 Apr 2007
Posts: 7108
Location: Austria

PostPosted: Sat Nov 28, 2009 7:15 pm    Post subject: Reply with quote

damnit, also failed late in the game:

Code:
... languages en-US_en-GB_de ...                                                                   
... analyzing files ...                                                                             
... analyzing files with flag ARCHIVE ...                                                           
WARNING: Repeating to unpack /var/tmp/portage/app-office/openoffice-3.2.0.5_pre20091126/work/ooo-build-b7978f95483f9eee8c6a0f4e029f455e158bf8ab/build/OOO320_m5/solver/320/unxlngx6.pro/pck/intro.zip! WARNING: Repeating to unpack /var/tmp/portage/app-office/openoffice-3.2.0.5_pre20091126/work/ooo-build-b7978f95483f9eee8c6a0f4e029f455e158bf8ab/build/OOO320_m5/solver/320/unxlngx6.pro/pck/intro.zip! WARNING: Repeating to unpack /var/tmp/portage/app-office/openoffice-3.2.0.5_pre20091126/work/ooo-build-b7978f95483f9eee8c6a0f4e029f455e158bf8ab/build/OOO320_m5/solver/320/unxlngx6.pro/pck/intro.zip! WARNING: Repeating to unpack /var/tmp/portage/app-office/openoffice-3.2.0.5_pre20091126/work/ooo-build-b7978f95483f9eee8c6a0f4e029f455e158bf8ab/build/OOO320_m5/solver/320/unxlngx6.pro/pck/intro.zip! WARNING: Repeating to unpack /var/tmp/portage/app-office/openoffice-3.2.0.5_pre20091126/work/ooo-build-b7978f95483f9eee8c6a0f4e029f455e158bf8ab/build/OOO320_m5/solver/320/unxlngx6.pro/pck/intro.zip! ... cleaning the output tree ...                                                                         
... removing directory /var/tmp/portage/app-office/openoffice-3.2.0.5_pre20091126/temp/ooopackaging/i_86361259428241 ...                                                                               

**************************************************
ERROR: ERROR: Failed to unzip /var/tmp/portage/app-office/openoffice-3.2.0.5_pre20091126/work/ooo-build-b7978f95483f9eee8c6a0f4e029f455e158bf8ab/build/OOO320_m5/solver/320/unxlngx6.pro/pck/intro.zip !
in function: resolving_archive_flag                                                                 
**************************************************                                                 

**************************************************
ERROR: Saved logfile: /var/tmp/portage/app-office/openoffice-3.2.0.5_pre20091126/work/ooo-build-b7978f95483f9eee8c6a0f4e029f455e158bf8ab/build/OOO320_m5/instsetoo_native/util/OpenOffice//logging/en-US_en-GB_de/log_OOO320_en-US_en-GB_de.log                                                             
**************************************************                                                 
Sat Nov 28 18:10:46 2009 (00:05 min.)                                                               
Failed to install:  at ./ooinstall line 154.                                                       
make: *** [install] Error 1

_________________
backend.cpp:92:2: warning: #warning TODO - this error message is about as useful as a cooling unit in the arctic
Back to top
View user's profile Send private message
albright
Advocate
Advocate


Joined: 16 Nov 2003
Posts: 2542
Location: Near Toronto

PostPosted: Sat Nov 28, 2009 7:51 pm    Post subject: Reply with quote

I erased all old files in distfiles and the build locations to try
again from scratch - went from bad to worse

Code:
Checking for source packages in /mnt/sdb1/tmp/portage/app-office/openoffice-3.2.0.5_pre20091126/distdir                                     
Looking for OOo-Dev_OOO320_m5_src_core.tar.bz2 ... ok                                                                                       
Unpacking OO.o build tree - [ go and have some cold blood ] ...                                                                             
Unpacking OOo-Dev_OOO320_m5_src_core.tar.bz2...                                                                                             
bzip2: /mnt/sdb1/tmp/portage/app-office/openoffice-3.2.0.5_pre20091126/distdir/OOo-Dev_OOO320_m5_src_core.tar.bz2 is not a bzip2 file.     
tar: This does not look like a tar archive                                                                                                 
tar: Error exit delayed from previous errors                                                                                               
make: *** [/mnt/sdb1/tmp/portage/app-office/openoffice-3.2.0.5_pre20091126/work/ooo-build-b7978f95483f9eee8c6a0f4e029f455e158bf8ab/build/OOO320_m5/unpack] Error 1                         


I noticed some of the mirrors had .ru locations - a bit dicey for me now
_________________
.... there is nothing - absolutely nothing - half so much worth
doing as simply messing about with Linux ...
(apologies to Kenneth Graeme)
Back to top
View user's profile Send private message
StringCheesian
l33t
l33t


Joined: 21 Oct 2003
Posts: 887

PostPosted: Sat Nov 28, 2009 9:25 pm    Post subject: Reply with quote

I'm getting the same error that albright did:
Code:
1 module(s):
        sysui
need(s) to be rebuilt

Reason(s):

ERROR: error 65280 occurred while making /var/tmp/portage/app-office/openoffice-3.2.0.5_pre20091126/work/ooo-build-b7978f95483f9eee8c6a0f4e029f455e158bf8ab/build/OOO320_m5/sysui/util

Code:
/usr/bin/perl checksize.pl
Checking:../unxlngx6.pro/
Error: ../unxlngx6.pro/misc/sysui/desktop/share/localize.sdf 0 Bytes!
Error: 1 damaged files encountered
dmake:  Error code 1, while making '../unxlngx6.pro/misc/checksize.done'
Back to top
View user's profile Send private message
geki
Advocate
Advocate


Joined: 13 May 2004
Posts: 2325
Location: Germania

PostPosted: Sun Nov 29, 2009 3:50 am    Post subject: Reply with quote

albright & StringCheesian
no idea. what locales do you set? any temp directory cleaner as cronjob? I cannot reproduce this. :(

genstorm
I had this with <dev-perl/Archive-Zip-1.30, dev-perl/Archive-Zip-1.30 fixed that. :roll:
which version do you have installed?
_________________
boost|select libs to build|slotable|python-buildid

hear hear
Back to top
View user's profile Send private message
StringCheesian
l33t
l33t


Joined: 21 Oct 2003
Posts: 887

PostPosted: Sun Nov 29, 2009 5:05 am    Post subject: Reply with quote

geki wrote:
albright & StringCheesian
no idea. what locales do you set? any temp directory cleaner as cronjob? I cannot reproduce this. :(

~amd64
USE="bash-completion branding cups dbus gnome gstreamer gtk opengl pam" (all of the ebuild's other USE flags are off)
LINGUAS="en_US" (only that one)
CFLAGS="-O2 -march=k8-sse3 -pipe"
LDFLAGS="-Wl,-O1 -Wl,--as-needed"
MAKEOPTS="-j3"

I haven't installed any cronjobs, and I never mess with /var/tmp/portage when emerge is using it.

Are you using something like LDFLAGS="" MAKEOPTS="j1"?
Back to top
View user's profile Send private message
albright
Advocate
Advocate


Joined: 16 Nov 2003
Posts: 2542
Location: Near Toronto

PostPosted: Sun Nov 29, 2009 2:10 pm    Post subject: Reply with quote

Here is my emerge --info:

Code:
Portage 2.1.6.13 (default/linux/amd64/10.0/desktop, gcc-4.4.2, glibc-2.9_p20081201-r2, 2.6.31-zen7 x86_64)
=================================================================                                         
System uname: Linux-2.6.31-zen7-x86_64-Intel-R-_Core-TM-_i7_CPU_920_@_2.67GHz-with-gentoo-1.12.13         
Timestamp of tree: Sun, 29 Nov 2009 09:00:01 +0000                                                       
distcc 3.1 x86_64-pc-linux-gnu [disabled]                                                                 
app-shells/bash:     4.0_p28                                                                             
dev-java/java-config: 2.1.9-r1                                                                           
dev-lang/python:     2.6.4, 3.1.1-r1                                                                     
dev-util/cmake:      2.6.4-r3                                                                             
sys-apps/baselayout: 1.12.13                                                                             
sys-apps/sandbox:    2.2                                                                                 
sys-devel/autoconf:  2.13, 2.63-r1                                                                       
sys-devel/automake:  1.5, 1.7.9-r1, 1.8.5-r3, 1.9.6-r2, 1.10.2                                           
sys-devel/binutils:  2.18-r3                                                                             
sys-devel/gcc-config: 1.4.1                                                                               
sys-devel/libtool:   2.2.6b                                                                               
virtual/os-headers:  2.6.27-r2                                                                           
ACCEPT_KEYWORDS="amd64"                                                                                   
CBUILD="x86_64-pc-linux-gnu"                                                                             
CFLAGS="-march=native -O2 -pipe -msse4 -fomit-frame-pointer"                                             
CHOST="x86_64-pc-linux-gnu"                                                                               
CONFIG_PROTECT="/etc /usr/kde/3.5/env /usr/kde/3.5/share/config /usr/kde/3.5/shutdown /usr/share/X11/xkb /usr/share/config /var/bind"
CONFIG_PROTECT_MASK="/etc/ca-certificates.conf /etc/env.d /etc/env.d/java/ /etc/fonts/fonts.conf /etc/gconf /etc/revdep-rebuild /etc/sandbox.d /etc/terminfo /etc/texmf/language.dat.d /etc/texmf/language.def.d /etc/texmf/updmap.d /etc/texmf/web2c /etc/udev/rules.d"               
CXXFLAGS="-march=native -O2 -pipe -msse4 -fomit-frame-pointer"                                                                             
DISTDIR="/usr/portage/distfiles"                                                                                                           
FEATURES="distlocks fixpackages parallel-fetch protect-owned sandbox sfperms strict unmerge-orphans userfetch"                             
GENTOO_MIRRORS="http://distfiles.gentoo.org http://distro.ibiblio.org/pub/linux/distributions/gentoo"                                       
LDFLAGS="-Wl,-O1"                                                                                                                           
MAKEOPTS="-j9"                                                                                                                             
PKGDIR="/usr/portage/packages"
PORTAGE_CONFIGROOT="/"
PORTAGE_RSYNC_OPTS="--recursive --links --safe-links --perms --times --compress --force --whole-file --delete --stats --timeout=180 --exclude=/distfiles --exclude=/local --exclude=/packages"
PORTAGE_TMPDIR="/var/tmp"
PORTDIR="/usr/portage"
PORTDIR_OVERLAY="/usr/local/portage/layman/zen-sources /usr/local/portage/layman/openoffice-geki /usr/local/portage"
SYNC="rsync://rsync.gentoo.org/gentoo-portage"
USE="X a52 aac acl acpi alsa amd64 berkdb bluetooth branding bzip2 cairo cdr cleartype cli consolekit cracklib crypt cups dbus dri dts dvd dvdr eds embedded emboss encode evo fam firefox flac fortran gdbm gif gpm gstreamer hal iconv jpeg kde kpathsea ldap libnotify mad mikmod mmx modules mp3 mp4 mpeg mudflap multilib mysql ncurses nls nptl nptlonly ogg opengl openmp pam pcre pdf perl png ppds pppd python qt3 qt3support qt4 quicktime readline reflection sdl session spell spl sql sse sse2 ssl startup-notification svg sysfs tcpd thunar tiff truetype unicode usb vorbis webkit x264 xcomposite xinerama xml xorg xulrunner xv xvid zlib" ALSA_CARDS="ali5451 als4000 atiixp atiixp-modem bt87x ca0106 cmipci emu10k1x ens1370 ens1371 es1938 es1968 fm801 hda-intel intel8x0 intel8x0m maestro3 trident usb-audio via82xx via82xx-modem ymfpci" ALSA_PCM_PLUGINS="adpcm alaw asym copy dmix dshare dsnoop empty extplug file hooks iec958 ioplug ladspa lfloat linear meter mmap_emul mulaw multi null plug rate route share shm softvol" APACHE2_MODULES="actions alias auth_basic authn_alias authn_anon authn_dbm authn_default authn_file authz_dbm authz_default authz_groupfile authz_host authz_owner authz_user autoindex cache dav dav_fs dav_lock deflate dir disk_cache env expires ext_filter file_cache filter headers include info log_config logio mem_cache mime mime_magic negotiation rewrite setenvif speling status unique_id userdir usertrack vhost_alias" ELIBC="glibc" INPUT_DEVICES="evdev keyboard mouse" KERNEL="linux" LCD_DEVICES="bayrad cfontz cfontz633 glk hd44780 lb216 lcdm001 mtxorb ncurses text" USERLAND="GNU" VIDEO_CARDS="nv nvidia"
Unset:  CPPFLAGS, CTARGET, EMERGE_DEFAULT_OPTS, FFLAGS, INSTALL_MASK, LANG, LC_ALL, LINGUAS, PORTAGE_COMPRESS, PORTAGE_COMPRESS_FLAGS, PORTAGE_RSYNC_EXTRA_OPTS

_________________
.... there is nothing - absolutely nothing - half so much worth
doing as simply messing about with Linux ...
(apologies to Kenneth Graeme)
Back to top
View user's profile Send private message
geki
Advocate
Advocate


Joined: 13 May 2004
Posts: 2325
Location: Germania

PostPosted: Sun Nov 29, 2009 2:52 pm    Post subject: Reply with quote

aha, en-US only build fails. :o
http://www.openoffice.org/issues/show_bug.cgi?id=103809

though, should be fixed already. :roll:
_________________
boost|select libs to build|slotable|python-buildid

hear hear
Back to top
View user's profile Send private message
asturm
Developer
Developer


Joined: 05 Apr 2007
Posts: 7108
Location: Austria

PostPosted: Sun Nov 29, 2009 4:23 pm    Post subject: Reply with quote

I still had Archive-Zip-1.28 installed. I'll try to resume the build when I'm back in Vienna today.
_________________
backend.cpp:92:2: warning: #warning TODO - this error message is about as useful as a cooling unit in the arctic
Back to top
View user's profile Send private message
geki
Advocate
Advocate


Joined: 13 May 2004
Posts: 2325
Location: Germania

PostPosted: Sun Nov 29, 2009 4:59 pm    Post subject: Reply with quote

genstorm
dev-perl/Archive-Zip upgrade and 'ebuild /path/to/ebuild install qmerge' should do, yes. :)

albright & StringCheesian
I updated the ebuild so that the '--with-lang' configure flag should not be added for en-US only builds. That should fix it.
___
I also added the MySQL section for ooo-build master.
So OOo has the native MySQL connector again.

app-office/openoffice-3.2.0.6_pre20091129 soon, untested.
release before testrun, feel free to be brave! ;)

edit #1
en-US only built fine.
I hope my final cleanup still works.
=> overlay updated

though, native MySQL connector still missing, even with the cws applied. :roll:

edit #2
okay, found the problem wrt mysql. :lol:
_________________
boost|select libs to build|slotable|python-buildid

hear hear
Back to top
View user's profile Send private message
asturm
Developer
Developer


Joined: 05 Apr 2007
Posts: 7108
Location: Austria

PostPosted: Sun Nov 29, 2009 10:26 pm    Post subject: Reply with quote

geki wrote:
genstorm
dev-perl/Archive-Zip upgrade and 'ebuild /path/to/ebuild install qmerge' should do, yes. :)

Nice - solved! :)
_________________
backend.cpp:92:2: warning: #warning TODO - this error message is about as useful as a cooling unit in the arctic
Back to top
View user's profile Send private message
albright
Advocate
Advocate


Joined: 16 Nov 2003
Posts: 2542
Location: Near Toronto

PostPosted: Mon Nov 30, 2009 1:24 pm    Post subject: Reply with quote

now I get:

Code:
2009-11-30 08:22:43 (1.44 MB/s) - `/usr/portage/distfiles/ooo-build-1fdb5c3b8ae83bdcb95026eeb348a55ba5999706.tar.gz' saved [29486410]

('Failed on RMD160 verification', 'abd64915909a62dffa1d8e381cd30f633358663f', 'a8947bf8ca90e9588152c8c57f781e566daa366f')
!!! Fetched file: ooo-build-1fdb5c3b8ae83bdcb95026eeb348a55ba5999706.tar.gz VERIFY FAILED!
!!! Reason: Failed on RMD160 verification
!!! Got:      abd64915909a62dffa1d8e381cd30f633358663f
!!! Expected: a8947bf8ca90e9588152c8c57f781e566daa366f
Refetching... File renamed to '/usr/portage/distfiles/ooo-build-1fdb5c3b8ae83bdcb95026eeb348a55ba5999706.tar.gz._checksum_failure_.oEEm_R'

!!! Couldn't download 'ooo-build-1fdb5c3b8ae83bdcb95026eeb348a55ba5999706.tar.gz'. Aborting.
 * Fetch failed for 'app-office/openoffice-3.2.0.6_pre20091129', Log file:
 *  '/mnt/sdb1/tmp/portage/app-office/openoffice-3.2.0.6_pre20091129/temp/build.log'


just not meant to be on my system I guess :(
_________________
.... there is nothing - absolutely nothing - half so much worth
doing as simply messing about with Linux ...
(apologies to Kenneth Graeme)
Back to top
View user's profile Send private message
geki
Advocate
Advocate


Joined: 13 May 2004
Posts: 2325
Location: Germania

PostPosted: Mon Nov 30, 2009 1:41 pm    Post subject: Reply with quote

everyone gets that because of funky webgit generation and RMD160 pedantic behaviour. I love that word. :lol:
just redo the RMD160 verification fix.
_________________
boost|select libs to build|slotable|python-buildid

hear hear
Back to top
View user's profile Send private message
albright
Advocate
Advocate


Joined: 16 Nov 2003
Posts: 2542
Location: Near Toronto

PostPosted: Mon Nov 30, 2009 2:52 pm    Post subject: Reply with quote

OK - I did a forced manifest and lo and behold, it did
compile and seems to run fine, integrate with kde
very well ...

thanks
_________________
.... there is nothing - absolutely nothing - half so much worth
doing as simply messing about with Linux ...
(apologies to Kenneth Graeme)
Back to top
View user's profile Send private message
Display posts from previous:   
Reply to topic    Gentoo Forums Forum Index Other Things Gentoo All times are GMT
Goto page 1, 2, 3 ... 23, 24, 25  Next
Page 1 of 25

 
Jump to:  
You cannot post new topics in this forum
You cannot reply to topics in this forum
You cannot edit your posts in this forum
You cannot delete your posts in this forum
You cannot vote in polls in this forum