Gentoo Forums
Gentoo Forums
Gentoo Forums
Quick Search: in
[emerge] ebuild.sh: Called src_install
View unanswered posts
View posts from last 24 hours

 
Reply to topic    Gentoo Forums Forum Index French
View previous topic :: View next topic  
Author Message
elfangor
n00b
n00b


Joined: 21 May 2008
Posts: 20

PostPosted: Tue Nov 11, 2008 8:05 pm    Post subject: [emerge] ebuild.sh: Called src_install Reply with quote

Bonjour à tous,

J'ai essayé d'emerge gnome, kde ou enlightenment ainsi que d'autre pacquet, et a chaque fois j'ai ce message:

Code:

ebuild.sh, line   49:  Called src_install
 *             environment, line 2566:  Called gnome2_src_install
 *             environment, line 1972:  Called die


j'ai tenté un revdep-rebuild puis emerge --deep --newuses world
mais j'ai la même erreur :(

Voila les messages d'erreur complet:

Code:

bIDL-2.0 -I/usr/include/glib-2.0 -I/usr/lib/glib-2.0/include      -O2 -march=i686 -pipe -Werror-implicit-function-declaration  -MT orbit-idl-c-skelimpl.o -MD -MP -MF .deps/orbit-idl-c-skelimpl.Tpo -c -o orbit-idl-c-skelimpl.o orbit-idl-c-skelimpl.c
mv -f .deps/orbit-idl-c-skelimpl.Tpo .deps/orbit-idl-c-skelimpl.Po
i686-pc-linux-gnu-gcc -DHAVE_CONFIG_H -I. -I../.. -I../.. -I../../include -I../.. -I../../include -DORBIT_BACKENDS_DIR="\"/usr/lib/orbit-2.0/idl-backends\"" -DVERSION=\"2.14.13\" -DORBIT2_INTERNAL_API -Wall -Wunused -Wmissing-prototypes -Wmissing-declarations  -I/usr/include/libIDL-2.0 -I/usr/include/glib-2.0 -I/usr/lib/glib-2.0/include      -O2 -march=i686 -pipe -Werror-implicit-function-declaration  -MT orbit-idl-c-utils.o -MD -MP -MF .deps/orbit-idl-c-utils.Tpo -c -o orbit-idl-c-utils.o orbit-idl-c-utils.c
mv -f .deps/orbit-idl-c-utils.Tpo .deps/orbit-idl-c-utils.Po
i686-pc-linux-gnu-gcc -DHAVE_CONFIG_H -I. -I../.. -I../.. -I../../include -I../.. -I../../include -DORBIT_BACKENDS_DIR="\"/usr/lib/orbit-2.0/idl-backends\"" -DVERSION=\"2.14.13\" -DORBIT2_INTERNAL_API -Wall -Wunused -Wmissing-prototypes -Wmissing-declarations  -I/usr/include/libIDL-2.0 -I/usr/include/glib-2.0 -I/usr/lib/glib-2.0/include      -O2 -march=i686 -pipe -Werror-implicit-function-declaration  -MT orbit-idl-c-typecode.o -MD -MP -MF .deps/orbit-idl-c-typecode.Tpo -c -o orbit-idl-c-typecode.o orbit-idl-c-typecode.c
mv -f .deps/orbit-idl-c-typecode.Tpo .deps/orbit-idl-c-typecode.Po
i686-pc-linux-gnu-gcc -DHAVE_CONFIG_H -I. -I../.. -I../.. -I../../include -I../.. -I../../include -DORBIT_BACKENDS_DIR="\"/usr/lib/orbit-2.0/idl-backends\"" -DVERSION=\"2.14.13\" -DORBIT2_INTERNAL_API -Wall -Wunused -Wmissing-prototypes -Wmissing-declarations  -I/usr/include/libIDL-2.0 -I/usr/include/glib-2.0 -I/usr/lib/glib-2.0/include      -O2 -march=i686 -pipe -Werror-implicit-function-declaration  -MT orbit-idl-c-deps.o -MD -MP -MF .deps/orbit-idl-c-deps.Tpo -c -o orbit-idl-c-deps.o orbit-idl-c-deps.c
mv -f .deps/orbit-idl-c-deps.Tpo .deps/orbit-idl-c-deps.Po
/bin/sh ../../libtool --tag=CC   --mode=link i686-pc-linux-gnu-gcc  -O2 -march=i686 -pipe -Werror-implicit-function-declaration   -Wl,-O1 -o orbit-idl-2 orbit-idl-main.o orbit-idl-driver.o orbit-idl-backend.o orbit-idl-utils.o orbit-idl-c-backend.o orbit-idl-c-stubs.o orbit-idl-c-skels.o orbit-idl-c-headers.o orbit-idl-c-common.o orbit-idl-c-imodule.o orbit-idl-c-skelimpl.o orbit-idl-c-utils.o orbit-idl-c-typecode.o orbit-idl-c-deps.o -Wl,--export-dynamic -lIDL-2 -lgobject-2.0 -lgmodule-2.0 -ldl -lglib-2.0   -lm
i686-pc-linux-gnu-gcc -O2 -march=i686 -pipe -Werror-implicit-function-declaration -Wl,-O1 -o orbit-idl-2 orbit-idl-main.o orbit-idl-driver.o orbit-idl-backend.o orbit-idl-utils.o orbit-idl-c-backend.o orbit-idl-c-stubs.o orbit-idl-c-skels.o orbit-idl-c-headers.o orbit-idl-c-common.o orbit-idl-c-imodule.o orbit-idl-c-skelimpl.o orbit-idl-c-utils.o orbit-idl-c-typecode.o orbit-idl-c-deps.o -Wl,--export-dynamic  /usr/lib/libIDL-2.so /usr/lib/libgobject-2.0.so /usr/lib/libgmodule-2.0.so -ldl /usr/lib/libglib-2.0.so -lm 
make[5]: warning:  Clock skew detected.  Your build may be incomplete.
make[5]: Leaving directory `/var/tmp/portage/gnome-base/orbit-2.14.13/work/ORBit2-2.14.13/src/idl-compiler'
(rm -f orbit-interface-common.c || true) > /dev/null
../../../src/idl-compiler/orbit-idl-2 --nostubs --noskels --showcpperrors --noheaders --deps .deps/orbit-interface.idl.P orbit-interface.idl
orbit-idl-2 2.14.13 compiling
  mode, show preprocessor errors, passes: common

Processing file orbit-interface.idl
cc1: note: obsolete option -I- used, please use -iquote instead
(rm -f ../../../include/orbit/orb-core/orbit-interface.h ../../../include/orbit/orb-core/orbit-interface-stubs.c ../../../include/orbit/orb-core/orbit-interface-skels.c ../../../include/orbit/orb-core/orbit-interface-common.c ../../../include/orbit/orb-core/orbit-interface-imodule.c ../../../include/orbit/orb-core/orbit-interface-skelimpl.c || true) > /dev/null
../../../src/idl-compiler/orbit-idl-2 -I../../../src/idl/CORBA_PIDL -I../../../src/idl/CORBA -I../../../src/idl/misc -I../../../src/idl/interop -I. -D_PRE_3_0_COMPILER_ --noskels --nodefskels --nostubs --noidata --noheaders --define=Object=OObject --define=TypeCode=TTypeCode --showcpperrors --deps ../../../include/orbit/orb-core/.deps/orbit-interface.idl.P ../../../include/orbit/orb-core/../../../src/orb/orb-core/orbit-interface.idl
orbit-idl-2 2.14.13 compiling
  mode, show preprocessor errors, passes: common

Processing file ../../../include/orbit/orb-core/../../../src/orb/orb-core/orbit-interface.idl
cc1: note: obsolete option -I- used, please use -iquote instead
../../../include/orbit/orb-core/../../../src/orb/orb-core/orbit-interface.idl:15: Error: `TTypeCode' undeclared identifier

** (orbit-idl-2:21138): WARNING **: ../../../include/orbit/orb-core/../../../src/orb/orb-core/orbit-interface.idl compilation failed
make[4]: *** [../../../include/orbit/orb-core/orbit-interface.h] Error 1
make[4]: Leaving directory `/var/tmp/portage/gnome-base/orbit-2.14.13/work/ORBit2-2.14.13/src/orb/orb-core'
make[3]: *** [install] Error 2
make[3]: Leaving directory `/var/tmp/portage/gnome-base/orbit-2.14.13/work/ORBit2-2.14.13/src/orb/orb-core'
make[2]: *** [install-recursive] Error 1
make[2]: Leaving directory `/var/tmp/portage/gnome-base/orbit-2.14.13/work/ORBit2-2.14.13/src/orb'
make[1]: *** [install-recursive] Error 1
make[1]: Leaving directory `/var/tmp/portage/gnome-base/orbit-2.14.13/work/ORBit2-2.14.13/src'
make: *** [install-recursive] Error 1
 *
 * ERROR: gnome-base/orbit-2.14.13 failed.
 * Call stack:
 *               ebuild.sh, line   49:  Called src_install
 *             environment, line 2566:  Called gnome2_src_install
 *             environment, line 1972:  Called die
 * The specific snippet of code:
 *           emake DESTDIR="${D}" "scrollkeeper_localstate_dir=${D}${sk_tmp_dir} " "$@" install || die "install failed";
 *  The die message:
 *   install failed
 *
 * If you need support, post the topmost build error, and the call stack if relevant.
 * A complete build log is located at '/var/tmp/portage/gnome-base/orbit-2.14.13/temp/build.log'.
 * The ebuild environment file is located at '/var/tmp/portage/gnome-base/orbit-2.14.13/temp/environment'.
 *


Code:
  Clock skew detected.  Your build may be incomplete.
make[5]: Leaving directory `/var/tmp/portage/gnome-base/orbit-2.14.13/work/ORBit2-2.14.13/src/idl-compiler'
(rm -f orbit-interface-common.c || true) > /dev/null
../../../src/idl-compiler/orbit-idl-2 --nostubs --noskels --showcpperrors --noheaders --deps .deps/orbit-interface.idl.P orbit-interface.idl
orbit-idl-2 2.14.13 compiling
  mode, show preprocessor errors, passes: common

Processing file orbit-interface.idl
cc1: note: obsolete option -I- used, please use -iquote instead
(rm -f ../../../include/orbit/orb-core/orbit-interface.h ../../../include/orbit/orb-core/orbit-interface-stubs.c ../../../include/orbit/orb-core/orbit-interface-skels.c ../../../include/orbit/orb-core/orbit-interface-common.c ../../../include/orbit/orb-core/orbit-interface-imodule.c ../../../include/orbit/orb-core/orbit-interface-skelimpl.c || true) > /dev/null
../../../src/idl-compiler/orbit-idl-2 -I../../../src/idl/CORBA_PIDL -I../../../src/idl/CORBA -I../../../src/idl/misc -I../../../src/idl/interop -I. -D_PRE_3_0_COMPILER_ --noskels --nodefskels --nostubs --noidata --noheaders --define=Object=OObject --define=TypeCode=TTypeCode --showcpperrors --deps ../../../include/orbit/orb-core/.deps/orbit-interface.idl.P ../../../include/orbit/orb-core/../../../src/orb/orb-core/orbit-interface.idl
orbit-idl-2 2.14.13 compiling
  mode, show preprocessor errors, passes: common

Processing file ../../../include/orbit/orb-core/../../../src/orb/orb-core/orbit-interface.idl
cc1: note: obsolete option -I- used, please use -iquote instead
../../../include/orbit/orb-core/../../../src/orb/orb-core/orbit-interface.idl:15: Error: `TTypeCode' undeclared identifier

** (orbit-idl-2:21138): WARNING **: ../../../include/orbit/orb-core/../../../src/orb/orb-core/orbit-interface.idl compilation failed
make[4]: *** [../../../include/orbit/orb-core/orbit-interface.h] Error 1
make[4]: Leaving directory `/var/tmp/portage/gnome-base/orbit-2.14.13/work/ORBit2-2.14.13/src/orb/orb-core'
make[3]: *** [install] Error 2
make[3]: Leaving directory `/var/tmp/portage/gnome-base/orbit-2.14.13/work/ORBit2-2.14.13/src/orb/orb-core'
make[2]: *** [install-recursive] Error 1
make[2]: Leaving directory `/var/tmp/portage/gnome-base/orbit-2.14.13/work/ORBit2-2.14.13/src/orb'
make[1]: *** [install-recursive] Error 1
make[1]: Leaving directory `/var/tmp/portage/gnome-base/orbit-2.14.13/work/ORBit2-2.14.13/src'
make: *** [install-recursive] Error 1
 *
 * ERROR: gnome-base/orbit-2.14.13 failed.
 * Call stack:
 *               ebuild.sh, line   49:  Called src_install
 *             environment, line 2566:  Called gnome2_src_install
 *             environment, line 1972:  Called die
 * The specific snippet of code:
 *           emake DESTDIR="${D}" "scrollkeeper_localstate_dir=${D}${sk_tmp_dir} " "$@" install || die "install failed";
 *  The die message:
 *   install failed
 *
 * If you need support, post the topmost build error, and the call stack if relevant.
 * A complete build log is located at '/var/tmp/portage/gnome-base/orbit-2.14.13/temp/build.log'.
 * The ebuild environment file is located at '/var/tmp/portage/gnome-base/orbit-2.14.13/temp/environment'.
 *

 * Messages for package gnome-base/orbit-2.14.13:

 *
 * ERROR: gnome-base/orbit-2.14.13 failed.
 * Call stack:
 *               ebuild.sh, line   49:  Called src_install
 *             environment, line 2566:  Called gnome2_src_install
 *             environment, line 1972:  Called die
 * The specific snippet of code:
 *           emake DESTDIR="${D}" "scrollkeeper_localstate_dir=${D}${sk_tmp_dir} " "$@" install || die "install failed";
 *  The die message:
 *   install failed
 *
 * If you need support, post the topmost build error, and the call stack if relevant.
 * A complete build log is located at '/var/tmp/portage/gnome-base/orbit-2.14.13/temp/build.log'.
 * The ebuild environment file is located at '/var/tmp/portage/gnome-base/orbit-2.14.13/temp/environment'.
 *
 * GNU info directory index is up-to-date.


Code:

  Clock skew detected.  Your build may be incomplete.
make[5]: Leaving directory `/var/tmp/portage/gnome-base/orbit-2.14.13/work/ORBit2-2.14.13/src/idl-compiler'
(rm -f orbit-interface-common.c || true) > /dev/null
../../../src/idl-compiler/orbit-idl-2 --nostubs --noskels --showcpperrors --noheaders --deps .deps/orbit-interface.idl.P orbit-interface.idl
orbit-idl-2 2.14.13 compiling
  mode, show preprocessor errors, passes: common

Processing file orbit-interface.idl
cc1: note: obsolete option -I- used, please use -iquote instead
(rm -f ../../../include/orbit/orb-core/orbit-interface.h ../../../include/orbit/orb-core/orbit-interface-stubs.c ../../../include/orbit/orb-core/orbit-interface-skels.c ../../../include/orbit/orb-core/orbit-interface-common.c ../../../include/orbit/orb-core/orbit-interface-imodule.c ../../../include/orbit/orb-core/orbit-interface-skelimpl.c || true) > /dev/null
../../../src/idl-compiler/orbit-idl-2 -I../../../src/idl/CORBA_PIDL -I../../../src/idl/CORBA -I../../../src/idl/misc -I../../../src/idl/interop -I. -D_PRE_3_0_COMPILER_ --noskels --nodefskels --nostubs --noidata --noheaders --define=Object=OObject --define=TypeCode=TTypeCode --showcpperrors --deps ../../../include/orbit/orb-core/.deps/orbit-interface.idl.P ../../../include/orbit/orb-core/../../../src/orb/orb-core/orbit-interface.idl
orbit-idl-2 2.14.13 compiling
  mode, show preprocessor errors, passes: common

Processing file ../../../include/orbit/orb-core/../../../src/orb/orb-core/orbit-interface.idl
cc1: note: obsolete option -I- used, please use -iquote instead
../../../include/orbit/orb-core/../../../src/orb/orb-core/orbit-interface.idl:15: Error: `TTypeCode' undeclared identifier

** (orbit-idl-2:21138): WARNING **: ../../../include/orbit/orb-core/../../../src/orb/orb-core/orbit-interface.idl compilation failed
make[4]: *** [../../../include/orbit/orb-core/orbit-interface.h] Error 1
make[4]: Leaving directory `/var/tmp/portage/gnome-base/orbit-2.14.13/work/ORBit2-2.14.13/src/orb/orb-core'
make[3]: *** [install] Error 2
make[3]: Leaving directory `/var/tmp/portage/gnome-base/orbit-2.14.13/work/ORBit2-2.14.13/src/orb/orb-core'
make[2]: *** [install-recursive] Error 1
make[2]: Leaving directory `/var/tmp/portage/gnome-base/orbit-2.14.13/work/ORBit2-2.14.13/src/orb'
make[1]: *** [install-recursive] Error 1
make[1]: Leaving directory `/var/tmp/portage/gnome-base/orbit-2.14.13/work/ORBit2-2.14.13/src'
make: *** [install-recursive] Error 1
 *
 * ERROR: gnome-base/orbit-2.14.13 failed.
 * Call stack:
 *               ebuild.sh, line   49:  Called src_install
 *             environment, line 2566:  Called gnome2_src_install
 *             environment, line 1972:  Called die
 * The specific snippet of code:
 *           emake DESTDIR="${D}" "scrollkeeper_localstate_dir=${D}${sk_tmp_dir} " "$@" install || die "install failed";
 *  The die message:
 *   install failed
 *
 * If you need support, post the topmost build error, and the call stack if relevant.
 * A complete build log is located at '/var/tmp/portage/gnome-base/orbit-2.14.13/temp/build.log'.
 * The ebuild environment file is located at '/var/tmp/portage/gnome-base/orbit-2.14.13/temp/environment'.
 *

 * Messages for package gnome-base/orbit-2.14.13:

 *
 * ERROR: gnome-base/orbit-2.14.13 failed.
 * Call stack:
 *               ebuild.sh, line   49:  Called src_install
 *             environment, line 2566:  Called gnome2_src_install
 *             environment, line 1972:  Called die
 * The specific snippet of code:
 *           emake DESTDIR="${D}" "scrollkeeper_localstate_dir=${D}${sk_tmp_dir} " "$@" install || die "install failed";
 *  The die message:
 *   install failed
 *
 * If you need support, post the topmost build error, and the call stack if relevant.
 * A complete build log is located at '/var/tmp/portage/gnome-base/orbit-2.14.13/temp/build.log'.
 * The ebuild environment file is located at '/var/tmp/portage/gnome-base/orbit-2.14.13/temp/environment'.
 *
 * GNU info directory index is up-to-date.

Back to top
View user's profile Send private message
YetiBarBar
Guru
Guru


Joined: 23 Dec 2005
Posts: 500

PostPosted: Tue Nov 11, 2008 8:24 pm    Post subject: Reply with quote

Un truc bizarre dans tes logs, c'est le "Clock skew detected".

Travailles tu sur des partitions NFS, avec du NTP (avec par exemple, une période de sync assez faible qui ferait changer la date en cours de compilation)?
Back to top
View user's profile Send private message
elfangor
n00b
n00b


Joined: 21 May 2008
Posts: 20

PostPosted: Tue Nov 11, 2008 10:16 pm    Post subject: Reply with quote

oh merci d'avoir relevé ça!
En fait, j'ai eut un probleme avec la date de ma gentoo, il me semble que ça soit du a mon windows qui est deconné et à deregler mon horloge system.
A chaque lancement il me dit que des fichier dans /etc et un autre dossier on une date de modification dans le futur.
Vous penser que cela à un rapport ?
Si oui comment regler ce probleme(meme si ce n'est pas le cas ça m'interesse :roll: )
Back to top
View user's profile Send private message
gglaboussole
l33t
l33t


Joined: 17 May 2005
Posts: 641
Location: Monbalen (47),France

PostPosted: Tue Nov 11, 2008 11:19 pm    Post subject: Reply with quote

Salut
Pour ton second problème la solution :
Code:

touch /etc/conf.d/* /etc/init.d/* etc/rc.conf


Par contre je ne pense pas que tes messages d'avertissement au boot (ce ne sont que des avertissements) aient un lien avec tes erreurs de compil... ce que voulais dire YetiBarBar c'est qu'un problème te ferais changer la date en cours de compilation...

Edit :donnes ton emerge --info
_________________
On m'a dit que la terre tourne, alors j'attends que ma maison passe par ici...
Back to top
View user's profile Send private message
elfangor
n00b
n00b


Joined: 21 May 2008
Posts: 20

PostPosted: Wed Nov 12, 2008 12:15 am    Post subject: Reply with quote

Merci, le touch /etc/conf.d/* /etc/init.d/* etc/rc.conf a bien regler mon petit probleme :)

Si vous le souhaiter je peux poster le message complet de:
Code:
emerge -v gnome (ou gnome-light, un des deux je ne sais plus lequel :)  )



emerge --info:
Code:

Portage 2.1.4.5 (default/linux/x86/2008.0, gcc-4.1.2, glibc-2.6.1-r0, 2.6.25-gentoo-r8 i686)
=================================================================
System uname: 2.6.25-gentoo-r8 i686 Genuine Intel(R) CPU T2050 @ 1.60GHz
Timestamp of tree: Tue, 11 Nov 2008 03:30:02 +0000
ccache version 2.4 [disabled]
app-shells/bash:     3.2_p33
dev-lang/python:     2.4.4-r13, 2.5.2-r7
dev-python/pycrypto: 2.0.1-r6
dev-util/ccache:     2.4-r7
sys-apps/baselayout: 1.12.11.1
sys-apps/sandbox:    1.2.18.1-r2
sys-devel/autoconf:  2.13, 2.61-r1
sys-devel/automake:  1.5, 1.7.9-r1, 1.8.5-r3, 1.9.6-r2, 1.10.1
sys-devel/binutils:  2.18-r3
sys-devel/gcc-config: 1.4.0-r4
sys-devel/libtool:   1.5.24
virtual/os-headers:  2.6.23-r3
ACCEPT_KEYWORDS="x86"
CBUILD="i686-pc-linux-gnu"
CFLAGS="-O2 -march=i686 -pipe"
CHOST="i686-pc-linux-gnu"
CONFIG_PROTECT="/etc"
CONFIG_PROTECT_MASK="/etc/env.d /etc/fonts/fonts.conf /etc/gconf /etc/revdep-rebuild /etc/terminfo /etc/udev/rules.d"
CXXFLAGS="-O2 -march=i686 -pipe"
DISTDIR="/usr/portage/distfiles"
FEATURES="distlocks metadata-transfer sandbox sfperms strict unmerge-orphans userfetch"
GENTOO_MIRRORS="http://mirror.ovh.net/gentoo-distfiles/ ftp://mirror.ovh.net/gentoo-distfiles/ ftp://gentoo.imj.fr/pub/gentoo/ ftp://ftp.free.fr/mirrors/ftp.gentoo.org/ "
LDFLAGS="-Wl,-O1"
MAKEOPTS="-j3"
PKGDIR="/usr/portage/packages"
PORTAGE_RSYNC_OPTS="--recursive --links --safe-links --perms --times --compress --force --whole-file --delete --stats --timeout=180 --exclude=/distfiles --exclude=/local --exclude=/packages"
PORTAGE_TMPDIR="/var/tmp"
PORTDIR="/usr/portage"
PORTDIR_OVERLAY="   "
SYNC="rsync://rsync.gentoo.org/gentoo-portage"
USE="X acl alsa avahi berkdb bzip2 cdr cli cracklib crypt cups dbus dri dvd dvdr fortran gdbm gnome gpm gtk hal iconv ipv6 isdnlog midi mudflap ncurses nls nptl nptlonly nvidia opengl openmp pam pcre perl png pppd python readline reflection session spl ssl sysfs tcpd unicode x86 xorg zlib" ALSA_CARDS="ali5451 als4000 atiixp atiixp-modem bt87x ca0106 cmipci emu10k1 emu10k1x ens1370 ens1371 es1938 es1968 fm801 hda-intel intel8x0 intel8x0m maestro3 trident usb-audio via82xx via82xx-modem ymfpci" ALSA_PCM_PLUGINS="adpcm alaw asym copy dmix dshare dsnoop empty extplug file hooks iec958 ioplug ladspa lfloat linear meter mmap_emul mulaw multi null plug rate route share shm softvol" APACHE2_MODULES="actions alias auth_basic authn_alias authn_anon authn_dbm authn_default authn_file authz_dbm authz_default authz_groupfile authz_host authz_owner authz_user autoindex cache dav dav_fs dav_lock deflate dir disk_cache env expires ext_filter file_cache filter headers include info log_config logio mem_cache mime mime_magic negotiation rewrite setenvif speling status unique_id userdir usertrack vhost_alias" ELIBC="glibc" INPUT_DEVICES="keyboard mouse" KERNEL="linux" LCD_DEVICES="bayrad cfontz cfontz633 glk hd44780 lb216 lcdm001 mtxorb ncurses text" USERLAND="GNU" VIDEO_CARDS="nvidia"
Unset:  CPPFLAGS, CTARGET, EMERGE_DEFAULT_OPTS, FFLAGS, INSTALL_MASK, LANG, LC_ALL, LINGUAS, PORTAGE_COMPRESS, PORTAGE_COMPRESS_FLAGS, PORTAGE_RSYNC_EXTRA_OPTS
Back to top
View user's profile Send private message
sd44
Apprentice
Apprentice


Joined: 21 Jul 2007
Posts: 277
Location: Nantes 44

PostPosted: Wed Nov 12, 2008 12:22 am    Post subject: Reply with quote

<rien a voir> juste par hasard : y'aurai pas un python-updater a lancer ? </rien a voir>
_________________
Pourquoi faire simple quand on peut faire compliqué ?
Back to top
View user's profile Send private message
elfangor
n00b
n00b


Joined: 21 May 2008
Posts: 20

PostPosted: Wed Nov 12, 2008 12:04 pm    Post subject: Reply with quote

Merci pour le python updater :)
J'ai juste eut un petit probleme "cracklib" etais sois disant masqué, alors qu'il n'étais pas indiqué dans mon package.mask, je l'ai emerge et relancé python-updater, c'est a jour :)

Cependant j'ai retesté un emerge gnome-light et toujours la meme erreur :s
Je ne comprend vraiment pas ce qui peux bloquer :s
Back to top
View user's profile Send private message
Display posts from previous:   
Reply to topic    Gentoo Forums Forum Index French All times are GMT
Page 1 of 1

 
Jump to:  
You cannot post new topics in this forum
You cannot reply to topics in this forum
You cannot edit your posts in this forum
You cannot delete your posts in this forum
You cannot vote in polls in this forum