Gentoo Forums
Gentoo Forums
Gentoo Forums
Quick Search: in
Emerge RPM
View unanswered posts
View posts from last 24 hours
View posts from last 7 days

 
Reply to topic    Gentoo Forums Forum Index Forum italiano (Italian)
View previous topic :: View next topic  
Author Message
Pancu
l33t
l33t


Joined: 16 Feb 2005
Posts: 612
Location: Cesena

PostPosted: Mon Nov 26, 2007 10:54 am    Post subject: Emerge RPM Reply with quote

Ragazzi, ho questo problema.
Compilo RPM e tutto va ok.
Alla fine dell'installazione mi viene chiesto di fare
Code:
g-cpan -i RPM2

Ma questo termina con un'errore:
Code:
RCE -D_FILE_OFFSET_BITS=64 -g   -DVERSION=\"0.67\" -DXS_VERSION=\"0.67\" -fPIC "-I/usr/lib/perl5/5.8.8/i686-linux/CORE"  -DRPM2_RPM40 RPM2.c
RPM2.xs:2:20: error: rpmlib.h: No such file or directory
RPM2.xs:3:20: error: rpmcli.h: No such file or directory
RPM2.xs:10:20: error: header.h: No such file or directory
RPM2.xs:11:19: error: rpmdb.h: No such file or directory
RPM2.xs:12:18: error: misc.h: No such file or directory
RPM2.xs:32: error: expected ';', ',' or ')' before 'what'
RPM2.xs: In function '_populate_header_tags':
RPM2.xs:134: error: 'rpmTagTableSize' undeclared (first use in this function)
RPM2.xs:134: error: (Each undeclared identifier is reported only once
RPM2.xs:134: error: for each function it appears in.)
RPM2.xs:135: error: 'rpmTagTable' undeclared (first use in this function)
RPM2.xs: In function 'XS_RPM2_add_macro':
RPM2.xs:202: error: 'RMIL_DEFAULT' undeclared (first use in this function)
RPM2.xs: In function 'XS_RPM2_expand_macro':
RPM2.xs:218: warning: assignment makes pointer from integer without a cast
RPM2.xs: In function 'XS_RPM2__read_package_info':
RPM2.xs:235: error: 'Header' undeclared (first use in this function)
RPM2.xs:235: error: expected ';' before 'ret'
RPM2.xs:236: error: expected ';' before 'sigs'
RPM2.xs:237: error: 'rpmRC' undeclared (first use in this function)
RPM2.xs:237: error: expected ';' before 'rc'
RPM2.xs:238: error: 'FD_t' undeclared (first use in this function)
RPM2.xs:238: error: expected ';' before 'fd'
RPM2.xs:251: error: 'fd' undeclared (first use in this function)
RPM2.xs:256: error: 'rc' undeclared (first use in this function)
RPM2.xs:256: error: 'ret' undeclared (first use in this function)
RPM2.xs:261: error: 'RPMRC_OK' undeclared (first use in this function)
RPM2.xs: In function 'XS_RPM2__create_transaction':
RPM2.xs:282: error: 'rpmts' undeclared (first use in this function)
RPM2.xs:282: error: expected ';' before 'ret'
RPM2.xs:283: warning: ISO C90 forbids mixed declarations and code
RPM2.xs:288: error: 'ret' undeclared (first use in this function)
RPM2.xs: In function 'XS_RPM2__read_from_file':
RPM2.xs:306: error: 'FD_t' undeclared (first use in this function)
RPM2.xs:306: error: expected ';' before 'fd'
RPM2.xs:307: error: 'Header' undeclared (first use in this function)
RPM2.xs:307: error: expected ';' before 'h'
RPM2.xs:309: error: 'fd' undeclared (first use in this function)
RPM2.xs:310: error: 'h' undeclared (first use in this function)
RPM2.xs:310: error: 'HEADER_MAGIC_YES' undeclared (first use in this function)
RPM2.xs: In function 'XS_RPM2__open_rpm_db':
RPM2.xs:327: error: 'rpmdb' undeclared (first use in this function)
RPM2.xs:327: error: expected ';' before 'db'
RPM2.c:405: error: expected ';' before 'RETVAL'
RPM2.xs:329: error: 'db' undeclared (first use in this function)
RPM2.xs:331: error: 'RETVAL' undeclared (first use in this function)
RPM2.c: In function 'XS_RPM2__C__DB_DESTROY':
RPM2.c:427: error: 'rpmdb' undeclared (first use in this function)
RPM2.c:427: error: expected ';' before 'db'
RPM2.c:430: error: 'db' undeclared (first use in this function)
RPM2.c: In function 'XS_RPM2__C__DB__close_rpm_db':
RPM2.c:450: error: 'rpmdb' undeclared (first use in this function)
RPM2.c:450: error: expected ';' before 'self'
RPM2.c:453: error: 'self' undeclared (first use in this function)
RPM2.c: In function 'XS_RPM2__C__DB__init_iterator':
RPM2.c:473: error: 'rpmdb' undeclared (first use in this function)
RPM2.c:473: error: expected ';' before 'db'
RPM2.c:474: warning: ISO C90 forbids mixed declarations and code
RPM2.c:477: error: 'rpmdbMatchIterator' undeclared (first use in this function)
RPM2.c:477: error: expected ';' before 'RETVAL'
RPM2.c:480: error: 'db' undeclared (first use in this function)
RPM2.xs:358: error: 'RETVAL' undeclared (first use in this function)
RPM2.c: In function 'XS_RPM2__C__PackageIterator__iterator_next':
RPM2.c:503: error: 'rpmdbMatchIterator' undeclared (first use in this function)
RPM2.c:503: error: expected ';' before 'i'
RPM2.xs:367: error: 'Header' undeclared (first use in this function)
RPM2.xs:367: error: expected ';' before 'ret'
RPM2.xs:368: warning: ISO C90 forbids mixed declarations and code
RPM2.c:509: error: expected ';' before 'RETVAL'
RPM2.c:512: error: 'i' undeclared (first use in this function)
RPM2.xs:371: error: 'ret' undeclared (first use in this function)
RPM2.c: In function 'XS_RPM2__C__PackageIterator_DESTROY':
RPM2.c:545: error: 'rpmdbMatchIterator' undeclared (first use in this function)
RPM2.c:545: error: expected ';' before 'i'
RPM2.c:548: error: 'i' undeclared (first use in this function)
RPM2.c: In function 'XS_RPM2__C__Header_DESTROY':
RPM2.c:568: error: 'Header' undeclared (first use in this function)
RPM2.c:568: error: expected ';' before 'h'
RPM2.c:571: error: 'h' undeclared (first use in this function)
RPM2.c: In function 'XS_RPM2__C__Header_tag_by_id':
RPM2.c:592: error: 'Header' undeclared (first use in this function)
RPM2.c:592: error: expected ';' before 'h'
RPM2.c:593: warning: ISO C90 forbids mixed declarations and code
RPM2.c:602: error: 'h' undeclared (first use in this function)
RPM2.xs:418: error: 'RPM_STRING_ARRAY_TYPE' undeclared (first use in this function)
RPM2.xs:431: error: 'RPM_STRING_TYPE' undeclared (first use in this function)
RPM2.xs:434: error: 'RPM_CHAR_TYPE' undeclared (first use in this function)
RPM2.xs:435: error: 'RPM_INT8_TYPE' undeclared (first use in this function)
RPM2.xs:436: error: 'RPM_INT16_TYPE' undeclared (first use in this function)
RPM2.xs:437: error: 'RPM_INT32_TYPE' undeclared (first use in this function)
RPM2.c: In function 'XS_RPM2__C__Header__header_compare':
RPM2.c:667: error: 'Header' undeclared (first use in this function)
RPM2.c:667: error: expected ';' before 'h1'
RPM2.c:668: error: expected ';' before 'h2'
RPM2.c:669: warning: ISO C90 forbids mixed declarations and code
RPM2.c:673: error: 'h1' undeclared (first use in this function)
RPM2.c:680: error: 'h2' undeclared (first use in this function)
RPM2.c: In function 'XS_RPM2__C__Header__header_is_source':
RPM2.c:701: error: 'Header' undeclared (first use in this function)
RPM2.c:701: error: expected ';' before 'h'
RPM2.c:702: warning: ISO C90 forbids mixed declarations and code
RPM2.c:706: error: 'h' undeclared (first use in this function)
RPM2.xs:469: error: 'RPMTAG_SOURCEPACKAGE' undeclared (first use in this function)
RPM2.c: In function 'XS_RPM2__C__Header__header_sprintf':
RPM2.c:728: error: 'Header' undeclared (first use in this function)
RPM2.c:728: error: expected ';' before 'h'
RPM2.c:729: warning: ISO C90 forbids mixed declarations and code
RPM2.c:735: error: 'h' undeclared (first use in this function)
RPM2.xs:480: error: 'rpmTagTable' undeclared (first use in this function)
RPM2.xs:480: error: 'rpmHeaderFormats' undeclared (first use in this function)
RPM2.xs:480: warning: assignment makes pointer from integer without a cast
RPM2.xs:482: warning: assignment makes pointer from integer without a cast
RPM2.c: In function 'XS_RPM2__C__Transaction_DESTROY':
RPM2.c:758: error: 'rpmts' undeclared (first use in this function)
RPM2.c:758: error: expected ';' before 't'
RPM2.c:761: error: 't' undeclared (first use in this function)
RPM2.c: In function 'XS_RPM2__C__Transaction__add_install':
RPM2.c:781: error: 'rpmts' undeclared (first use in this function)
RPM2.c:781: error: expected ';' before 't'
RPM2.c:782: error: 'Header' undeclared (first use in this function)
RPM2.c:782: error: expected ';' before 'h'
RPM2.c:783: warning: ISO C90 forbids mixed declarations and code
RPM2.xs:501: error: 'rpmRC' undeclared (first use in this function)
RPM2.xs:501: error: expected ';' before 'rc'
RPM2.c:788: warning: ISO C90 forbids mixed declarations and code
RPM2.c:792: error: 't' undeclared (first use in this function)
RPM2.c:799: error: 'h' undeclared (first use in this function)
RPM2.xs:503: error: 'rc' undeclared (first use in this function)
RPM2.xs:503: error: 'fnpyKey' undeclared (first use in this function)
RPM2.xs:503: error: expected ')' before 'fn'
RPM2.xs:504: error: 'RPMRC_OK' undeclared (first use in this function)
RPM2.c: In function 'XS_RPM2__C__Transaction__add_delete':
RPM2.c:821: error: 'rpmts' undeclared (first use in this function)
RPM2.c:821: error: expected ';' before 't'
RPM2.c:822: error: 'Header' undeclared (first use in this function)
RPM2.c:822: error: expected ';' before 'h'
RPM2.c:823: warning: ISO C90 forbids mixed declarations and code
RPM2.xs:514: error: 'rpmRC' undeclared (first use in this function)
RPM2.xs:514: error: expected ';' before 'rc'
RPM2.c:827: warning: ISO C90 forbids mixed declarations and code
RPM2.c:831: error: 't' undeclared (first use in this function)
RPM2.c:838: error: 'h' undeclared (first use in this function)
RPM2.xs:516: error: 'rc' undeclared (first use in this function)
RPM2.xs:517: error: 'RPMRC_OK' undeclared (first use in this function)
RPM2.c: In function 'XS_RPM2__C__Transaction__element_count':
RPM2.c:860: error: 'rpmts' undeclared (first use in this function)
RPM2.c:860: error: expected ';' before 't'
RPM2.xs:525: warning: ISO C90 forbids mixed declarations and code
RPM2.c:868: error: 't' undeclared (first use in this function)
RPM2.c: In function 'XS_RPM2__C__Transaction__close_db':
RPM2.c:890: error: 'rpmts' undeclared (first use in this function)
RPM2.c:890: error: expected ';' before 't'
RPM2.xs:536: warning: ISO C90 forbids mixed declarations and code
RPM2.c:898: error: 't' undeclared (first use in this function)
RPM2.c: In function 'XS_RPM2__C__Transaction__check':
RPM2.c:920: error: 'rpmts' undeclared (first use in this function)
RPM2.c:920: error: expected ';' before 't'
RPM2.xs:547: warning: ISO C90 forbids mixed declarations and code
RPM2.c:928: error: 't' undeclared (first use in this function)
RPM2.c: In function 'XS_RPM2__C__Transaction__order':
RPM2.c:950: error: 'rpmts' undeclared (first use in this function)
RPM2.c:950: error: expected ';' before 't'
RPM2.xs:558: warning: ISO C90 forbids mixed declarations and code
RPM2.c:958: error: 't' undeclared (first use in this function)
RPM2.c: In function 'XS_RPM2__C__Transaction__elements':
RPM2.c:985: error: 'rpmts' undeclared (first use in this function)
RPM2.c:985: error: expected ';' before 't'
RPM2.c:986: error: 'rpmElementType' undeclared (first use in this function)
RPM2.c:986: error: expected ';' before 'type'
RPM2.xs:574: error: 'rpmtsi' undeclared (first use in this function)
RPM2.xs:574: error: expected ';' before 'i'
RPM2.xs:575: error: 'rpmte' undeclared (first use in this function)
RPM2.xs:575: error: expected ';' before 'te'
RPM2.xs:576: warning: ISO C90 forbids mixed declarations and code
RPM2.c:994: error: 't' undeclared (first use in this function)
RPM2.xs:578: error: 'i' undeclared (first use in this function)
RPM2.xs:583: error: 'te' undeclared (first use in this function)
RPM2.xs:583: error: 'type' undeclared (first use in this function)
RPM2.xs:584: warning: assignment makes pointer from integer without a cast
RPM2.c: In function 'XS_RPM2__C__Transaction__run':
RPM2.c:1025: error: 'rpmts' undeclared (first use in this function)
RPM2.c:1025: error: expected ';' before 't'
RPM2.c:1026: error: 'rpmprobFilterFlags' undeclared (first use in this function)
RPM2.c:1026: error: expected ';' before 'prob_filter'
RPM2.xs:595: warning: ISO C90 forbids mixed declarations and code
RPM2.xs:596: error: 'rpmProblem' undeclared (first use in this function)
RPM2.xs:596: error: expected ';' before 'p'
RPM2.xs:597: warning: ISO C90 forbids mixed declarations and code
RPM2.c:1036: error: 't' undeclared (first use in this function)
RPM2.xs:612: error: '_null_callback' undeclared (first use in this function)
RPM2.xs:613: error: 'prob_filter' undeclared (first use in this function)
make: *** [RPM2.o] Error 1
 *
 * ERROR: perl-gcpan/RPM2-0.67 failed.
 * Call stack:
 *            ebuild.sh, line 1701:  Called dyn_compile
 *            ebuild.sh, line 1039:  Called qa_call 'src_compile'
 *            ebuild.sh, line   44:  Called src_compile
 *            ebuild.sh, line 1383:  Called perl-module_src_compile
 *   perl-module.eclass, line  149:  Called die
 * The specific snippet of code:
 *              make ${mymake} || die "compilation failed"
 *  The die message:
 *   compilation failed
 *
 * If you need support, post the topmost build error, and the call stack if relevant.
 * A complete build log is located at '/var/tmp/portage/perl-gcpan/RPM2-0.67/temp/build.log'.
 * This ebuild is from an overlay: '/var/tmp/g-cpan/'
 *

 * Messages for package perl-gcpan/RPM2-0.67:

 *
 * ERROR: perl-gcpan/RPM2-0.67 failed.
 * Call stack:
 *            ebuild.sh, line 1701:  Called dyn_compile
 *            ebuild.sh, line 1039:  Called qa_call 'src_compile'
 *            ebuild.sh, line   44:  Called src_compile
 *            ebuild.sh, line 1383:  Called perl-module_src_compile
 *   perl-module.eclass, line  149:  Called die
 * The specific snippet of code:
 *              make ${mymake} || die "compilation failed"
 *  The die message:
 *   compilation failed
 *
 * If you need support, post the topmost build error, and the call stack if relevant.
 * A complete build log is located at '/var/tmp/portage/perl-gcpan/RPM2-0.67/temp/build.log'.
 * This ebuild is from an overlay: '/var/tmp/g-cpan/'


Potete gentilmente aiutarmi?? :? :?
Grazie.
Back to top
View user's profile Send private message
MeMyselfAndI
l33t
l33t


Joined: 15 Nov 2005
Posts: 784
Location: Between the monitor and the chair

PostPosted: Mon Nov 26, 2007 4:26 pm    Post subject: Reply with quote

Questo non e' un ebuild di portage, dovresti ndare a chiedere sul forum dell'overlay
Back to top
View user's profile Send private message
Display posts from previous:   
Reply to topic    Gentoo Forums Forum Index Forum italiano (Italian) All times are GMT
Page 1 of 1

 
Jump to:  
You cannot post new topics in this forum
You cannot reply to topics in this forum
You cannot edit your posts in this forum
You cannot delete your posts in this forum
You cannot vote in polls in this forum