Gentoo Forums
Gentoo Forums
Gentoo Forums
Quick Search: in
kbd build problems
View unanswered posts
View posts from last 24 hours

 
Reply to topic    Gentoo Forums Forum Index Duplicate Threads
View previous topic :: View next topic  
Author Message
d4mo
Guru
Guru


Joined: 27 Jun 2005
Posts: 430

PostPosted: Wed Nov 14, 2007 12:07 am    Post subject: kbd build problems Reply with quote

I'm getting this error:



* Messages for package sys-apps/kbd-1.13-r1:

*
* ERROR: sys-apps/kbd-1.13-r1 failed.
* Call stack:
* ebuild.sh, line 1701: Called dyn_compile
* ebuild.sh, line 1039: Called qa_call 'src_compile'
* ebuild.sh, line 44: Called src_compile
* kbd-1.13-r1.ebuild, line 65: Called die
* The specific snippet of code:
* emake CC="$(tc-getCC)" || die "emake failed"
* The die message:
* emake failed
*
* If you need support, post the topmost build error, and the call stack if relevant.
* A complete build log is located at '/var/tmp/portage/sys-apps/kbd-1.13-r1/temp/build.log'.
*
Back to top
View user's profile Send private message
Sadako
Advocate
Advocate


Joined: 05 Aug 2004
Posts: 3753
Location: sleeping in the bathtub

PostPosted: Wed Nov 14, 2007 12:28 am    Post subject: Reply with quote

Need more output than that, it doesn't tell us what actual errors were encountered.
_________________
"You have to invite me in"
Back to top
View user's profile Send private message
d4mo
Guru
Guru


Joined: 27 Jun 2005
Posts: 430

PostPosted: Wed Nov 14, 2007 4:08 am    Post subject: Reply with quote

Does this help at all?

Code:

make[1]: Leaving directory `/var/tmp/portage/sys-apps/kbd-1.13-r1/work/kbd-1.13/openvt'
make[1]: Entering directory `/var/tmp/portage/sys-apps/kbd-1.13-r1/work/kbd-1.13/po'
xgettext --default-domain=kbd --directory=.. \
          --add-comments --keyword=_ --keyword=N_ \
          --files-from=POTFILES.in
msgfmt -o cs.gmo cs.po
xgettext: error while loading shared libraries: libexpat.so.0: cannot open shared object file: No such file or directory
make[1]: *** [kbd.pot] Error 127
make[1]: *** Waiting for unfinished jobs....
make[1]: Leaving directory `/var/tmp/portage/sys-apps/kbd-1.13-r1/work/kbd-1.13/po'
make: *** [all] Error 1
 *
 * ERROR: sys-apps/kbd-1.13-r1 failed.
 * Call stack:
 *            ebuild.sh, line 1701:  Called dyn_compile
 *            ebuild.sh, line 1039:  Called qa_call 'src_compile'
 *            ebuild.sh, line   44:  Called src_compile
 *   kbd-1.13-r1.ebuild, line   65:  Called die
 * The specific snippet of code:
 *      emake CC="$(tc-getCC)" || die "emake failed"
 *  The die message:
 *   emake failed
 *
 * If you need support, post the topmost build error, and the call stack if relevant.
Back to top
View user's profile Send private message
Sadako
Advocate
Advocate


Joined: 05 Aug 2004
Posts: 3753
Location: sleeping in the bathtub

PostPosted: Wed Nov 14, 2007 4:13 am    Post subject: Reply with quote

d4mo wrote:
Does this help at all?
Yes, it does, you got hit by the expat upgrade.

Read this thread for details;
Upgrade to expat-2.0.x needs revdep-rebuild
_________________
"You have to invite me in"
Back to top
View user's profile Send private message
d4mo
Guru
Guru


Joined: 27 Jun 2005
Posts: 430

PostPosted: Wed Nov 14, 2007 4:15 am    Post subject: Reply with quote

Yep, I realize that now haha, thanks for the help :)
Back to top
View user's profile Send private message
desultory
Administrator
Administrator


Joined: 04 Nov 2005
Posts: 8115

PostPosted: Wed Nov 14, 2007 4:32 am    Post subject: Reply with quote

Moved from Portage & Programming to Duplicate Threads, refer to the topic Hopeless linked to.
Back to top
View user's profile Send private message
Display posts from previous:   
Reply to topic    Gentoo Forums Forum Index Duplicate Threads All times are GMT
Page 1 of 1

 
Jump to:  
You cannot post new topics in this forum
You cannot reply to topics in this forum
You cannot edit your posts in this forum
You cannot delete your posts in this forum
You cannot vote in polls in this forum