Gentoo Forums
Gentoo Forums
Gentoo Forums
Quick Search: in
Kdelibs 3.5.7 fails
View unanswered posts
View posts from last 24 hours

 
Reply to topic    Gentoo Forums Forum Index Duplicate Threads
View previous topic :: View next topic  
Author Message
thagame
Apprentice
Apprentice


Joined: 07 Mar 2004
Posts: 209
Location: Windsor, Ontario, Canada

PostPosted: Sat Jun 09, 2007 4:53 am    Post subject: Kdelibs 3.5.7 fails Reply with quote

I have tried to compile kdelibs several times and It fails at the same spot everytime.

Quote:
Making all in .
make[3]: Entering directory `/var/tmp/portage/kde-base/kdelibs-3.5.7/work/kdelibs-3.5.7/kabc'
mysrcdir=`cd ./scripts && pwd` ;\
cd scripts && /usr/bin/perl $mysrcdir/makeaddressee
/usr/qt/3/bin/moc ./addressbook.h -o addressbook.moc
/usr/qt/3/bin/moc ./addresseedialog.h -o addresseedialog.moc
/usr/qt/3/bin/moc ./distributionlist.h -o distributionlist.moc
/usr/qt/3/bin/moc ./distributionlistdialog.h -o distributionlistdialog.moc
/usr/qt/3/bin/moc ./distributionlisteditor.h -o distributionlisteditor.moc
/usr/qt/3/bin/moc ./resource.h -o resource.moc
/usr/qt/3/bin/moc ./resourceselectdialog.h -o resourceselectdialog.moc
/usr/qt/3/bin/moc ./addresslineedit.h -o addresslineedit.moc
/usr/qt/3/bin/moc ./ldapclient.h -o ldapclient.moc
/usr/qt/3/bin/moc ./lock.h -o lock.moc
/usr/qt/3/bin/moc ./ldapconfigwidget.h -o ldapconfigwidget.moc
../dcop/dcopidl/dcopidl ./addresseehelper.h > addresseehelper.kidl || ( rm -f addresseehelper.kidl ; false )
i686-pc-linux-gnu-g++ -DHAVE_CONFIG_H -I. -I. -I.. -I../dcop -I../kdecore -I../kio/kssl -I../kjs -I../kabc -I../kabc -I../kab -I./vcard/include -I./vcardparser/ -I./vcard/include/generated -I./vcardparser -I../dcop -I../libltdl -I../kdefx -I../kdecore -I../kdecore -I../kdecore/network -I../kdeui -I../kio -I../kio/kio -I../kio/kfile -I.. -I/usr/qt/3/include -I. -I/usr/kde/3.5/include -DQT_THREAD_SUPPORT -D_REENTRANT -Wno-long-long -Wundef -ansi -D_XOPEN_SOURCE=500 -D_BSD_SOURCE -Wcast-align -Wchar-subscripts -Wall -W -Wpointer-arith -DNDEBUG -DNO_DEBUG -O2 -O2 -march=i686 -pipe -fomit-frame-pointer -Wformat-security -Wmissing-format-attribute -Wno-non-virtual-dtor -fno-exceptions -fno-check-new -fno-common -DQT_CLEAN_NAMESPACE -DQT_NO_ASCII_CAST -DQT_NO_STL -DQT_NO_COMPAT -DQT_NO_TRANSLATION -c -o kab2kabc.o kab2kabc.cpp
In file included from kab2kabc.cpp:35:
addressbook.h:29:23: error: addressee.h: No such file or directory
/bin/sh ../libtool --silent --tag=CXX --mode=compile i686-pc-linux-gnu-g++ -DHAVE_CONFIG_H -I. -I. -I.. -I../dcop -I../kdecore -I../kio/kssl -I../kjs -I../kabc -I../kabc -I../kab -I./vcard/include -I./vcardparser/ -I./vcard/include/generated -I./vcardparser -I../dcop -I../libltdl -I../kdefx -I../kdecore -I../kdecore -I../kdecore/network -I../kdeui -I../kio -I../kio/kio -I../kio/kfile -I.. -I/usr/qt/3/include -I. -I/usr/kde/3.5/include -DQT_THREAD_SUPPORT -D_REENTRANT -Wno-long-long -Wundef -ansi -D_XOPEN_SOURCE=500 -D_BSD_SOURCE -Wcast-align -Wchar-subscripts -Wall -W -Wpointer-arith -DNDEBUG -DNO_DEBUG -O2 -O2 -march=i686 -pipe -fomit-frame-pointer -Wformat-security -Wmissing-format-attribute -Wno-non-virtual-dtor -fno-exceptions -fno-check-new -fno-common -DQT_CLEAN_NAMESPACE -DQT_NO_ASCII_CAST -DQT_NO_STL -DQT_NO_COMPAT -DQT_NO_TRANSLATION -c -o address.lo address.cpp
/bin/sh ../libtool --silent --tag=CXX --mode=compile i686-pc-linux-gnu-g++ -DHAVE_CONFIG_H -I. -I. -I.. -I../dcop -I../kdecore -I../kio/kssl -I../kjs -I../kabc -I../kabc -I../kab -I./vcard/include -I./vcardparser/ -I./vcard/include/generated -I./vcardparser -I../dcop -I../libltdl -I../kdefx -I../kdecore -I../kdecore -I../kdecore/network -I../kdeui -I../kio -I../kio/kio -I../kio/kfile -I.. -I/usr/qt/3/include -I. -I/usr/kde/3.5/include -DQT_THREAD_SUPPORT -D_REENTRANT -Wno-long-long -Wundef -ansi -D_XOPEN_SOURCE=500 -D_BSD_SOURCE -Wcast-align -Wchar-subscripts -Wall -W -Wpointer-arith -DNDEBUG -DNO_DEBUG -O2 -O2 -march=i686 -pipe -fomit-frame-pointer -Wformat-security -Wmissing-format-attribute -Wno-non-virtual-dtor -fno-exceptions -fno-check-new -fno-common -DQT_CLEAN_NAMESPACE -DQT_NO_ASCII_CAST -DQT_NO_STL -DQT_NO_COMPAT -DQT_NO_TRANSLATION -c -o addressbook.lo addressbook.cpp
field.h:81: error: expected unqualified-id before '&' token
field.h:81: error: expected ',' or '...' before '&' token
field.h:81: error: ISO C++ forbids declaration of 'parameter' with no type
field.h:87: error: 'KABC::Addressee' has not been declared
field.h:92: error: expected unqualified-id before '&' token
field.h:92: error: expected ',' or '...' before '&' token
field.h:92: error: ISO C++ forbids declaration of 'parameter' with no type
addressbook.h:65: error: ISO C++ forbids declaration of 'Addressee' with no type
addressbook.h:65: error: expected ';' before '&' token
addressbook.h:66: error: ISO C++ forbids declaration of 'Addressee' with no type
addressbook.h:66: error: expected ';' before '&' token
addressbook.h:67: error: ISO C++ forbids declaration of 'Addressee' with no type
addressbook.h:67: error: expected ';' before '*' token
addressbook.h:93: error: ISO C++ forbids declaration of 'Addressee' with no type
addressbook.h:93: error: expected ';' before '&' token
addressbook.h:94: error: ISO C++ forbids declaration of 'Addressee' with no type
addressbook.h:94: error: expected ';' before '*' token
addressbook.h:215: error: expected ',' or '...' before '&' token
addressbook.h:215: error: ISO C++ forbids declaration of 'Addressee' with no type
addressbook.h:222: error: expected ',' or '...' before '&' token
addressbook.h:222: error: ISO C++ forbids declaration of 'Addressee' with no type
addressbook.h:238: error: expected ',' or '...' before '&' token
addressbook.h:238: error: ISO C++ forbids declaration of 'Addressee' with no type
addressbook.h:247: error: 'Addressee' does not name a type
addressbook.h:252: error: 'Addressee' has not been declared
addressbook.h:252: error: ISO C++ forbids declaration of 'List' with no type
addressbook.h:252: error: expected ';' before 'allAddressees'
addressbook.h:260: error: 'Addressee' has not been declared
addressbook.h:260: error: ISO C++ forbids declaration of 'List' with no type
addressbook.h:260: error: expected ';' before 'findByName'
addressbook.h:268: error: 'Addressee' has not been declared
addressbook.h:268: error: ISO C++ forbids declaration of 'List' with no type
addressbook.h:268: error: expected ';' before 'findByEmail'
addressbook.h:276: error: 'Addressee' has not been declared
addressbook.h:276: error: ISO C++ forbids declaration of 'List' with no type
addressbook.h:276: error: expected ';' before 'findByCategory'
stdaddressbook.h:129: error: 'Addressee' does not name a type
stdaddressbook.h:136: error: expected ',' or '...' before '&' token
stdaddressbook.h:136: error: ISO C++ forbids declaration of 'Addressee' with no type
kab2kabc.cpp: In function 'void readKMailEntry(const QString&, KABC::AddressBook*)':
kab2kabc.cpp:108: error: 'KABC::Addressee' has not been declared
kab2kabc.cpp:108: error: expected `;' before 'al'
kab2kabc.cpp:109: error: 'al' was not declared in this scope
kab2kabc.cpp:110: error: 'Addressee' is not a member of 'KABC'
kab2kabc.cpp:110: error: expected `;' before 'a'
kab2kabc.cpp:111: error: 'a' was not declared in this scope
kab2kabc.cpp: At global scope:
kab2kabc.cpp:170: error: 'Addressee' has not been declared
kab2kabc.cpp: In function 'void readKAddressBookEntries(const QString&, int&)':
kab2kabc.cpp:177: error: 'Address' was not declared in this scope
kab2kabc.cpp:177: error: expected `;' before 'homeAddress'
kab2kabc.cpp:178: error: expected `;' before 'businessAddress'
kab2kabc.cpp:179: error: expected `;' before 'otherAddress'
kab2kabc.cpp:188: error: request for member 'insertPhoneNumber' in 'a', which is of non-class type 'int'
kab2kabc.cpp:188: error: 'PhoneNumber' has not been declared
kab2kabc.cpp:189: error: 'PhoneNumber' has not been declared
kab2kabc.cpp:189: error: 'PhoneNumber' was not declared in this scope
kab2kabc.cpp:191: error: request for member 'insertPhoneNumber' in 'a', which is of non-class type 'int'
kab2kabc.cpp:191: error: 'PhoneNumber' was not declared in this scope
kab2kabc.cpp:193: error: request for member 'insertPhoneNumber' in 'a', which is of non-class type 'int'
kab2kabc.cpp:193: error: 'PhoneNumber' has not been declared
kab2kabc.cpp:193: error: 'PhoneNumber' was not declared in this scope
kab2kabc.cpp:195: error: request for member 'insertPhoneNumber' in 'a', which is of non-class type 'int'
kab2kabc.cpp:195: error: 'PhoneNumber' has not been declared
kab2kabc.cpp:196: error: 'PhoneNumber' has not been declared
kab2kabc.cpp:196: error: 'PhoneNumber' was not declared in this scope
kab2kabc.cpp:198: error: request for member 'insertPhoneNumber' in 'a', which is of non-class type 'int'
kab2kabc.cpp:198: error: 'PhoneNumber' has not been declared
kab2kabc.cpp:198: error: 'PhoneNumber' was not declared in this scope
kab2kabc.cpp:200: error: request for member 'insertPhoneNumber' in 'a', which is of non-class type 'int'
kab2kabc.cpp:200: error: 'PhoneNumber' has not been declared
kab2kabc.cpp:200: error: 'PhoneNumber' was not declared in this scope
kab2kabc.cpp:202: error: request for member 'insertPhoneNumber' in 'a', which is of non-class type 'int'
kab2kabc.cpp:202: error: 'PhoneNumber' has not been declared
kab2kabc.cpp:202: error: 'PhoneNumber' was not declared in this scope
kab2kabc.cpp:204: error: request for member 'insertPhoneNumber' in 'a', which is of non-class type 'int'
kab2kabc.cpp:204: error: 'PhoneNumber' has not been declared
kab2kabc.cpp:204: error: 'PhoneNumber' was not declared in this scope
kab2kabc.cpp:206: error: request for member 'insertPhoneNumber' in 'a', which is of non-class type 'int'
kab2kabc.cpp:206: error: 'PhoneNumber' has not been declared
kab2kabc.cpp:206: error: 'PhoneNumber' was not declared in this scope
kab2kabc.cpp:208: error: request for member 'insertPhoneNumber' in 'a', which is of non-class type 'int'
kab2kabc.cpp:208: error: 'PhoneNumber' has not been declared
kab2kabc.cpp:208: error: 'PhoneNumber' was not declared in this scope
kab2kabc.cpp:210: error: request for member 'insertPhoneNumber' in 'a', which is of non-class type 'int'
kab2kabc.cpp:210: error: 'PhoneNumber' has not been declared
kab2kabc.cpp:210: error: 'PhoneNumber' was not declared in this scope
kab2kabc.cpp:212: error: 'homeAddress' was not declared in this scope
kab2kabc.cpp:214: error: 'homeAddress' was not declared in this scope
kab2kabc.cpp:216: error: 'homeAddress' was not declared in this scope
kab2kabc.cpp:218: error: 'homeAddress' was not declared in this scope
kab2kabc.cpp:220: error: 'homeAddress' was not declared in this scope
kab2kabc.cpp:222: error: 'homeAddress' was not declared in this scope
kab2kabc.cpp:224: error: 'businessAddress' was not declared in this scope
kab2kabc.cpp:226: error: 'businessAddress' was not declared in this scope
kab2kabc.cpp:228: error: 'businessAddress' was not declared in this scope
kab2kabc.cpp:230: error: 'businessAddress' was not declared in this scope
kab2kabc.cpp:232: error: 'businessAddress' was not declared in this scope
kab2kabc.cpp:234: error: 'businessAddress' was not declared in this scope
kab2kabc.cpp:236: error: 'otherAddress' was not declared in this scope
kab2kabc.cpp:238: error: 'otherAddress' was not declared in this scope
kab2kabc.cpp:240: error: 'otherAddress' was not declared in this scope
kab2kabc.cpp:242: error: 'otherAddress' was not declared in this scope
kab2kabc.cpp:244: error: 'otherAddress' was not declared in this scope
kab2kabc.cpp:246: error: 'otherAddress' was not declared in this scope
kab2kabc.cpp:248: error: request for member 'setNickName' in 'a', which is of non-class type 'int'
kab2kabc.cpp:250: error: request for member 'setOrganization' in 'a', which is of non-class type 'int'
kab2kabc.cpp:252: error: request for member 'setRole' in 'a', which is of non-class type 'int'
kab2kabc.cpp:254: error: request for member 'setBirthday' in 'a', which is of non-class type 'int'
kab2kabc.cpp:256: error: request for member 'setUrl' in 'a', which is of non-class type 'int'
kab2kabc.cpp:265: error: request for member 'insertEmail' in 'a', which is of non-class type 'int'
kab2kabc.cpp:267: error: request for member 'insertEmail' in 'a', which is of non-class type 'int'
kab2kabc.cpp:269: error: request for member 'insertEmail' in 'a', which is of non-class type 'int'
kab2kabc.cpp:272: error: request for member 'insertCustom' in 'a', which is of non-class type 'int'
kab2kabc.cpp:276: error: 'homeAddress' was not declared in this scope
kab2kabc.cpp:276: error: request for member 'insertAddress' in 'a', which is of non-class type 'int'
kab2kabc.cpp:277: error: 'businessAddress' was not declared in this scope
kab2kabc.cpp:277: error: request for member 'insertAddress' in 'a', which is of non-class type 'int'
kab2kabc.cpp:278: error: 'otherAddress' was not declared in this scope
kab2kabc.cpp:278: error: request for member 'insertAddress' in 'a', which is of non-class type 'int'
kab2kabc.cpp: In function 'void importKab(KABC::AddressBook*, bool, bool)':
kab2kabc.cpp:320: error: 'Addressee' was not declared in this scope
kab2kabc.cpp:320: error: expected `;' before 'a'
kab2kabc.cpp:328: error: 'a' was not declared in this scope
kab2kabc.cpp:331: error: 'a' was not declared in this scope
kab2kabc.cpp:333: error: 'a' was not declared in this scope
kab2kabc.cpp:339: error: 'a' was not declared in this scope
kab2kabc.cpp:348: error: 'a' was not declared in this scope
kab2kabc.cpp:366: error: 'PhoneNumber' has not been declared
kab2kabc.cpp:367: error: 'PhoneNumber' has not been declared
kab2kabc.cpp:367: error: 'PhoneNumber' has not been declared
kab2kabc.cpp:368: error: 'PhoneNumber' has not been declared
kab2kabc.cpp:369: error: 'PhoneNumber' has not been declared
kab2kabc.cpp:370: error: 'PhoneNumber' was not declared in this scope
kab2kabc.cpp:385: error: 'Address' was not declared in this scope
kab2kabc.cpp:385: error: expected `;' before 'adr'
kab2kabc.cpp:387: error: 'adr' was not declared in this scope
kab2kabc.cpp: In function 'int main(int, char**)':
kab2kabc.cpp:472: warning: 'save' is deprecated (declared at stdaddressbook.h:86)
make[3]: *** [kab2kabc.o] Error 1
make[3]: *** Waiting for unfinished jobs....
make[3]: Leaving directory `/var/tmp/portage/kde-base/kdelibs-3.5.7/work/kdelibs-3.5.7/kabc'
make[2]: *** [all-recursive] Error 1
make[2]: Leaving directory `/var/tmp/portage/kde-base/kdelibs-3.5.7/work/kdelibs-3.5.7/kabc'
make[1]: *** [all-recursive] Error 1
make[1]: Leaving directory `/var/tmp/portage/kde-base/kdelibs-3.5.7/work/kdelibs-3.5.7'
make: *** [all] Error 2

!!! ERROR: kde-base/kdelibs-3.5.7 failed.
Call stack:
ebuild.sh, line 1621: Called dyn_compile
ebuild.sh, line 973: Called qa_call 'src_compile'
ebuild.sh, line 44: Called src_compile
kdelibs-3.5.7.ebuild, line 151: Called kde_src_compile
kde.eclass, line 170: Called kde_src_compile 'all'
kde.eclass, line 340: Called kde_src_compile 'myconf' 'configure' 'make'
kde.eclass, line 336: Called die

!!! died running emake, kde_src_compile:make
!!! If you need support, post the topmost build error, and the call stack if relevant.
!!! A complete build log is located at '/var/log/portage/kde-base:kdelibs-3.5.7:20070609-002416.log'.
Back to top
View user's profile Send private message
mark_alec
Bodhisattva
Bodhisattva


Joined: 11 Sep 2004
Posts: 6066
Location: Melbourne, Australia

PostPosted: Sat Jun 09, 2007 5:47 am    Post subject: Reply with quote

Moved from Desktop Environments to Duplicate Threads.

See https://forums.gentoo.org/viewtopic-p-4077416.html#4077416
_________________
www.gentoo.org.au || #gentoo-au
Back to top
View user's profile Send private message
Display posts from previous:   
Reply to topic    Gentoo Forums Forum Index Duplicate Threads All times are GMT
Page 1 of 1

 
Jump to:  
You cannot post new topics in this forum
You cannot reply to topics in this forum
You cannot edit your posts in this forum
You cannot delete your posts in this forum
You cannot vote in polls in this forum