Gentoo Forums
Gentoo Forums
Gentoo Forums
Quick Search: in
mysql-query-browser fails to build
View unanswered posts
View posts from last 24 hours

 
Reply to topic    Gentoo Forums Forum Index Portage & Programming
View previous topic :: View next topic  
Author Message
mystified
l33t
l33t


Joined: 14 Feb 2004
Posts: 748

PostPosted: Sat Apr 28, 2007 8:33 pm    Post subject: mysql-query-browser fails to build Reply with quote

Code:
/usr/include/mysql/m_ctype.h:189: error: expected ':', ',', ';', '}' or '__attribute__' before 'ATTRIBUTE_FORMAT_FPTR'
/usr/include/mysql/m_ctype.h: In function 'my_snprintf_8bit':
/usr/include/mysql/m_ctype.h:329: error: expected declaration specifiers before 'ATTRIBUTE_FORMAT'
/usr/include/mysql/m_ctype.h:401: error: storage class specified for parameter 'my_caseup_str_mb'
/usr/include/mysql/m_ctype.h:402: error: storage class specified for parameter 'my_casedn_str_mb'
/usr/include/mysql/m_ctype.h:404: error: storage class specified for parameter 'my_caseup_mb'
/usr/include/mysql/m_ctype.h:406: error: storage class specified for parameter 'my_casedn_mb'
/usr/include/mysql/m_ctype.h:407: error: storage class specified for parameter 'my_strcasecmp_mb'
/usr/include/mysql/m_ctype.h:430: error: storage class specified for parameter 'my_parse_charset_xml'
myx_library.c:63: error: storage class specified for parameter 'MYX_MYSQL'
myx_library.c:67: error: expected declaration specifiers before 'MYX_MYSQL'
myx_library.c:81: error: storage class specified for parameter 'myx_my_cnf_path'
myx_library.c:81: error: parameter 'myx_my_cnf_path' is initialized
myx_library.c:82: error: storage class specified for parameter 'mysql_last_error'
myx_library.c:82: error: parameter 'mysql_last_error' is initialized
myx_library.c:83: error: storage class specified for parameter 'mysql_last_errno'
myx_library.c:83: error: parameter 'mysql_last_errno' is initialized
myx_library.c:95: error: storage class specified for parameter 'MYSQL_REAL_CONNECT_PARAMETERS'
myx_library.c:98: error: storage class specified for parameter 'ADVANCED_OPTION_DESCRIPTION'
myx_library.c:109: error: expected ')' before '*' token
myx_library.c:123: error: expected specifier-qualifier-list before 'advanced_option_interpreter'
myx_library.c:125: warning: empty declaration
myx_library.c:136: error: expected ')' before '*' token
myx_library.c:154: error: expected ')' before '*' token
myx_library.c:172: error: expected ')' before '*' token
myx_library.c:191: error: expected ')' before '*' token
myx_library.c:210: error: expected '=', ',', ';', 'asm' or '__attribute__' before 'myx_advanced_options'
myx_library.c:217: error: expected declaration specifiers before ';' token
myx_library.c:220: error: expected declaration specifiers before 'ADVANCED_OPTION_DESCRIPTION'
myx_library.c:267: error: expected '=', ',', ';', 'asm' or '__attribute__' before '{' token
myx_library.c:287: error: expected '=', ',', ';', 'asm' or '__attribute__' before '{' token
myx_library.c:300: error: expected '=', ',', ';', 'asm' or '__attribute__' before '{' token
myx_library.c:319: error: expected '=', ',', ';', 'asm' or '__attribute__' before '{' token
myx_library.c:352: error: expected '=', ',', ';', 'asm' or '__attribute__' before '{' token
myx_library.c:365: error: expected '=', ',', ';', 'asm' or '__attribute__' before '{' token
myx_library.c:375: error: expected declaration specifiers before 'MYX_MYSQL'
myx_library.c:384: error: expected '=', ',', ';', 'asm' or '__attribute__' before '{' token
myx_library.c:393: error: expected '=', ',', ';', 'asm' or '__attribute__' before '{' token
myx_library.c:400: error: parameter 'server_args' is initialized
myx_library.c:402: warning: initialization from incompatible pointer type
myx_library.c:403: warning: excess elements in scalar initializer
myx_library.c:403: warning: (near initialization for 'server_args')
myx_library.c:404: warning: excess elements in scalar initializer
myx_library.c:404: warning: (near initialization for 'server_args')
myx_library.c:405: warning: excess elements in scalar initializer
myx_library.c:405: warning: (near initialization for 'server_args')
myx_library.c:406: warning: excess elements in scalar initializer
myx_library.c:406: warning: (near initialization for 'server_args')
myx_library.c:407: warning: excess elements in scalar initializer
myx_library.c:407: warning: (near initialization for 'server_args')
myx_library.c:409: warning: excess elements in scalar initializer
myx_library.c:409: warning: (near initialization for 'server_args')
myx_library.c:410: error: storage class specified for parameter 'server_groups'
myx_library.c:410: error: parameter 'server_groups' is initialized
myx_library.c:411: warning: initialization from incompatible pointer type
myx_library.c:413: warning: excess elements in scalar initializer
myx_library.c:413: warning: (near initialization for 'server_groups')
myx_library.c:416: error: expected '=', ',', ';', 'asm' or '__attribute__' before '{' token
myx_library.c:421: error: expected '=', ',', ';', 'asm' or '__attribute__' before '{' token
myx_library.c:427: error: expected '=', ',', ';', 'asm' or '__attribute__' before '{' token
myx_library.c:432: error: expected '=', ',', ';', 'asm' or '__attribute__' before '{' token
myx_library.c:463: error: expected '=', ',', ';', 'asm' or '__attribute__' before '{' token
myx_library.c:477: error: expected '=', ',', ';', 'asm' or '__attribute__' before '{' token
myx_library.c:484: error: expected '=', ',', ';', 'asm' or '__attribute__' before '{' token
myx_library.c:503: error: expected '=', ',', ';', 'asm' or '__attribute__' before '{' token
myx_library.c:582: error: expected '=', ',', ';', 'asm' or '__attribute__' before '{' token
myx_library.c:681: error: expected '=', ',', ';', 'asm' or '__attribute__' before '{' token
myx_library.c:702: error: expected '=', ',', ';', 'asm' or '__attribute__' before '{' token
myx_library.c:741: error: expected '=', ',', ';', 'asm' or '__attribute__' before '{' token
myx_library.c:760: error: expected '=', ',', ';', 'asm' or '__attribute__' before '{' token
myx_library.c:773: error: expected '=', ',', ';', 'asm' or '__attribute__' before '{' token
myx_library.c:785: error: expected '=', ',', ';', 'asm' or '__attribute__' before '{' token
myx_library.c:805: error: expected '=', ',', ';', 'asm' or '__attribute__' before '{' token
myx_library.c:817: error: expected '=', ',', ';', 'asm' or '__attribute__' before '{' token
myx_library.c:823: error: expected '=', ',', ';', 'asm' or '__attribute__' before '{' token
myx_library.c:875: error: expected '=', ',', ';', 'asm' or '__attribute__' before '{' token
myx_library.c:893: error: expected '=', ',', ';', 'asm' or '__attribute__' before '{' token
myx_library.c:905: error: expected '=', ',', ';', 'asm' or '__attribute__' before '{' token
myx_library.c:932: error: expected '=', ',', ';', 'asm' or '__attribute__' before '{' token
myx_library.c:951: error: expected '=', ',', ';', 'asm' or '__attribute__' before '{' token
myx_library.c:970: error: expected '=', ',', ';', 'asm' or '__attribute__' before '{' token
myx_library.c:999: error: expected '=', ',', ';', 'asm' or '__attribute__' before '{' token
myx_library.c:1051: error: expected '=', ',', ';', 'asm' or '__attribute__' before '{' token
myx_library.c:1078: error: expected '=', ',', ';', 'asm' or '__attribute__' before '{' token
myx_library.c:1117: error: expected '=', ',', ';', 'asm' or '__attribute__' before '{' token
myx_library.c:1122: error: expected '=', ',', ';', 'asm' or '__attribute__' before '{' token
myx_library.c:1212: error: expected '=', ',', ';', 'asm' or '__attribute__' before '{' token
myx_library.c:1236: error: expected '=', ',', ';', 'asm' or '__attribute__' before '{' token
myx_library.c:1270: error: expected '=', ',', ';', 'asm' or '__attribute__' before '{' token
myx_library.c:1302: error: expected '=', ',', ';', 'asm' or '__attribute__' before '{' token
myx_library.c:1344: error: expected '=', ',', ';', 'asm' or '__attribute__' before '{' token
myx_library.c:1396: error: expected '=', ',', ';', 'asm' or '__attribute__' before '{' token
myx_library.c:1411: error: expected '=', ',', ';', 'asm' or '__attribute__' before '{' token
myx_library.c:1417: error: expected '=', ',', ';', 'asm' or '__attribute__' before '{' token
myx_library.c:1451: error: expected '=', ',', ';', 'asm' or '__attribute__' before '{' token
myx_library.c:1481: error: expected '=', ',', ';', 'asm' or '__attribute__' before '{' token
myx_library.c:1513: error: expected '=', ',', ';', 'asm' or '__attribute__' before '{' token
myx_library.c:1570: error: expected '=', ',', ';', 'asm' or '__attribute__' before '{' token
myx_library.c:1588: error: expected '=', ',', ';', 'asm' or '__attribute__' before '{' token
myx_library.c:1642: error: expected '=', ',', ';', 'asm' or '__attribute__' before '{' token
myx_library.c:1662: error: expected '=', ',', ';', 'asm' or '__attribute__' before '{' token
myx_library.c:1691: error: expected '=', ',', ';', 'asm' or '__attribute__' before '{' token
myx_library.c:1693: error: old-style parameter declarations in prototyped function definition
/usr/include/mysql/m_ctype.h:327: error: parameter name omitted
myx_library.c:1693: error: expected '{' at end of input
make[3]: *** [myx_library.o] Error 1
make[3]: Leaving directory `/var/tmp/portage/dev-db/mysql-query-browser-1.1.18/work/mysql-query-browser-1.1.18/mysql-gui-common/library/source'
make[2]: *** [all-recursive] Error 1
make[2]: Leaving directory `/var/tmp/portage/dev-db/mysql-query-browser-1.1.18/work/mysql-query-browser-1.1.18/mysql-gui-common/library'
make[1]: *** [all-recursive] Error 1
make[1]: Leaving directory `/var/tmp/portage/dev-db/mysql-query-browser-1.1.18/work/mysql-query-browser-1.1.18/mysql-gui-common'
make: *** [all] Error 2

!!! ERROR: dev-db/mysql-query-browser-1.1.18 failed.
Call stack:
  ebuild.sh, line 1614:   Called dyn_compile
  ebuild.sh, line 971:   Called qa_call 'src_compile'
  environment, line 3774:   Called src_compile
  mysql-query-browser-1.1.18.ebuild, line 45:   Called die

!!! emake failed
!!! If you need support, post the topmost build error, and the call stack if relevant.
!!! A complete build log is located at '/var/tmp/portage/dev-db/mysql-query-browser-1.1.18/temp/build.log'.
Back to top
View user's profile Send private message
wubante
n00b
n00b


Joined: 27 Jan 2004
Posts: 21

PostPosted: Thu Jun 07, 2007 9:56 pm    Post subject: i got the same problem Reply with quote

hello i have exactly the same problem. i download the binary version but can not run it because
Quote:

libgtkhtml-2.so.0: cannot open shared object file: No such file or directory
Back to top
View user's profile Send private message
linga
Tux's lil' helper
Tux's lil' helper


Joined: 11 Dec 2006
Posts: 131

PostPosted: Mon Jun 18, 2007 3:01 pm    Post subject: Reply with quote

Did you find a solution? And what are your arch? I have the same problem too, and I am running amd64 here.

emerge --info:
Quote:

Portage 2.1.2.7 (default-linux/amd64/2007.0, gcc-4.1.2, glibc-2.5-r3, 2.6.20-gentoo-r8-3 x86_64)
=================================================================
System uname: 2.6.20-gentoo-r8-3 x86_64 AMD Athlon(tm) 64 X2 Dual Core Processor 3800+
Gentoo Base System release 1.12.9
Timestamp of tree: Sun, 17 Jun 2007 13:20:01 +0000
dev-java/java-config: 1.3.7, 2.0.32
dev-lang/python: 2.4.4-r4
dev-python/pycrypto: 2.0.1-r5
sys-apps/sandbox: 1.2.17
sys-devel/autoconf: 2.13, 2.61
sys-devel/automake: 1.4_p6, 1.5, 1.6.3, 1.7.9-r1, 1.8.5-r3, 1.9.6-r2, 1.10
sys-devel/binutils: 2.16.1-r3
sys-devel/gcc-config: 1.3.16
sys-devel/libtool: 1.5.22
virtual/os-headers: 2.6.17-r2
ABI="amd64"
ACCEPT_KEYWORDS="amd64"
ALSA_CARDS="ali5451 als4000 atiixp atiixp-modem bt87x ca0106 cmipci emu10k1x ens1370 ens1371 es1938 es1968 fm801 hda-intel intel8x0 intel8x0m maestro3 trident usb-audio via82xx via82xx-modem ymfpci"
ALSA_PCM_PLUGINS="adpcm alaw asym copy dmix dshare dsnoop empty extplug file hooks iec958 ioplug ladspa lfloat linear meter mulaw multi null plug rate route share shm softvol"
ARCH="amd64"
ASFLAGS_x86="--32"
AUTOCLEAN="yes"
CBUILD="x86_64-pc-linux-gnu"
CDEFINE_amd64="__x86_64__"
CDEFINE_x86="__i386__"
CFLAGS="-march=athlon64 -msse3 -O2 -pipe"
CFLAGS_x86="-m32 -L/emul/linux/x86/lib -L/emul/linux/x86/usr/lib"
CHOST="x86_64-pc-linux-gnu"
CHOST_amd64="x86_64-pc-linux-gnu"
CHOST_x86="i686-pc-linux-gnu"
CLASSPATH="."
CLEAN_DELAY="5"
COLORTERM="Terminal"
CONFIG_PROTECT="/etc /usr/kde/3.5/env /usr/kde/3.5/share/config /usr/kde/3.5/shutdown /usr/share/X11/xkb /usr/share/config"
CONFIG_PROTECT_MASK="/etc/env.d /etc/env.d/java/ /etc/gconf /etc/php/apache2-php5/ext-active/ /etc/php/cgi-php5/ext-active/ /etc/php/cli-php5/ext-active/ /etc/revdep-rebuild /etc/terminfo"
CVS_RSH="ssh"
CXXFLAGS="-march=athlon64 -msse3 -O2 -pipe"
DBUS_SESSION_BUS_ADDRESS="unix:abstract=/tmp/dbus-pZxzw2nApG,guid=487d2924904a10f38af6df0046769899"
DEFAULT_ABI="amd64"
DESKTOP_SESSION="xfce"
DESKTOP_STARTUP_ID=""
DISPLAY=":1.0"
DISTDIR="/usr/portage/distfiles"
EDITOR="/bin/nano"
ELIBC="glibc"
EMERGE_DEFAULT_OPTS="--verbose --ask"
EMERGE_WARNING_DELAY="10"
FEATURES="distlocks metadata-transfer parallel-fetch sandbox sfperms strict"
FETCHCOMMAND="/usr/bin/wget -t 5 -T 60 --passive-ftp -P ${DISTDIR} ${URI}"
GCC_PATH="/usr/x86_64-pc-linux-gnu/gcc-bin/4.1.2"
GCC_SPECS=""
GDK_USE_XFT="1"
GDMSESSION="xfce"
GDM_XSERVER_LOCATION="local"
GENTOO_MIRRORS="http://ds.thn.htu.se/linux/gentoo http://mirror.gentoo.no/ ftp://trumpetti.atm.tut.fi/gentoo/"
G_BROKEN_FILENAMES="1"
G_FILENAME_ENCODING="UTF-8"
HOME="/home/simon"
INFOPATH="/usr/share/info:/usr/share/binutils-data/x86_64-pc-linux-gnu/2.16.1/info:/usr/share/gcc-data/x86_64-pc-linux-gnu/4.1.2/info"
INPUT_DEVICES="keyboard mouse"
JAVAC="/etc/java-config-2/current-system-vm/bin/javac"
JAVA_HOME="/etc/java-config-2/current-system-vm"
JDK_HOME="/etc/java-config-2/current-system-vm"
KDEDIRS="/usr/kde/3.5:/usr:/usr/local"
KERNEL="linux"
LANG="sv_SE.utf-8"
LCD_DEVICES="bayrad cfontz cfontz633 glk hd44780 lb216 lcdm001 mtxorb ncurses text"
LC_ALL="sv_SE.utf-8"
LDFLAGS_x86="-m elf_i386 -L/emul/linux/x86/lib -L/emul/linux/x86/usr/lib"
LESS="-R -M --shift 5"
LESSOPEN="|lesspipe.sh %s"
LIBDIR_amd64="lib64"
LIBDIR_x86="lib32"
LIBGL_DRIVERS_PATH="/usr/lib64/dri:/usr/lib32/dri"
LINGUAS="sv en"
LOGNAME="simon"
LS_COLORS="no=00:fi=00:di=01;34:ln=01;36:pi=40;33:so=01;35:do=01;35:bd=40;33;01:cd=40;33;01:or=01;05;37;41:mi=01;05;37;41:su=37;41:sg=30;43:tw=30;42:ow=34;42:st=37;44:ex=01;32:*.tar=01;31:*.tgz=01;31:*.arj=01;31:*.taz=01;31:*.lzh=01;31:*.zip=01;31:*.z=01;31:*.Z=01;31:*.gz=01;31:*.bz2=01;31:*.bz=01;31:*.tbz2=01;31:*.tz=01;31:*.deb=01;31:*.rpm=01;31:*.jar=01;31:*.rar=01;31:*.ace=01;31:*.zoo=01;31:*.cpio=01;31:*.7z=01;31:*.rz=01;31:*.jpg=01;35:*.jpeg=01;35:*.gif=01;35:*.bmp=01;35:*.pbm=01;35:*.pgm=01;35:*.ppm=01;35:*.tga=01;35:*.xbm=01;35:*.xpm=01;35:*.tif=01;35:*.tiff=01;35:*.png=01;35:*.mng=01;35:*.pcx=01;35:*.mov=01;35:*.mpg=01;35:*.mpeg=01;35:*.m2v=01;35:*.mkv=01;35:*.ogm=01;35:*.mp4=01;35:*.m4v=01;35:*.mp4v=01;35:*.vob=01;35:*.qt=01;35:*.nuv=01;35:*.wmv=01;35:*.asf=01;35:*.rm=01;35:*.rmvb=01;35:*.flc=01;35:*.avi=01;35:*.fli=01;35:*.gl=01;35:*.dl=01;35:*.xcf=01;35:*.xwd=01;35:*.yuv=01;35:*.pdf=00;32:*.ps=00;32:*.txt=00;32:*.patch=00;32:*.diff=00;32:*.log=00;32:*.tex=00;32:*.doc=00;32:*.aac=00;36:*.au=00;36:*.flac=00;36:*.mid=00;36:*.midi=00;36:*.mka=00;36:*.mp3=00;36:*.mpc=00;36:*.ogg=00;36:*.ra=00;36:*.wav=00;36:"
MAKEOPTS="-j3"
MANPATH="/usr/local/share/man:/usr/share/man:/usr/share/binutils-data/x86_64-pc-linux-gnu/2.16.1/man:/usr/share/gcc-data/x86_64-pc-linux-gnu/4.1.2/man:/etc/java-config/system-vm/man/:/usr/lib64/php5/man/:/usr/qt/3/doc/man:/usr/qt/3/doc/man"
MULTILIB_ABIS="amd64 x86"
MULTILIB_STRICT_DENY="64-bit.*shared object"
MULTILIB_STRICT_DIRS="/lib /usr/lib /usr/kde/*/lib /usr/qt/*/lib /usr/X11R6/lib"
MULTILIB_STRICT_EXEMPT="(perl5|gcc|gcc-lib|binutils|eclipse-3|debug|portage)"
OPENGL_PROFILE="ati"
PAGER="/usr/bin/less"
PATH="/usr/local/bin:/usr/bin:/bin:/opt/bin:/usr/x86_64-pc-linux-gnu/gcc-bin/4.1.2:/usr/kde/3.5/bin:/usr/qt/3/bin:/usr/qt/3/bin:/usr/games/bin"
PKGDIR="/usr/portage/packages"
PKG_CONFIG_PATH="/usr/qt/3/lib64/pkgconfig:/usr/qt/3/lib32/pkgconfig"
PORTAGE_ARCHLIST="ppc s390 amd64 x86 ppc64 x86-fbsd m68k arm sparc sh mips ia64 alpha ppc-macos hppa sparc-fbsd"
PORTAGE_BINHOST_CHUNKSIZE="3000"
PORTAGE_BIN_PATH="/usr/lib64/portage/bin"
PORTAGE_CONFIGROOT="/"
PORTAGE_DEBUG="0"
PORTAGE_DEPCACHEDIR="/var/cache/edb/dep"
PORTAGE_ELOG_CLASSES="log warn error"
PORTAGE_ELOG_MAILFROM="portage"
PORTAGE_ELOG_MAILSUBJECT="[portage] ebuild log for ${PACKAGE} on ${HOST}"
PORTAGE_ELOG_MAILURI="root"
PORTAGE_GID="250"
PORTAGE_INST_GID="0"
PORTAGE_INST_UID="0"
PORTAGE_PYM_PATH="/usr/lib64/portage/pym"
PORTAGE_RSYNC_OPTS="--recursive --links --safe-links --perms --times --compress --force --whole-file --delete --delete-after --stats --timeout=180 --exclude=/distfiles --exclude=/local --exclude=/packages --filter=H_**/files/digest-*"
PORTAGE_RSYNC_RETRIES="3"
PORTAGE_TMPDIR="/var/tmp"
PORTAGE_WORKDIR_MODE="0700"
PORTDIR="/usr/portage"
PORTDIR_OVERLAY="/usr/portage/local/layman/xeffects /usr/local/portage"
PWD="/home/simon"
PYTHONPATH="/usr/lib64/portage/pym"
QMAKESPEC="linux-g++"
QTDIR="/usr/qt/3"
RESUMECOMMAND="/usr/bin/wget -c -t 5 -T 60 --passive-ftp -P ${DISTDIR} ${URI}"
ROOT="/"
ROOTPATH="/opt/bin:/usr/x86_64-pc-linux-gnu/gcc-bin/4.1.2:/usr/kde/3.5/sbin:/usr/kde/3.5/bin:/usr/qt/3/bin:/usr/qt/3/bin"
RPMDIR="/usr/portage/rpm"
SESSION_MANAGER="local/simon-desktop:/tmp/.ICE-unix/4045"
SHELL="/bin/bash"
SHLVL="2"
SSH_AGENT_PID="4038"
SSH_AUTH_SOCK="/tmp/ssh-eJXpWP4018/agent.4018"
STAGE1_USE="nptl nptlonly unicode"
SYMLINK_LIB="yes"
SYNC="rsync://rsync.europe.gentoo.org/gentoo-portage"
TERM="xterm"
TZ="Europe/Stockholm"
USE="X acl alsa amd64 apache2 berkdb bitmap-fonts cdr cli cracklib crypt cups dbus dri dvd evo fortran gdbm gpm gtk hal iconv ipv6 isdnlog jack jpeg libg++ libnotify midi mmx mono mpeg mudflap ncurses nls nptl nptlonly nsplugin ogg opengl openmp pam pcre pdf perl png pppd python readline reflection session smp spell spl sse sse2 ssl startup-notification tcpd theora threads tiff truetype truetype-fonts type1-fonts unicode vorbis xcomposite xorg zlib" ALSA_CARDS="ali5451 als4000 atiixp atiixp-modem bt87x ca0106 cmipci emu10k1x ens1370 ens1371 es1938 es1968 fm801 hda-intel intel8x0 intel8x0m maestro3 trident usb-audio via82xx via82xx-modem ymfpci" ALSA_PCM_PLUGINS="adpcm alaw asym copy dmix dshare dsnoop empty extplug file hooks iec958 ioplug ladspa lfloat linear meter mulaw multi null plug rate route share shm softvol" ELIBC="glibc" INPUT_DEVICES="keyboard mouse" KERNEL="linux" LCD_DEVICES="bayrad cfontz cfontz633 glk hd44780 lb216 lcdm001 mtxorb ncurses text" LINGUAS="sv en" USERLAND="GNU" VIDEO_CARDS="fglrx vesa none"
USER="simon"
USERLAND="GNU"
USERNAME="simon"
USE_EXPAND="ALSA_CARDS ALSA_PCM_PLUGINS CAMERAS CROSSCOMPILE_OPTS DVB_CARDS ELIBC FCDSL_CARDS FOO2ZJS_DEVICES FRITZCAPI_CARDS INPUT_DEVICES KERNEL LCD_DEVICES LINGUAS LIRC_DEVICES MISDN_CARDS USERLAND VIDEO_CARDS"
USE_EXPAND_HIDDEN="CROSSCOMPILE_OPTS ELIBC KERNEL USERLAND"
USE_ORDER="env:pkg:conf:defaults:pkginternal"
VIDEO_CARDS="fglrx vesa none"
WINDOWID="48234573"
XARGS="xargs -r"
XAUTHORITY="/home/simon/.Xauthority"
XDG_DATA_DIRS="/usr/local/share:/usr/share"
_="/usr/bin/emerge"
Back to top
View user's profile Send private message
didymos
Advocate
Advocate


Joined: 10 Oct 2005
Posts: 4798
Location: California

PostPosted: Mon Jun 18, 2007 4:46 pm    Post subject: Reply with quote

Ok, the bugzilla trail is a little odd for this:

It starts here:

dev-db/mysql-query-browser-1.1.18 fails compile

and then just links to here:

dev-db/mysql-gui-tools-5.0_p8 failed
_________________
Thomas S. Howard
Back to top
View user's profile Send private message
linga
Tux's lil' helper
Tux's lil' helper


Joined: 11 Dec 2006
Posts: 131

PostPosted: Mon Jun 18, 2007 6:40 pm    Post subject: Reply with quote

I'm afraid I can't use mysql-gui-tools since it depnds on mysql-5*. I'm working with a server using 4.1.22 and I want it at home too. Or can I use that patch anyway somehow? I'm not that used to patching...
Back to top
View user's profile Send private message
didymos
Advocate
Advocate


Joined: 10 Oct 2005
Posts: 4798
Location: California

PostPosted: Tue Jun 19, 2007 7:24 am    Post subject: Reply with quote

I don't know if you could use that patch, but probably not. I just searched for a bug with error messages as close as possible to those you reported.
_________________
Thomas S. Howard
Back to top
View user's profile Send private message
linga
Tux's lil' helper
Tux's lil' helper


Joined: 11 Dec 2006
Posts: 131

PostPosted: Tue Jun 19, 2007 7:26 pm    Post subject: Reply with quote

That is not good, I don't like writing the querys to view the data myself...
Well, I might learn SQL a little better now atleast.
Back to top
View user's profile Send private message
bubbl07
Apprentice
Apprentice


Joined: 06 Feb 2005
Posts: 237
Location: New York City

PostPosted: Tue Jun 19, 2007 8:54 pm    Post subject: Reply with quote

In a slightly related matter, is it possible to install mysql-query-browser from the ebuild without requiring MySQL? I just want to use it to manage a server on the LAN, I don't really need (or want) MySQL on my workstation.
Back to top
View user's profile Send private message
didymos
Advocate
Advocate


Joined: 10 Oct 2005
Posts: 4798
Location: California

PostPosted: Tue Jun 19, 2007 9:56 pm    Post subject: Reply with quote

No, it requires some version of mysql or mysql-community. You can use the minimal USE flag to cut down on compile time and disk space.
_________________
Thomas S. Howard
Back to top
View user's profile Send private message
a_l_a_n
n00b
n00b


Joined: 16 Dec 2006
Posts: 49

PostPosted: Fri Jul 20, 2007 9:13 am    Post subject: Reply with quote

Same problem, again on AMD 64.
Back to top
View user's profile Send private message
Display posts from previous:   
Reply to topic    Gentoo Forums Forum Index Portage & Programming All times are GMT
Page 1 of 1

 
Jump to:  
You cannot post new topics in this forum
You cannot reply to topics in this forum
You cannot edit your posts in this forum
You cannot delete your posts in this forum
You cannot vote in polls in this forum