Gentoo Forums
Gentoo Forums
Gentoo Forums
Quick Search: in
glib-1.2.10-r5 failed.
View unanswered posts
View posts from last 24 hours

 
Reply to topic    Gentoo Forums Forum Index Duplicate Threads
View previous topic :: View next topic  
Author Message
FightClub
n00b
n00b


Joined: 19 Feb 2007
Posts: 6
Location: Jack's Basement

PostPosted: Sat Feb 24, 2007 4:53 am    Post subject: glib-1.2.10-r5 failed. Reply with quote

When trying to emerge amarok, it tries to build glib, during the build I get this error:
Code:
   1.
      ./libtool: line 297: s,^.*/,,g: No such file or directory
   2.
      ./libtool: line 711: -e: command not found
   3.
      *** Warning: inferring the mode of operation is deprecated.
   4.
      *** Future versions of Libtool will require --mode=MODE be specified.
   5.
      ./libtool: line 1022: -e: command not found
   6.
      ./libtool: line 1022: -e: command not found
   7.
      ./libtool: line 1022: -e: command not found
   8.
      ./libtool: line 1022: -e: command not found
   9.
      ./libtool: line 1022: -e: command not found
  10.
      ./libtool: line 1022: -e: command not found
  11.
      ./libtool: line 1022: -e: command not found
  12.
      ./libtool: line 1022: -e: command not found
  13.
      ./libtool: line 1022: -e: command not found
  14.
      ./libtool: line 1022: -e: command not found
  15.
      ./libtool: line 1022: -e: command not found
  16.
      ./libtool: line 1022: -e: command not found
  17.
      ./libtool: line 1022: -e: command not found
  18.
      ./libtool: line 1022: -e: command not found
  19.
      ./libtool: line 1022: -e: command not found
  20.
      ./libtool: line 1050: -e: command not found
  21.
      ./libtool: line 1074: -e: command not found
  22.
      : compile: cannot determine name of library object from `'
  23.
      make[2]: *** [garray.lo] Error 1
  24.
      make[2]: Leaving directory `/var/tmp/portage/dev-libs/glib-1.2.10-r5/work/glib-1.2.10'
  25.
      make[1]: *** [all-recursive] Error 1
  26.
      make[1]: Leaving directory `/var/tmp/portage/dev-libs/glib-1.2.10-r5/work/glib-1.2.10'
  27.
      make: *** [all-recursive-am] Error 2
  28.
       
  29.
      !!! ERROR: dev-libs/glib-1.2.10-r5 failed.
  30.
      Call stack:
  31.
        ebuild.sh, line 1614:   Called dyn_compile
  32.
        ebuild.sh, line 971:   Called qa_call 'src_compile'
  33.
        environment, line 3723:   Called src_compile
  34.
        glib-1.2.10-r5.ebuild, line 54:   Called die
  35.
       
  36.
      !!! (no error message)
  37.
      !!! If you need support, post the topmost build error, and the call stack if relevant.
  38.
      !!! A complete build log is located at '/var/tmp/portage/dev-libs/glib-1.2.10-r5/temp/build.log'.

How can I fix this?
Back to top
View user's profile Send private message
devsk
Advocate
Advocate


Joined: 24 Oct 2003
Posts: 2757
Location: Bay Area, CA

PostPosted: Sat Feb 24, 2007 6:55 am    Post subject: Reply with quote

Code:
SED=sed emerge -O =dev-libs/glib-1.2.10-r5
Back to top
View user's profile Send private message
kallamej
Administrator
Administrator


Joined: 27 Jun 2003
Posts: 4838
Location: Gothenburg, Sweden

PostPosted: Sat Feb 24, 2007 8:54 am    Post subject: Reply with quote

Moved from Portage & Programming to Duplicate Threads in favour of topic 541928.
_________________
Please read our FAQ Forum, it answers many of your questions.
irc: #gentoo-forums on irc.freenode.net
Back to top
View user's profile Send private message
Display posts from previous:   
Reply to topic    Gentoo Forums Forum Index Duplicate Threads All times are GMT
Page 1 of 1

 
Jump to:  
You cannot post new topics in this forum
You cannot reply to topics in this forum
You cannot edit your posts in this forum
You cannot delete your posts in this forum
You cannot vote in polls in this forum