Gentoo Forums
Gentoo Forums
Gentoo Forums
Quick Search: in
ERROR: php-qt failed.
View unanswered posts
View posts from last 24 hours

 
Reply to topic    Gentoo Forums Forum Index Russian
View previous topic :: View next topic  
Author Message
burik666
n00b
n00b


Joined: 28 Jan 2007
Posts: 51
Location: Санкт-Петербург

PostPosted: Sun Jan 28, 2007 12:54 am    Post subject: ERROR: php-qt failed. Reply with quote

не могу собрать dev-php5/php-qt-0.0.3 (или php-qt-0.0.2)

Code:
/var/tmp/portage/php-qt-0.0.3/work/php_qt/qt/classes/qapplication.cpp:70: error: 'tsrm_ls' was not declared in this scope
make: *** [qt/classes/qapplication.lo] Ошибка 1
make: *** Ожидание завершения заданий...
/var/tmp/portage/php-qt-0.0.3/work/php_qt/qt/classes/qcoreapplication.cpp: In member function 'virtual int QCoreApplication_php_qt::qt_metacall(QMetaObject::Call, int, void**)':
/var/tmp/portage/php-qt-0.0.3/work/php_qt/qt/classes/qcoreapplication.cpp:54: error: 'tsrm_ls' was not declared in this scope
make: *** [qt/classes/qcoreapplication.lo] Ошибка 1

!!! ERROR: dev-php5/php-qt-0.0.3 failed.
Call stack:
  ebuild.sh, line 1546:   Called dyn_compile
  ebuild.sh, line 937:   Called src_compile
  ebuild.sh, line 1255:   Called php-ext-source-r1_src_compile
  php-ext-source-r1.eclass, line 57:   Called die

стоит dev-lang/php-5.1.6-r6 и x11-libs/qt-4.1.4-r2
Back to top
View user's profile Send private message
Display posts from previous:   
Reply to topic    Gentoo Forums Forum Index Russian All times are GMT
Page 1 of 1

 
Jump to:  
You cannot post new topics in this forum
You cannot reply to topics in this forum
You cannot edit your posts in this forum
You cannot delete your posts in this forum
You cannot vote in polls in this forum