Gentoo Forums
Gentoo Forums
Gentoo Forums
Quick Search: in
[gnome-python] emerge impossible (résolu)
View unanswered posts
View posts from last 24 hours

 
Reply to topic    Gentoo Forums Forum Index French
View previous topic :: View next topic  
Author Message
SnowBear
l33t
l33t


Joined: 03 Sep 2005
Posts: 730
Location: Dax [40]

PostPosted: Thu Nov 30, 2006 1:05 pm    Post subject: [gnome-python] emerge impossible (résolu) Reply with quote

Bonjour à tous,
je suis en train d'installer gentoo sur mon portable.
J'en suis à installer gnome (2.16). J'ai une erreur à la compilation de gnome-python qui m'empêche d'aller plus loin :/
La voici :
Code:
make[2]: *** [gnomevfs_la-vfsmodule.lo] Erreur 1
make[2]: *** Attente des tches non termines....
 i686-pc-linux-gnu-gcc -DHAVE_CONFIG_H -I. -I. -I.. -I/usr/include/python2.4 -I/usr/include/pygtk-2.0 -I/usr/include/glib-2.0 -I/usr/lib/glib-2.0/include -pthread -DORBIT2=1 -I/usr/include/gnome-vfs-2.0 -I/usr/lib/gnome-vfs-2.0/include -I/usr/include/gconf/2 -I/usr/include/orbit-2.0 -I/usr/include/glib-2.0 -I/usr/lib/glib-2.0/include -I/usr/include/pyorbit-2 -O2 -march=pentium-m -msse3 -pipe -fomit-frame-pointer -Wall -std=c9x -fno-strict-aliasing -MT gnomevfs_la-vfs-dir-handle.lo -MD -MP -MF .deps/gnomevfs_la-vfs-dir-handle.Tpo -c vfs-dir-handle.c  -fPIC -DPIC -o .libs/gnomevfs_la-vfs-dir-handle.o
make[2]: quittant le rpertoire  /var/tmp/portage/gnome-python-2.12.4/work/gnome-python-2.12.4/gnomevfs
make[1]: *** [all-recursive] Erreur 1
make[1]: quittant le rpertoire  /var/tmp/portage/gnome-python-2.12.4/work/gnome-python-2.12.4
make: *** [all] Erreur 2

!!! ERROR: dev-python/gnome-python-2.12.4 failed.
Call stack:
  ebuild.sh, line 1546:   Called dyn_compile
  ebuild.sh, line 937:   Called src_compile
  ebuild.sh, line 1255:   Called gnome2_src_compile
  gnome2.eclass, line 64:   Called die

!!! compile failure


Mon fichier make.conf :
Code:
CFLAGS="-O2 -march=pentium-m -msse3 -pipe -fomit-frame-pointer"
CHOST="i686-pc-linux-gnu"
CXXFLAGS="${CFLAGS}"

MAKEOPTS="-j3"

GENTOO_MIRRORS="http://ftp.ucsb.edu/pub/mirrors/linux/gentoo/ "

SYNC="rsync://rsync.europe.gentoo.org/gentoo-portage"

LINGUAS="fr fr_FR"

USE="X aac acpi alsa bash-completion bluetooth bzip2 cddb cdparanoia cdr curl dvd dvdr dvdread encode ffmepg flac fortran
gnome gphoto2 gpm gstreamer gtk2 ieee1394 imagemagick jabber java jepg jpeg2k -kde lm_sensors mad matroska mozilla mp3 mpeg mplayer musepack ncurses nls ogg pcmcia pdf png quicktime -seamonkey spell svg tetex tiff truetype vim-syntax vorbis wifi win32codecs xine xml xpm xvid hal"

INPUT_DEVICES="keyboard mouse"
VIDEO_CARDS="i810"


CPU : intel core duo
gcc : 4.1.1-r1

Merci d'avance


Last edited by SnowBear on Thu Nov 30, 2006 2:26 pm; edited 1 time in total
Back to top
View user's profile Send private message
_droop_
l33t
l33t


Joined: 30 May 2004
Posts: 957

PostPosted: Thu Nov 30, 2006 1:15 pm    Post subject: Re: [gnome-python] emerge impossible Reply with quote

SnowBear wrote:

Code:
make[2]: *** [gnomevfs_la-vfsmodule.lo] Erreur 1
make[2]: *** Attente des tches non termines....
...



Salut,

J'ai l'impression que tu n'es pas assez remonté, on ne voit pas vraiment l'erreur.
Back to top
View user's profile Send private message
SnowBear
l33t
l33t


Joined: 03 Sep 2005
Posts: 730
Location: Dax [40]

PostPosted: Thu Nov 30, 2006 1:20 pm    Post subject: Reply with quote

oups ^_^
en voici un peu plus (en espérant quie ça puisse aider) :
Code:
vfsmodule.c: In function 'pygvfs_mime_components_list_new':
vfsmodule.c:1243: error: 'Bonobo_ServerInfo' undeclared (first use in this function)
vfsmodule.c:1243: error: 'component' undeclared (first use in this function)
vfsmodule.c:1251: error: expected expression before ')' token
if /bin/sh ../libtool --tag=CC --mode=compile i686-pc-linux-gnu-gcc -DHAVE_CONFIG_H -I. -I. -I.. -I/usr/include/python2.4
-I/usr/include/pygtk-2.0 -I/usr/include/glib-2.0 -I/usr/lib/glib-2.0/include     -pthread -DORBIT2=1 -I/usr/include/gnome-vfs-2.0 -I/usr/lib/gnome-vfs-2.0/include -I/usr/include/gconf/2 -I/usr/include/orbit-2.0 -I/usr/include/glib-2.0 -I/usr/lib/glib-2.0/include -I/usr/include/pyorbit-2   -O2 -march=pentium-m -msse3 -pipe -fomit-frame-pointer -Wall -std=c9x -fno-strict-aliasing -MT gnomevfs_la-vfs-dir-handle.lo -MD -MP -MF ".deps/gnomevfs_la-vfs-dir-handle.Tpo" -c -o gnomevfs_la-vfs-dir-handle.lo `test -f 'vfs-dir-handle.c' || echo './'`vfs-dir-handle.c; \
        then mv -f ".deps/gnomevfs_la-vfs-dir-handle.Tpo" ".deps/gnomevfs_la-vfs-dir-handle.Plo"; else rm -f ".deps/gnomevfs_la-vfs-dir-handle.Tpo"; exit 1; fi
 i686-pc-linux-gnu-gcc -DHAVE_CONFIG_H -I. -I. -I.. -I/usr/include/python2.4 -I/usr/include/pygtk-2.0 -I/usr/include/glib-2.0 -I/usr/lib/glib-2.0/include -pthread -DORBIT2=1 -I/usr/include/gnome-vfs-2.0 -I/usr/lib/gnome-vfs-2.0/include -I/usr/include/gconf/2 -I/usr/include/orbit-2.0 -I/usr/include/glib-2.0 -I/usr/lib/glib-2.0/include -I/usr/include/pyorbit-2 -O2 -march=pentium-m -msse3 -pipe -fomit-frame-pointer -Wall -std=c9x -fno-strict-aliasing -MT gnomevfs_la-vfs-file-info.lo -MD -MP -MF .deps/gnomevfs_la-vfs-file-info.Tpo -c vfs-file-info.c  -fPIC -DPIC -o .libs/gnomevfs_la-vfs-file-info.o
make[2]: *** [gnomevfs_la-vfsmodule.lo] Erreur 1
make[2]: *** Attente des tches non termines....
 i686-pc-linux-gnu-gcc -DHAVE_CONFIG_H -I. -I. -I.. -I/usr/include/python2.4 -I/usr/include/pygtk-2.0 -I/usr/include/glib-2.0 -I/usr/lib/glib-2.0/include -pthread -DORBIT2=1 -I/usr/include/gnome-vfs-2.0 -I/usr/lib/gnome-vfs-2.0/include -I/usr/include/gconf/2 -I/usr/include/orbit-2.0 -I/usr/include/glib-2.0 -I/usr/lib/glib-2.0/include -I/usr/include/pyorbit-2 -O2 -march=pentium-m -msse3 -pipe -fomit-frame-pointer -Wall -std=c9x -fno-strict-aliasing -MT gnomevfs_la-vfs-dir-handle.lo -MD -MP -MF .deps/gnomevfs_la-vfs-dir-handle.Tpo -c vfs-dir-handle.c  -fPIC -DPIC -o .libs/gnomevfs_la-vfs-dir-handle.o
make[2]: quittant le rpertoire  /var/tmp/portage/gnome-python-2.12.4/work/gnome-python-2.12.4/gnomevfs
make[1]: *** [all-recursive] Erreur 1
make[1]: quittant le rpertoire  /var/tmp/portage/gnome-python-2.12.4/work/gnome-python-2.12.4
make: *** [all] Erreur 2

!!! ERROR: dev-python/gnome-python-2.12.4 failed.
Call stack:
  ebuild.sh, line 1546:   Called dyn_compile
  ebuild.sh, line 937:   Called src_compile
  ebuild.sh, line 1255:   Called gnome2_src_compile
  gnome2.eclass, line 64:   Called die

!!! compile failure
!!! If you need support, post the topmost build error, and the call stack if relevant.


Merci.
Back to top
View user's profile Send private message
kopp
Advocate
Advocate


Joined: 09 Apr 2004
Posts: 2885
Location: Grenoble, France

PostPosted: Thu Nov 30, 2006 2:11 pm    Post subject: Reply with quote

Salut, il semblerait que passer ce paquet en ~x86 résoudrait le problème, d'après ce que j'ai vu sur le forum anglais.
Back to top
View user's profile Send private message
SnowBear
l33t
l33t


Joined: 03 Sep 2005
Posts: 730
Location: Dax [40]

PostPosted: Thu Nov 30, 2006 2:26 pm    Post subject: Reply with quote

Effectivement cela résout le problème, merci


/me devrait penser plus souvent à chercher sur le forum général :/
Back to top
View user's profile Send private message
Display posts from previous:   
Reply to topic    Gentoo Forums Forum Index French All times are GMT
Page 1 of 1

 
Jump to:  
You cannot post new topics in this forum
You cannot reply to topics in this forum
You cannot edit your posts in this forum
You cannot delete your posts in this forum
You cannot vote in polls in this forum