Gentoo Forums
Gentoo Forums
Gentoo Forums
Quick Search: in
Erro ao compilar o engage (E17)
View unanswered posts
View posts from last 24 hours
View posts from last 7 days

 
Reply to topic    Gentoo Forums Forum Index Portuguese
View previous topic :: View next topic  
Author Message
oandarilho01
Tux's lil' helper
Tux's lil' helper


Joined: 17 Nov 2005
Posts: 132
Location: Rio de Janeiro/RJ - Brasil

PostPosted: Wed Aug 30, 2006 1:54 am    Post subject: Erro ao compilar o engage (E17) Reply with quote

Saudações a todos..
estou tentando instalar o E17 (Enlightenment) mas esotu tendo o seguinte problema:

/usr/share/aclocal/pth.m4:43: warning: underquoted definition of _AC_PTH_ERROR
run info '(automake)Extending aclocal'
or see http://sources.redhat.com/automake/automake.html#Extending%20aclocal
/usr/share/aclocal/pth.m4:55: warning: underquoted definition of _AC_PTH_VERBOSE
/usr/share/aclocal/pth.m4:61: warning: underquoted definition of AC_CHECK_PTH
/usr/share/aclocal/ao.m4:9: warning: underquoted definition of XIPH_PATH_AO
configure.in: installing `./install-sh'
configure.in: installing `./missing'
src/Makefile.am: installing `./compile'
src/Makefile.am: installing `./depcomp'
./configure: line 22029: test: : integer expression expected
In file included from e_mod_main.c:5:
e_mod_main.h:88: error: syntax error before "E_Gadman_Client"
e_mod_main.h:88: warning: no semicolon at end of struct or union
e_mod_main.h:99: error: syntax error before '}' token
e_mod_main.c:70: error: syntax error before "E_Gadman_Client"
e_mod_main.c: In function `e_modapi_config':
e_mod_main.c:211: error: dereferencing pointer to incomplete type
e_mod_main.c: In function `_engage_new':
e_mod_main.c:311: error: invalid application of `sizeof' to incomplete type `e_mod_main.h'
e_mod_main.c:316: error: dereferencing pointer to incomplete type
e_mod_main.c:319: error: dereferencing pointer to incomplete type
e_mod_main.c:320: error: dereferencing pointer to incomplete type
e_mod_main.c:321: error: dereferencing pointer to incomplete type
e_mod_main.c:322: error: dereferencing pointer to incomplete type
e_mod_main.c:323: error: dereferencing pointer to incomplete type
e_mod_main.c:324: error: dereferencing pointer to incomplete type
e_mod_main.c:325: error: dereferencing pointer to incomplete type
e_mod_main.c:326: error: dereferencing pointer to incomplete type
e_mod_main.c:327: error: dereferencing pointer to incomplete type
e_mod_main.c:331: error: dereferencing pointer to incomplete type
e_mod_main.c:334: error: dereferencing pointer to incomplete type
e_mod_main.c:334: error: dereferencing pointer to incomplete type
e_mod_main.c:334: error: dereferencing pointer to incomplete type
e_mod_main.c:334: error: dereferencing pointer to incomplete type
e_mod_main.c:335: error: dereferencing pointer to incomplete type
e_mod_main.c:335: error: dereferencing pointer to incomplete type
e_mod_main.c:335: error: dereferencing pointer to incomplete type
e_mod_main.c:335: error: dereferencing pointer to incomplete type
e_mod_main.c:336: error: dereferencing pointer to incomplete type
e_mod_main.c:336: error: dereferencing pointer to incomplete type
e_mod_main.c:336: error: dereferencing pointer to incomplete type
e_mod_main.c:336: error: dereferencing pointer to incomplete type
e_mod_main.c:337: error: dereferencing pointer to incomplete type
e_mod_main.c:337: error: dereferencing pointer to incomplete type
e_mod_main.c:337: error: dereferencing pointer to incomplete type
e_mod_main.c:337: error: dereferencing pointer to incomplete type
e_mod_main.c:338: error: dereferencing pointer to incomplete type
e_mod_main.c:338: error: dereferencing pointer to incomplete type
e_mod_main.c:338: error: dereferencing pointer to incomplete type
e_mod_main.c:338: error: dereferencing pointer to incomplete type
e_mod_main.c:339: error: dereferencing pointer to incomplete type
e_mod_main.c:339: error: dereferencing pointer to incomplete type
e_mod_main.c:339: error: dereferencing pointer to incomplete type
e_mod_main.c:339: error: dereferencing pointer to incomplete type
e_mod_main.c:341: error: dereferencing pointer to incomplete type
e_mod_main.c:352: error: dereferencing pointer to incomplete type
e_mod_main.c:363: error: dereferencing pointer to incomplete type
e_mod_main.c:368: error: dereferencing pointer to incomplete type
e_mod_main.c: In function `_engage_app_change':
e_mod_main.c:466: error: dereferencing pointer to incomplete type
e_mod_main.c:467: error: dereferencing pointer to incomplete type
e_mod_main.c:498: error: dereferencing pointer to incomplete type
e_mod_main.c: In function `_engage_bar_new':
e_mod_main.c:615: error: `E_Gadman_Policy' undeclared (first use in this function)
e_mod_main.c:615: error: (Each undeclared identifier is reported only once
e_mod_main.c:615: error: for each function it appears in.)
e_mod_main.c:615: error: syntax error before "policy"
e_mod_main.c:617: error: dereferencing pointer to incomplete type
e_mod_main.c:617: error: dereferencing pointer to incomplete type
e_mod_main.c:619: error: dereferencing pointer to incomplete type
e_mod_main.c:621: error: dereferencing pointer to incomplete type
e_mod_main.c:623: error: dereferencing pointer to incomplete type
e_mod_main.c:624: error: dereferencing pointer to incomplete type
e_mod_main.c:625: error: dereferencing pointer to incomplete type
e_mod_main.c:627: error: dereferencing pointer to incomplete type
e_mod_main.c:627: error: dereferencing pointer to incomplete type
e_mod_main.c:627: error: dereferencing pointer to incomplete type
e_mod_main.c:627: error: dereferencing pointer to incomplete type
e_mod_main.c:628: error: dereferencing pointer to incomplete type
e_mod_main.c:629: error: dereferencing pointer to incomplete type
e_mod_main.c:630: error: dereferencing pointer to incomplete type
e_mod_main.c:631: error: dereferencing pointer to incomplete type
e_mod_main.c:632: error: dereferencing pointer to incomplete type
e_mod_main.c:633: error: dereferencing pointer to incomplete type
e_mod_main.c:635: error: dereferencing pointer to incomplete type
e_mod_main.c:636: error: dereferencing pointer to incomplete type
e_mod_main.c:637: error: dereferencing pointer to incomplete type
e_mod_main.c:644: error: dereferencing pointer to incomplete type
e_mod_main.c:644: error: dereferencing pointer to incomplete type
e_mod_main.c:646: error: dereferencing pointer to incomplete type
e_mod_main.c:647: error: dereferencing pointer to incomplete type
e_mod_main.c:658: error: dereferencing pointer to incomplete type
e_mod_main.c:663: error: dereferencing pointer to incomplete type
e_mod_main.c:664: error: dereferencing pointer to incomplete type
e_mod_main.c:667: error: dereferencing pointer to incomplete type
e_mod_main.c:669: error: dereferencing pointer to incomplete type
e_mod_main.c:681: error: dereferencing pointer to incomplete type
e_mod_main.c:682: error: dereferencing pointer to incomplete type
e_mod_main.c:684: error: dereferencing pointer to incomplete type
e_mod_main.c:684: warning: implicit declaration of function `e_gadman_client_new'
e_mod_main.c:684: error: dereferencing pointer to incomplete type
e_mod_main.c:685: warning: implicit declaration of function `e_gadman_client_domain_set'
e_mod_main.c:685: error: dereferencing pointer to incomplete type
e_mod_main.c:686: error: `policy' undeclared (first use in this function)
e_mod_main.c:686: error: `E_GADMAN_POLICY_EDGES' undeclared (first use in this function)
e_mod_main.c:686: error: `E_GADMAN_POLICY_HMOVE' undeclared (first use in this function)
e_mod_main.c:686: error: `E_GADMAN_POLICY_VMOVE' undeclared (first use in this function)
e_mod_main.c:687: warning: implicit declaration of function `e_gadman_client_policy_set'
e_mod_main.c:687: error: dereferencing pointer to incomplete type
e_mod_main.c:688: warning: implicit declaration of function `e_gadman_client_min_size_set'
e_mod_main.c:688: error: dereferencing pointer to incomplete type
e_mod_main.c:689: warning: implicit declaration of function `e_gadman_client_max_size_set'
e_mod_main.c:689: error: dereferencing pointer to incomplete type
e_mod_main.c:690: warning: implicit declaration of function `e_gadman_client_auto_size_set'
e_mod_main.c:690: error: dereferencing pointer to incomplete type
e_mod_main.c:691: warning: implicit declaration of function `e_gadman_client_align_set'
e_mod_main.c:691: error: dereferencing pointer to incomplete type
e_mod_main.c:692: warning: implicit declaration of function `e_gadman_client_resize'
e_mod_main.c:692: error: dereferencing pointer to incomplete type
e_mod_main.c:693: warning: implicit declaration of function `e_gadman_client_edge_set'
e_mod_main.c:693: error: dereferencing pointer to incomplete type
e_mod_main.c:693: error: `E_GADMAN_EDGE_BOTTOM' undeclared (first use in this function)
e_mod_main.c:694: warning: implicit declaration of function `e_gadman_client_change_func_set'
e_mod_main.c:694: error: dereferencing pointer to incomplete type
e_mod_main.c:695: warning: implicit declaration of function `e_gadman_client_load'
e_mod_main.c:695: error: dereferencing pointer to incomplete type
e_mod_main.c:699: error: dereferencing pointer to incomplete type
e_mod_main.c:706: error: dereferencing pointer to incomplete type
e_mod_main.c:708: error: dereferencing pointer to incomplete type
e_mod_main.c:710: error: dereferencing pointer to incomplete type
e_mod_main.c:712: error: dereferencing pointer to incomplete type
e_mod_main.c:717: error: dereferencing pointer to incomplete type
e_mod_main.c:723: error: dereferencing pointer to incomplete type
e_mod_main.c:734: error: dereferencing pointer to incomplete type
e_mod_main.c:748: error: dereferencing pointer to incomplete type
e_mod_main.c:748: error: dereferencing pointer to incomplete type
e_mod_main.c: In function `_engage_bar_free':
e_mod_main.c:759: error: dereferencing pointer to incomplete type
e_mod_main.c:760: error: dereferencing pointer to incomplete type
e_mod_main.c:761: error: dereferencing pointer to incomplete type
e_mod_main.c:763: error: dereferencing pointer to incomplete type
e_mod_main.c:764: error: dereferencing pointer to incomplete type
e_mod_main.c:765: error: dereferencing pointer to incomplete type
e_mod_main.c:766: error: dereferencing pointer to incomplete type
e_mod_main.c:768: error: dereferencing pointer to incomplete type
e_mod_main.c:769: error: dereferencing pointer to incomplete type
e_mod_main.c:771: error: dereferencing pointer to incomplete type
e_mod_main.c:772: error: dereferencing pointer to incomplete type
e_mod_main.c:773: error: dereferencing pointer to incomplete type
e_mod_main.c:777: warning: implicit declaration of function `e_gadman_client_save'
e_mod_main.c:777: error: dereferencing pointer to incomplete type
e_mod_main.c:778: error: dereferencing pointer to incomplete type
e_mod_main.c:780: error: dereferencing pointer to incomplete type
e_mod_main.c:780: error: dereferencing pointer to incomplete type
e_mod_main.c:782: error: dereferencing pointer to incomplete type
e_mod_main.c:783: error: dereferencing pointer to incomplete type
e_mod_main.c:784: error: dereferencing pointer to incomplete type
e_mod_main.c:785: error: dereferencing pointer to incomplete type
e_mod_main.c:787: error: dereferencing pointer to incomplete type
e_mod_main.c:789: error: dereferencing pointer to incomplete type
e_mod_main.c:790: error: dereferencing pointer to incomplete type
e_mod_main.c:792: error: dereferencing pointer to incomplete type
e_mod_main.c: In function `_engage_bar_menu_gen':
e_mod_main.c:806: error: dereferencing pointer to incomplete type
e_mod_main.c:825: error: dereferencing pointer to incomplete type
e_mod_main.c:840: error: dereferencing pointer to incomplete type
e_mod_main.c:842: error: dereferencing pointer to incomplete type
e_mod_main.c:848: error: dereferencing pointer to incomplete type
e_mod_main.c:863: error: dereferencing pointer to incomplete type
e_mod_main.c:868: error: dereferencing pointer to incomplete type
e_mod_main.c:874: error: dereferencing pointer to incomplete type
e_mod_main.c:878: error: dereferencing pointer to incomplete type
e_mod_main.c:886: error: dereferencing pointer to incomplete type
e_mod_main.c:894: error: dereferencing pointer to incomplete type
e_mod_main.c:901: error: dereferencing pointer to incomplete type
e_mod_main.c:901: error: dereferencing pointer to incomplete type
e_mod_main.c:905: error: dereferencing pointer to incomplete type
e_mod_main.c:906: error: dereferencing pointer to incomplete type
e_mod_main.c:907: error: dereferencing pointer to incomplete type
e_mod_main.c:917: error: dereferencing pointer to incomplete type
e_mod_main.c:927: error: dereferencing pointer to incomplete type
e_mod_main.c:933: error: dereferencing pointer to incomplete type
e_mod_main.c:936: error: dereferencing pointer to incomplete type
e_mod_main.c:945: error: dereferencing pointer to incomplete type
e_mod_main.c: In function `_engage_bar_enable':
e_mod_main.c:962: error: dereferencing pointer to incomplete type
e_mod_main.c:963: error: dereferencing pointer to incomplete type
e_mod_main.c:964: error: dereferencing pointer to incomplete type
e_mod_main.c:965: error: dereferencing pointer to incomplete type
e_mod_main.c:966: error: dereferencing pointer to incomplete type
e_mod_main.c: In function `_engage_bar_disable':
e_mod_main.c:973: error: dereferencing pointer to incomplete type
e_mod_main.c:975: error: dereferencing pointer to incomplete type
e_mod_main.c:976: error: dereferencing pointer to incomplete type
e_mod_main.c:977: error: dereferencing pointer to incomplete type
e_mod_main.c: In function `_engage_icon_new':
e_mod_main.c:996: error: dereferencing pointer to incomplete type
e_mod_main.c:996: error: dereferencing pointer to incomplete type
e_mod_main.c:998: error: dereferencing pointer to incomplete type
e_mod_main.c:1010: error: dereferencing pointer to incomplete type
e_mod_main.c:1011: error: dereferencing pointer to incomplete type
e_mod_main.c:1023: error: dereferencing pointer to incomplete type
e_mod_main.c:1032: error: dereferencing pointer to incomplete type
e_mod_main.c:1035: warning: implicit declaration of function `e_gadman_client_edge_get'
e_mod_main.c:1035: error: dereferencing pointer to incomplete type
e_mod_main.c: In function `_engage_icon_free':
e_mod_main.c:1043: error: dereferencing pointer to incomplete type
e_mod_main.c:1043: error: dereferencing pointer to incomplete type
e_mod_main.c: In function `_engage_icon_find':
e_mod_main.c:1066: error: dereferencing pointer to incomplete type
e_mod_main.c: In function `_engage_app_icon_new':
e_mod_main.c:1099: error: dereferencing pointer to incomplete type
e_mod_main.c:1109: error: dereferencing pointer to incomplete type
e_mod_main.c:1120: error: dereferencing pointer to incomplete type
e_mod_main.c:1126: error: dereferencing pointer to incomplete type
e_mod_main.c:1126: error: dereferencing pointer to incomplete type
e_mod_main.c: In function `_engage_cb_event_dnd_position':
e_mod_main.c:1219: warning: implicit declaration of function `e_gadman_client_geometry_get'
e_mod_main.c:1219: error: dereferencing pointer to incomplete type
e_mod_main.c: In function `_engage_cb_event_dnd_selection':
e_mod_main.c:1265: error: dereferencing pointer to incomplete type
e_mod_main.c: In function `_engage_cb_border_add':
e_mod_main.c:1279: error: dereferencing pointer to incomplete type
e_mod_main.c: In function `_engage_cb_event_border_remove':
e_mod_main.c:1356: error: dereferencing pointer to incomplete type
e_mod_main.c: In function `_engage_cb_event_border_iconify':
e_mod_main.c:1407: error: dereferencing pointer to incomplete type
e_mod_main.c: In function `_engage_cb_event_border_uniconify':
e_mod_main.c:1459: error: dereferencing pointer to incomplete type
e_mod_main.c: In function `_engage_icon_reorder_after':
e_mod_main.c:1509: error: dereferencing pointer to incomplete type
e_mod_main.c:1509: error: dereferencing pointer to incomplete type
e_mod_main.c:1511: error: dereferencing pointer to incomplete type
e_mod_main.c:1511: error: dereferencing pointer to incomplete type
e_mod_main.c:1513: error: dereferencing pointer to incomplete type
e_mod_main.c:1513: error: dereferencing pointer to incomplete type
e_mod_main.c: In function `_engage_bar_layout':
e_mod_main.c:1524: error: dereferencing pointer to incomplete type
e_mod_main.c:1526: error: dereferencing pointer to incomplete type
e_mod_main.c:1527: error: dereferencing pointer to incomplete type
e_mod_main.c:1528: error: dereferencing pointer to incomplete type
e_mod_main.c:1533: error: dereferencing pointer to incomplete type
e_mod_main.c:1533: error: dereferencing pointer to incomplete type
e_mod_main.c:1535: error: `E_GADMAN_EDGE_LEFT' undeclared (first use in this function)
e_mod_main.c:1535: error: `E_GADMAN_EDGE_RIGHT' undeclared (first use in this function)
e_mod_main.c:1536: error: dereferencing pointer to incomplete type
e_mod_main.c:1538: error: dereferencing pointer to incomplete type
e_mod_main.c: In function `_engage_bar_frame_resize':
e_mod_main.c:1549: error: dereferencing pointer to incomplete type
e_mod_main.c:1552: error: dereferencing pointer to incomplete type
e_mod_main.c:1554: error: dereferencing pointer to incomplete type
e_mod_main.c:1555: error: `E_GADMAN_EDGE_LEFT' undeclared (first use in this function)
e_mod_main.c:1555: error: `E_GADMAN_EDGE_RIGHT' undeclared (first use in this function)
e_mod_main.c:1557: error: dereferencing pointer to incomplete type
e_mod_main.c:1558: error: dereferencing pointer to incomplete type
e_mod_main.c:1558: error: dereferencing pointer to incomplete type
e_mod_main.c:1562: error: dereferencing pointer to incomplete type
e_mod_main.c:1562: error: dereferencing pointer to incomplete type
e_mod_main.c:1563: error: dereferencing pointer to incomplete type
e_mod_main.c:1567: error: dereferencing pointer to incomplete type
e_mod_main.c:1567: error: dereferencing pointer to incomplete type
e_mod_main.c:1569: error: dereferencing pointer to incomplete type
e_mod_main.c:1570: error: dereferencing pointer to incomplete type
e_mod_main.c:1571: error: dereferencing pointer to incomplete type
e_mod_main.c:1571: error: dereferencing pointer to incomplete type
e_mod_main.c:1574: error: dereferencing pointer to incomplete type
e_mod_main.c:1575: error: dereferencing pointer to incomplete type
e_mod_main.c:1578: error: dereferencing pointer to incomplete type
e_mod_main.c: In function `_engage_bar_edge_change':
e_mod_main.c:1587: error: `E_Gadman_Policy' undeclared (first use in this function)
e_mod_main.c:1587: error: syntax error before "policy"
e_mod_main.c:1589: error: dereferencing pointer to incomplete type
e_mod_main.c:1590: error: dereferencing pointer to incomplete type
e_mod_main.c:1595: error: dereferencing pointer to incomplete type
e_mod_main.c:1596: error: dereferencing pointer to incomplete type
e_mod_main.c:1596: error: dereferencing pointer to incomplete type
e_mod_main.c:1597: error: dereferencing pointer to incomplete type
e_mod_main.c:1597: error: dereferencing pointer to incomplete type
e_mod_main.c:1598: error: dereferencing pointer to incomplete type
e_mod_main.c:1598: error: dereferencing pointer to incomplete type
e_mod_main.c:1599: error: dereferencing pointer to incomplete type
e_mod_main.c:1599: error: dereferencing pointer to incomplete type
e_mod_main.c:1600: error: dereferencing pointer to incomplete type
e_mod_main.c:1601: error: dereferencing pointer to incomplete type
e_mod_main.c:1601: error: dereferencing pointer to incomplete type
e_mod_main.c:1605: error: dereferencing pointer to incomplete type
e_mod_main.c:1616: error: dereferencing pointer to incomplete type
e_mod_main.c:1617: error: dereferencing pointer to incomplete type
e_mod_main.c:1619: error: `policy' undeclared (first use in this function)
e_mod_main.c:1619: error: `E_GADMAN_POLICY_EDGES' undeclared (first use in this function)
e_mod_main.c:1619: error: `E_GADMAN_POLICY_HMOVE' undeclared (first use in this function)
e_mod_main.c:1619: error: `E_GADMAN_POLICY_VMOVE' undeclared (first use in this function)
e_mod_main.c:1620: error: `E_GADMAN_EDGE_BOTTOM' undeclared (first use in this function)
e_mod_main.c:1621: error: `E_GADMAN_EDGE_TOP' undeclared (first use in this function)
e_mod_main.c:1623: error: `E_GADMAN_POLICY_VSIZE' undeclared (first use in this function)
e_mod_main.c:1624: error: dereferencing pointer to incomplete type
e_mod_main.c:1625: error: dereferencing pointer to incomplete type
e_mod_main.c:1626: error: dereferencing pointer to incomplete type
e_mod_main.c:1626: error: dereferencing pointer to incomplete type
e_mod_main.c:1627: error: dereferencing pointer to incomplete type
e_mod_main.c:1631: error: `E_GADMAN_EDGE_LEFT' undeclared (first use in this function)
e_mod_main.c:1632: error: `E_GADMAN_EDGE_RIGHT' undeclared (first use in this function)
e_mod_main.c:1634: error: `E_GADMAN_POLICY_HSIZE' undeclared (first use in this function)
e_mod_main.c:1635: error: dereferencing pointer to incomplete type
e_mod_main.c:1636: error: dereferencing pointer to incomplete type
e_mod_main.c:1637: error: dereferencing pointer to incomplete type
e_mod_main.c:1637: error: dereferencing pointer to incomplete type
e_mod_main.c:1638: error: dereferencing pointer to incomplete type
e_mod_main.c:1643: error: dereferencing pointer to incomplete type
e_mod_main.c: In function `_engage_bar_update_policy':
e_mod_main.c:1651: error: `E_Gadman_Policy' undeclared (first use in this function)
e_mod_main.c:1651: error: syntax error before "policy"
e_mod_main.c:1653: error: `policy' undeclared (first use in this function)
e_mod_main.c:1653: error: `E_GADMAN_POLICY_EDGES' undeclared (first use in this function)
e_mod_main.c:1653: error: `E_GADMAN_POLICY_HMOVE' undeclared (first use in this function)
e_mod_main.c:1653: error: `E_GADMAN_POLICY_VMOVE' undeclared (first use in this function)
e_mod_main.c:1654: error: dereferencing pointer to incomplete type
e_mod_main.c:1654: error: `E_GADMAN_EDGE_BOTTOM' undeclared (first use in this function)
e_mod_main.c:1655: error: dereferencing pointer to incomplete type
e_mod_main.c:1655: error: `E_GADMAN_EDGE_TOP' undeclared (first use in this function)
e_mod_main.c:1657: error: `E_GADMAN_POLICY_VSIZE' undeclared (first use in this function)
e_mod_main.c:1658: error: dereferencing pointer to incomplete type
e_mod_main.c:1660: error: dereferencing pointer to incomplete type
e_mod_main.c:1660: error: `E_GADMAN_EDGE_LEFT' undeclared (first use in this function)
e_mod_main.c:1661: error: dereferencing pointer to incomplete type
e_mod_main.c:1661: error: `E_GADMAN_EDGE_RIGHT' undeclared (first use in this function)
e_mod_main.c:1663: error: `E_GADMAN_POLICY_HSIZE' undeclared (first use in this function)
e_mod_main.c:1664: error: dereferencing pointer to incomplete type
e_mod_main.c: In function `_engage_bar_motion_handle':
e_mod_main.c:1676: error: `E_Gadman_Edge' undeclared (first use in this function)
e_mod_main.c:1676: error: syntax error before "edge"
e_mod_main.c:1678: error: dereferencing pointer to incomplete type
e_mod_main.c:1688: error: dereferencing pointer to incomplete type
e_mod_main.c:1693: error: `edge' undeclared (first use in this function)
e_mod_main.c:1693: error: dereferencing pointer to incomplete type
e_mod_main.c:1694: error: `E_GADMAN_EDGE_LEFT' undeclared (first use in this function)
e_mod_main.c:1694: error: `E_GADMAN_EDGE_RIGHT' undeclared (first use in this function)
e_mod_main.c:1695: error: dereferencing pointer to incomplete type
e_mod_main.c:1697: error: dereferencing pointer to incomplete type
e_mod_main.c:1711: error: `E_GADMAN_EDGE_TOP' undeclared (first use in this function)
e_mod_main.c:1717: error: dereferencing pointer to incomplete type
e_mod_main.c:1719: error: dereferencing pointer to incomplete type
e_mod_main.c:1720: error: dereferencing pointer to incomplete type
e_mod_main.c:1730: error: dereferencing pointer to incomplete type
e_mod_main.c:1731: error: dereferencing pointer to incomplete type
e_mod_main.c:1731: error: dereferencing pointer to incomplete type
e_mod_main.c:1733: error: dereferencing pointer to incomplete type
e_mod_main.c:1736: error: dereferencing pointer to incomplete type
e_mod_main.c:1745: error: dereferencing pointer to incomplete type
e_mod_main.c:1747: error: dereferencing pointer to incomplete type
e_mod_main.c:1750: error: dereferencing pointer to incomplete type
e_mod_main.c:1781: error: dereferencing pointer to incomplete type
e_mod_main.c:1782: error: dereferencing pointer to incomplete type
e_mod_main.c:1787: error: dereferencing pointer to incomplete type
e_mod_main.c:1923: error: dereferencing pointer to incomplete type
e_mod_main.c: In function `_engage_bar_zoom_factor_set':
e_mod_main.c:1931: error: dereferencing pointer to incomplete type
e_mod_main.c: In function `_engage_bar_zoom_duration_set':
e_mod_main.c:1938: error: dereferencing pointer to incomplete type
e_mod_main.c: In function `_engage_bar_cb_intercept_move':
e_mod_main.c:2009: error: dereferencing pointer to incomplete type
e_mod_main.c: In function `_engage_bar_cb_intercept_resize':
e_mod_main.c:2017: error: `E_Gadman_Edge' undeclared (first use in this function)
e_mod_main.c:2017: error: syntax error before "edge"
e_mod_main.c:2020: error: dereferencing pointer to incomplete type
e_mod_main.c:2020: error: dereferencing pointer to incomplete type
e_mod_main.c:2024: error: dereferencing pointer to incomplete type
e_mod_main.c:2025: error: dereferencing pointer to incomplete type
e_mod_main.c:2027: error: dereferencing pointer to incomplete type
e_mod_main.c:2028: error: `edge' undeclared (first use in this function)
e_mod_main.c:2028: error: dereferencing pointer to incomplete type
e_mod_main.c:2030: error: `E_GADMAN_EDGE_BOTTOM' undeclared (first use in this function)
e_mod_main.c: In function `_engage_app_icon_cb_mouse_down':
e_mod_main.c:2050: error: dereferencing pointer to incomplete type
e_mod_main.c:2059: error: dereferencing pointer to incomplete type
e_mod_main.c: In function `_engage_icon_cb_mouse_in':
e_mod_main.c:2098: error: dereferencing pointer to incomplete type
e_mod_main.c:2101: error: dereferencing pointer to incomplete type
e_mod_main.c: In function `_engage_icon_cb_mouse_down':
e_mod_main.c:2128: error: dereferencing pointer to incomplete type
e_mod_main.c:2132: error: dereferencing pointer to incomplete type
e_mod_main.c:2139: error: dereferencing pointer to incomplete type
e_mod_main.c:2139: error: dereferencing pointer to incomplete type
e_mod_main.c:2142: error: dereferencing pointer to incomplete type
e_mod_main.c: In function `_engage_icon_cb_mouse_wheel':
e_mod_main.c:2200: error: dereferencing pointer to incomplete type
e_mod_main.c: In function `_engage_bar_cb_mouse_in':
e_mod_main.c:2213: error: `E_Gadman_Edge' undeclared (first use in this function)
e_mod_main.c:2213: error: syntax error before "edge"
e_mod_main.c:2219: error: dereferencing pointer to incomplete type
e_mod_main.c:2223: error: dereferencing pointer to incomplete type
e_mod_main.c:2224: error: `edge' undeclared (first use in this function)
e_mod_main.c:2224: error: dereferencing pointer to incomplete type
e_mod_main.c:2226: error: dereferencing pointer to incomplete type
e_mod_main.c:2227: error: dereferencing pointer to incomplete type
e_mod_main.c:2227: error: dereferencing pointer to incomplete type
e_mod_main.c:2232: error: dereferencing pointer to incomplete type
e_mod_main.c:2233: error: `E_GADMAN_EDGE_LEFT' undeclared (first use in this function)
e_mod_main.c:2235: error: dereferencing pointer to incomplete type
e_mod_main.c:2237: error: `E_GADMAN_EDGE_RIGHT' undeclared (first use in this function)
e_mod_main.c:2239: error: dereferencing pointer to incomplete type
e_mod_main.c:2240: error: dereferencing pointer to incomplete type
e_mod_main.c:2242: error: `E_GADMAN_EDGE_TOP' undeclared (first use in this function)
e_mod_main.c:2244: error: dereferencing pointer to incomplete type
e_mod_main.c:2248: error: dereferencing pointer to incomplete type
e_mod_main.c:2249: error: dereferencing pointer to incomplete type
e_mod_main.c:2251: error: dereferencing pointer to incomplete type
e_mod_main.c: In function `_engage_bar_cb_mouse_out':
e_mod_main.c:2264: error: dereferencing pointer to incomplete type
e_mod_main.c:2268: error: dereferencing pointer to incomplete type
e_mod_main.c: In function `_engage_zoom_in_slave':
e_mod_main.c:2279: error: dereferencing pointer to incomplete type
e_mod_main.c:2281: error: dereferencing pointer to incomplete type
e_mod_main.c:2284: error: dereferencing pointer to incomplete type
e_mod_main.c:2286: error: dereferencing pointer to incomplete type
e_mod_main.c:2287: error: dereferencing pointer to incomplete type
e_mod_main.c:2289: error: dereferencing pointer to incomplete type
e_mod_main.c:2291: error: dereferencing pointer to incomplete type
e_mod_main.c:2292: error: dereferencing pointer to incomplete type
e_mod_main.c:2293: error: dereferencing pointer to incomplete type
e_mod_main.c:2293: error: dereferencing pointer to incomplete type
e_mod_main.c:2294: error: dereferencing pointer to incomplete type
e_mod_main.c:2294: error: dereferencing pointer to incomplete type
e_mod_main.c:2297: error: dereferencing pointer to incomplete type
e_mod_main.c:2297: error: dereferencing pointer to incomplete type
e_mod_main.c:2298: error: dereferencing pointer to incomplete type
e_mod_main.c:2299: error: dereferencing pointer to incomplete type
e_mod_main.c:2301: error: dereferencing pointer to incomplete type
e_mod_main.c:2302: error: dereferencing pointer to incomplete type
e_mod_main.c:2302: error: dereferencing pointer to incomplete type
e_mod_main.c:2304: error: dereferencing pointer to incomplete type
e_mod_main.c:2304: error: dereferencing pointer to incomplete type
e_mod_main.c:2305: error: dereferencing pointer to incomplete type
e_mod_main.c: In function `_engage_zoom_out_slave':
e_mod_main.c:2320: error: dereferencing pointer to incomplete type
e_mod_main.c:2322: error: dereferencing pointer to incomplete type
e_mod_main.c:2325: error: dereferencing pointer to incomplete type
e_mod_main.c:2327: error: dereferencing pointer to incomplete type
e_mod_main.c:2328: error: dereferencing pointer to incomplete type
e_mod_main.c:2330: error: dereferencing pointer to incomplete type
e_mod_main.c:2332: error: dereferencing pointer to incomplete type
e_mod_main.c:2333: error: dereferencing pointer to incomplete type
e_mod_main.c:2334: error: dereferencing pointer to incomplete type
e_mod_main.c:2334: error: dereferencing pointer to incomplete type
e_mod_main.c:2334: error: dereferencing pointer to incomplete type
e_mod_main.c:2335: error: dereferencing pointer to incomplete type
e_mod_main.c:2335: error: dereferencing pointer to incomplete type
e_mod_main.c:2338: error: dereferencing pointer to incomplete type
e_mod_main.c:2338: error: dereferencing pointer to incomplete type
e_mod_main.c:2339: error: dereferencing pointer to incomplete type
e_mod_main.c:2339: error: dereferencing pointer to incomplete type
e_mod_main.c:2341: error: dereferencing pointer to incomplete type
e_mod_main.c:2342: error: dereferencing pointer to incomplete type
e_mod_main.c:2344: error: dereferencing pointer to incomplete type
e_mod_main.c:2345: error: dereferencing pointer to incomplete type
e_mod_main.c:2346: error: dereferencing pointer to incomplete type
e_mod_main.c:2347: error: dereferencing pointer to incomplete type
e_mod_main.c:2348: error: dereferencing pointer to incomplete type
e_mod_main.c:2349: error: dereferencing pointer to incomplete type
e_mod_main.c:2351: error: dereferencing pointer to incomplete type
e_mod_main.c: At top level:
e_mod_main.c:2400: error: syntax error before "E_Gadman_Client"
e_mod_main.c: In function `_engage_bar_cb_gmc_change':
e_mod_main.c:2405: error: `data' undeclared (first use in this function)
e_mod_main.c:2406: error: `change' undeclared (first use in this function)
e_mod_main.c:2408: error: `E_GADMAN_CHANGE_MOVE_RESIZE' undeclared (first use in this function)
e_mod_main.c:2409: error: dereferencing pointer to incomplete type
e_mod_main.c:2409: error: dereferencing pointer to incomplete type
e_mod_main.c:2409: error: dereferencing pointer to incomplete type
e_mod_main.c:2409: error: dereferencing pointer to incomplete type
e_mod_main.c:2409: error: dereferencing pointer to incomplete type
e_mod_main.c:2411: error: dereferencing pointer to incomplete type
e_mod_main.c:2412: error: `E_GADMAN_EDGE_TOP' undeclared (first use in this function)
e_mod_main.c:2412: error: `E_GADMAN_EDGE_BOTTOM' undeclared (first use in this function)
e_mod_main.c:2413: error: dereferencing pointer to incomplete type
e_mod_main.c:2413: error: dereferencing pointer to incomplete type
e_mod_main.c:2413: error: dereferencing pointer to incomplete type
e_mod_main.c:2415: error: dereferencing pointer to incomplete type
e_mod_main.c:2415: error: dereferencing pointer to incomplete type
e_mod_main.c:2415: error: dereferencing pointer to incomplete type
e_mod_main.c:2417: error: dereferencing pointer to incomplete type
e_mod_main.c:2417: error: dereferencing pointer to incomplete type
e_mod_main.c:2417: error: dereferencing pointer to incomplete type
e_mod_main.c:2418: error: dereferencing pointer to incomplete type
e_mod_main.c:2418: error: dereferencing pointer to incomplete type
e_mod_main.c:2418: error: dereferencing pointer to incomplete type
e_mod_main.c:2421: error: `E_GADMAN_CHANGE_EDGE' undeclared (first use in this function)
e_mod_main.c:2422: error: dereferencing pointer to incomplete type
e_mod_main.c:2424: error: `E_GADMAN_CHANGE_RAISE' undeclared (first use in this function)
e_mod_main.c:2425: error: `E_GADMAN_CHANGE_ZONE' undeclared (first use in this function)
e_mod_main.c: In function `_engage_bar_cb_menu_enabled':
e_mod_main.c:2441: error: dereferencing pointer to incomplete type
e_mod_main.c:2445: error: dereferencing pointer to incomplete type
e_mod_main.c: In function `_engage_bar_cb_menu_edit':
e_mod_main.c:2457: warning: implicit declaration of function `e_gadman_mode_set'
e_mod_main.c:2457: error: dereferencing pointer to incomplete type
e_mod_main.c:2457: error: `E_GADMAN_MODE_EDIT' undeclared (first use in this function)
e_mod_main.c: In function `_engage_bar_cb_menu_configure':
e_mod_main.c:2468: error: dereferencing pointer to incomplete type
e_mod_main.c: In function `_engage_bar_cb_menu_zoom':
e_mod_main.c:2477: error: dereferencing pointer to incomplete type
e_mod_main.c: In function `_engage_bar_cb_menu_zoom_stretch':
e_mod_main.c:2487: error: dereferencing pointer to incomplete type
e_mod_main.c: In function `_engage_bar_cb_menu_tray':
e_mod_main.c:2498: error: dereferencing pointer to incomplete type
e_mod_main.c: In function `_engage_bar_cb_menu_edit_icon':
e_mod_main.c:2511: error: dereferencing pointer to incomplete type
e_mod_main.c:2511: error: dereferencing pointer to incomplete type
e_mod_main.c: In function `_engage_bar_cb_menu_keep_icon':
e_mod_main.c:2521: error: dereferencing pointer to incomplete type
e_mod_main.c:2522: error: dereferencing pointer to incomplete type
e_mod_main.c: In function `_engage_bar_cb_menu_remove_icon':
e_mod_main.c:2532: error: dereferencing pointer to incomplete type
e_mod_main.c:2533: error: dereferencing pointer to incomplete type
e_mod_main.c: In function `_engage_bar_cb_menu_context_change':
e_mod_main.c:2550: error: dereferencing pointer to incomplete type
e_mod_main.c: In function `_engage_zoom_function':
e_mod_main.c:2633: error: dereferencing pointer to incomplete type
e_mod_main.c:2633: error: dereferencing pointer to incomplete type
e_mod_main.c:2634: error: dereferencing pointer to incomplete type
e_mod_main.c:2635: error: dereferencing pointer to incomplete type
e_mod_main.c:2651: error: dereferencing pointer to incomplete type
e_mod_main.c:2653: error: dereferencing pointer to incomplete type
e_mod_main.c:2660: error: dereferencing pointer to incomplete type
e_mod_main.c:2660: error: dereferencing pointer to incomplete type
e_mod_main.c:2663: error: dereferencing pointer to incomplete type
e_mod_main.c:2665: error: dereferencing pointer to incomplete type
e_mod_main.c:2666: error: dereferencing pointer to incomplete type
e_mod_main.c:2666: error: dereferencing pointer to incomplete type
e_mod_main.c:2672: error: dereferencing pointer to incomplete type
e_mod_main.c:2674: error: dereferencing pointer to incomplete type
e_mod_main.c:2675: error: dereferencing pointer to incomplete type
e_mod_main.c:2675: error: dereferencing pointer to incomplete type
make[3]: *** [e_mod_main.lo] Error 1
make[2]: *** [all-recursive] Error 1
make[1]: *** [all-recursive] Error 1
make: *** [all] Error 2

!!! ERROR: x11-misc/engage-9999 failed.
Call stack:
ebuild.sh, line 1539: Called dyn_compile
ebuild.sh, line 939: Called src_compile
engage-9999.ebuild, line 23: Called enlightenment_src_compile
enlightenment.eclass, line 153: Called enlightenment_die 'emake failed'
enlightenment.eclass, line 100: Called die


Alguma idéia? Já instalei boa parte dos pacotes.. segue o meu portage.keywords, de uma sugestão que peguei da Linux Magazine:
Code:
#e17 cvs stuff
app-misc/evidence -*
app-misc/examine -*
app-misc/enotes -*
dev-db/edb -*
dev-libs/eet -*
dev-libs/embryo -*
dev-libs/engrave -*
dev-util/e_utils -*
mail-client/embrace -*
media-gfx/eclips -*
media-gfx/elicit -*
media-gfx/entice -*
media-gfx/imlib_tools ~x86
media-libs/edje -*
media-libs/emotion -*
media-libs/epeg -*
media-libs/epsilon -*
media-libs/etox -*
media-libs/imlib2 -*
media-libs/imlib2_loaders -*
media-libs/xine-lib
media-video/eclair -*
media-video/envision -*
media-video/elation -*
net-news/erss -*
sci-calculators/equate -*
sys-fs/evfs -*
x11-libs/ecore -*
x11-libs/esmart -*
x11-libs/evas -*
x11-libs/ewl -*
x11-misc/e17genmenu -*
x11-misc/engage -*
x11-misc/entrance -*
x11-misc/iconbar -*
x11-plugins/e_modules -*
x11-terms/eterm -*
x11-terms/enterminus -*
x11-wm/e -*


Está sendo instalado mais ou menos nesta ordem.. Não entendi muito bem o motivo de ter falhado neste pacote..
Back to top
View user's profile Send private message
oandarilho01
Tux's lil' helper
Tux's lil' helper


Joined: 17 Nov 2005
Posts: 132
Location: Rio de Janeiro/RJ - Brasil

PostPosted: Wed Aug 30, 2006 2:03 am    Post subject: Reply with quote

(eita mania de postar e responder..)

Bem, vou tentar continuar a instalação omitindo o pacote [gwn=]engage[/gwn] e ver se funcionará..
Back to top
View user's profile Send private message
MetalGod
Bodhisattva
Bodhisattva


Joined: 10 Mar 2003
Posts: 816
Location: Portugal

PostPosted: Wed Aug 30, 2006 2:43 am    Post subject: Reply with quote

ja leste a info do e0.17 ? Os ebuilds sao livecvs ou seja faz o download do cvs oficial do projecto. Isto e'... pode nao funcionar hoje e funcionar amanhã. 8)
Sugiro faças a instalaçao outro dia ou que procures nas mailing lists oficiais do enlightenment.
_________________
ex: Gentoo Linux Developer: amd64 media-optical sound gnome
ex: Portuguese Moderator
------------------------------------------------------------------------------
God Doesn't Play Dice
Back to top
View user's profile Send private message
oandarilho01
Tux's lil' helper
Tux's lil' helper


Joined: 17 Nov 2005
Posts: 132
Location: Rio de Janeiro/RJ - Brasil

PostPosted: Wed Aug 30, 2006 12:13 pm    Post subject: Reply with quote

Unm.. talvez..
Bem, estou seguindo instalando os demais pacotes, vamos ver se funciona no fim das contas.. assim que acabar tudo (tive que parar para vir para o trabalho :? )
Back to top
View user's profile Send private message
Ariem
Apprentice
Apprentice


Joined: 13 Jun 2005
Posts: 296
Location: reykjavik

PostPosted: Wed Aug 30, 2006 1:58 pm    Post subject: Reply with quote

Desde o dia 20 de Agosto que algumas das apps do E17 geram erros ao compilar.
O melhor que tens a fazer é, ou usar a versão de 19 de Agosto, ou esperar mais uns tempos (horas/dias).

EDIT: lista de módulos que não funcionam desde o dia 20 de Agosto: calendar, cpu, eloquence, engage, devian, evolume, wlan.
Back to top
View user's profile Send private message
Display posts from previous:   
Reply to topic    Gentoo Forums Forum Index Portuguese All times are GMT
Page 1 of 1

 
Jump to:  
You cannot post new topics in this forum
You cannot reply to topics in this forum
You cannot edit your posts in this forum
You cannot delete your posts in this forum
You cannot vote in polls in this forum