Gentoo Forums
Gentoo Forums
Gentoo Forums
Quick Search: in
mozilla-thunderbird emerge failed
View unanswered posts
View posts from last 24 hours

 
Reply to topic    Gentoo Forums Forum Index Duplicate Threads
View previous topic :: View next topic  
Author Message
hellstr0m
n00b
n00b


Joined: 01 Nov 2005
Posts: 43

PostPosted: Sat Aug 19, 2006 3:01 pm    Post subject: mozilla-thunderbird emerge failed Reply with quote

Hi.. I'm getting an error on mozilla-thunderbird during:
Code:
emerge -uDNv world


Here's the error:

Quote:

gmake[4]: Entering directory `/var/tmp/portage/mozilla-thunderbird-1.5.0.5/work/mozilla/xpfe/components/sidebar/public'
nsISidebar.idl
../../../../dist/bin/xpidl -m typelib -w -I ../../../../dist/idl -I. -o _xpidlgen/nsISidebar nsISidebar.idl
../../../../dist/bin/xpt_link _xpidlgen/sidebar.xpt _xpidlgen/nsISidebar.xpt
/var/tmp/portage/mozilla-thunderbird-1.5.0.5/work/mozilla/config/nsinstall -R -m 644 _xpidlgen/sidebar.xpt ../../../../dist/bin/components
gmake[4]: Leaving directory `/var/tmp/portage/mozilla-thunderbird-1.5.0.5/work/mozilla/xpfe/components/sidebar/public'
gmake[4]: Entering directory `/var/tmp/portage/mozilla-thunderbird-1.5.0.5/work/mozilla/xpfe/components/bookmarks/public'
nsIBookmarksService.idl
../../../../dist/bin/xpidl -m typelib -w -I ../../../../dist/idl -I. -o _xpidlgen/nsIBookmarksService nsIBookmarksService.idl
../../../../dist/bin/xpt_link _xpidlgen/bookmarks.xpt _xpidlgen/nsIBookmarksService.xpt
/var/tmp/portage/mozilla-thunderbird-1.5.0.5/work/mozilla/config/nsinstall -R -m 644 _xpidlgen/bookmarks.xpt ../../../../dist/bin/components
gmake[4]: Leaving directory `/var/tmp/portage/mozilla-thunderbird-1.5.0.5/work/mozilla/xpfe/components/bookmarks/public'
gmake[4]: Entering directory `/var/tmp/portage/mozilla-thunderbird-1.5.0.5/work/mozilla/xpfe/components/build2'
nsModule.cpp
i686-pc-linux-gnu-g++ -o nsModule.o -c -fvisibility=hidden -fvisibility-inlines-hidden -DMOZILLA_INTERNAL_API -DOSTYPE=\"Linux2.6\" -DOSARCH=\"Linux\" -DBUILD_ID=2006081912 -I./../windowds -I./../../browser/src -I./../download-manager/src -I./../autocomplete/src -I../../../dist/include/xpcom -I../../../dist/include/string -I../../../dist/include/content -I../../../dist/include/rdf -I../../../dist/include/necko -I../../../dist/include/necko2 -I../../../dist/include/nkcache -I../../../dist/include/intl -I../../../dist/include/locale -I../../../dist/include/mork -I../../../dist/include/widget -I../../../dist/include/dom -I../../../dist/include/uriloader -I../../../dist/include/mimetype -I../../../dist/include/webbrowserpersist -I../../../dist/include/progressDlg -I../../../dist/include/pref -I../../../dist/include/docshell -I../../../dist/include/webshell -I../../../dist/include/appshell -I../../../dist/include/downloadmanager -I../../../dist/include/appcomps -I../../../dist/include -I/usr/include/nspr -fPIC -fno-rtti -fno-handle-exceptions -Wconversion -Wpointer-arith -Wcast-align -Woverloaded-virtual -Wsynth -Wno-ctor-dtor-privacy -Wno-non-virtual-dtor -Wno-long-long -march=pentium4 -pipe -Wno-deprecated -Wno-return-type -w -freorder-blocks -fno-reorder-functions -fshort-wchar -pthread -pipe -DNDEBUG -DTRIMMED -ffunction-sections -O2 -DMOZILLA_CLIENT -include ../../../mozilla-config.h -Wp,-MD,.deps/nsModule.pp nsModule.cpp
nsModule.cpp:45:27: nsCharsetMenu.h: No such file or directory
nsModule.cpp:46:34: nsFontPackageHandler.h: No such file or directory
nsModule.cpp: In function `nsresult nsFontPackageHandlerConstructor(nsISupports*, const nsIID&, void**)':
nsModule.cpp:68: error: `nsFontPackageHandler' was not declared in this scope
nsModule.cpp:68: error: `inst' was not declared in this scope
nsModule.cpp:68: error: `nsFontPackageHandler' is not a type
nsModule.cpp: At global scope:
nsModule.cpp:112: error: `NS_CHARSETMENU_CID' was not declared in this scope
nsModule.cpp:113: error: expected `}' before "NS_CHARSETMENU_PID"
nsModule.cpp:113: error: expected `}' before "NS_CHARSETMENU_PID"
nsModule.cpp:113: error: invalid conversion from `const char*' to `PRUint16'
nsModule.cpp:113: error: expected `,' or `;' before "NS_CHARSETMENU_PID"
nsModule.cpp:114: error: expected declaration before '}' token
gmake[4]: *** [nsModule.o] Error 1
gmake[4]: Leaving directory `/var/tmp/portage/mozilla-thunderbird-1.5.0.5/work/mozilla/xpfe/components/build2'
gmake[3]: *** [libs] Error 2
gmake[3]: Leaving directory `/var/tmp/portage/mozilla-thunderbird-1.5.0.5/work/mozilla/xpfe/components'
gmake[2]: *** [libs] Error 2
gmake[2]: Leaving directory `/var/tmp/portage/mozilla-thunderbird-1.5.0.5/work/mozilla/xpfe'
gmake[1]: *** [tier_50] Error 2
gmake[1]: Leaving directory `/var/tmp/portage/mozilla-thunderbird-1.5.0.5/work/mozilla'
make: *** [default] Error 2

!!! ERROR: mail-client/mozilla-thunderbird-1.5.0.5 failed.
Call stack:
ebuild.sh, line 1539: Called dyn_compile
ebuild.sh, line 939: Called src_compile
mozilla-thunderbird-1.5.0.5.ebuild, line 113: Called die

!!! (no error message)
!!! If you need support, post the topmost build error, and the call stack if relevant.



Can anyone help me fix this problem..?
_________________
- Perfection is delusive, and delusions are perfect.
Back to top
View user's profile Send private message
kallamej
Administrator
Administrator


Joined: 27 Jun 2003
Posts: 4830
Location: Gothenburg, Sweden

PostPosted: Sat Aug 19, 2006 3:26 pm    Post subject: Reply with quote

Moved from Portage & Programming to Duplicate Threads. Please see topic 468699.
_________________
Please read our FAQ Forum, it answers many of your questions.
irc: #gentoo-forums on irc.freenode.net
Back to top
View user's profile Send private message
Display posts from previous:   
Reply to topic    Gentoo Forums Forum Index Duplicate Threads All times are GMT
Page 1 of 1

 
Jump to:  
You cannot post new topics in this forum
You cannot reply to topics in this forum
You cannot edit your posts in this forum
You cannot delete your posts in this forum
You cannot vote in polls in this forum