Gentoo Forums
Gentoo Forums
Gentoo Forums
Quick Search: in
wine doesn't emerge
View unanswered posts
View posts from last 24 hours

 
Reply to topic    Gentoo Forums Forum Index Duplicate Threads
View previous topic :: View next topic  
Author Message
HG-Berlin
n00b
n00b


Joined: 08 Jan 2005
Posts: 36

PostPosted: Thu Jul 20, 2006 4:01 pm    Post subject: wine doesn't emerge Reply with quote

Hi all!

I'm trying to update to wine-0.9.17 on my amd64 but he fails to emerge it:

Code:
...
/usr/include/gentoo-multilib/amd64/bits/confname.h:591: error: redeclaration of enumerator `_CS_POSIX_V6_LP64_OFF64_LINTFLAGS'
/usr/include/gentoo-multilib/x86/bits/confname.h:591: error: previous definition of '_CS_POSIX_V6_LP64_OFF64_LINTFLAGS' was here
/usr/include/gentoo-multilib/amd64/bits/confname.h:593: error: redeclaration of enumerator `_CS_POSIX_V6_LPBIG_OFFBIG_CFLAGS'
/usr/include/gentoo-multilib/x86/bits/confname.h:593: error: previous definition of '_CS_POSIX_V6_LPBIG_OFFBIG_CFLAGS' was here
/usr/include/gentoo-multilib/amd64/bits/confname.h:595: error: redeclaration of enumerator `_CS_POSIX_V6_LPBIG_OFFBIG_LDFLAGS'
/usr/include/gentoo-multilib/x86/bits/confname.h:595: error: previous definition of '_CS_POSIX_V6_LPBIG_OFFBIG_LDFLAGS' was here
/usr/include/gentoo-multilib/amd64/bits/confname.h:597: error: redeclaration of enumerator `_CS_POSIX_V6_LPBIG_OFFBIG_LIBS'
/usr/include/gentoo-multilib/x86/bits/confname.h:597: error: previous definition of '_CS_POSIX_V6_LPBIG_OFFBIG_LIBS' was here
/usr/include/gentoo-multilib/amd64/bits/confname.h:601: error: redeclaration of enumerator `_CS_POSIX_V6_LPBIG_OFFBIG_LINTFLAGS'
/usr/include/gentoo-multilib/x86/bits/confname.h:601: error: previous definition of '_CS_POSIX_V6_LPBIG_OFFBIG_LINTFLAGS' was here
make[2]: *** [ffs.o] Error 1
make[2]: Leaving directory `/var/tmp/portage/wine-0.9.17/work/wine-0.9.17/libs/port'
make[1]: *** [port] Error 2
make[1]: Leaving directory `/var/tmp/portage/wine-0.9.17/work/wine-0.9.17/libs'
make: *** [libs] Error 2

!!! ERROR: app-emulation/wine-0.9.17 failed.
Call stack:
  ebuild.sh, line 1545:   Called dyn_compile
  ebuild.sh, line 940:   Called src_compile
  wine-0.9.17.ebuild, line 108:   Called die

!!! depend
!!! If you need support, post the topmost build error, and the call stack if relevant.


The last one, wine-0.9.16 didn't emerge either... How can I solve this?

Thanks for any help
Back to top
View user's profile Send private message
HG-Berlin
n00b
n00b


Joined: 08 Jan 2005
Posts: 36

PostPosted: Fri Jul 21, 2006 7:30 am    Post subject: Reply with quote

Mh, nobody?

I would really like to use the new version of wine... :?
Back to top
View user's profile Send private message
mark_alec
Bodhisattva
Bodhisattva


Joined: 11 Sep 2004
Posts: 6066
Location: Melbourne, Australia

PostPosted: Fri Jul 21, 2006 8:17 am    Post subject: Reply with quote

Moved from Portage & Programming to Duplicate Threads.

See https://forums.gentoo.org/viewtopic-t-469718-highlight-amd64+wine.html
Back to top
View user's profile Send private message
Display posts from previous:   
Reply to topic    Gentoo Forums Forum Index Duplicate Threads All times are GMT
Page 1 of 1

 
Jump to:  
You cannot post new topics in this forum
You cannot reply to topics in this forum
You cannot edit your posts in this forum
You cannot delete your posts in this forum
You cannot vote in polls in this forum