Gentoo Forums
Gentoo Forums
Gentoo Forums
Quick Search: in
[X.org] Pb de compilation X.org 7 / AMD64 (Résolu)
View unanswered posts
View posts from last 24 hours

 
Reply to topic    Gentoo Forums Forum Index French
View previous topic :: View next topic  
Author Message
benimbus
n00b
n00b


Joined: 12 Jul 2004
Posts: 28
Location: Lyon / France

PostPosted: Sat Jul 08, 2006 7:06 am    Post subject: [X.org] Pb de compilation X.org 7 / AMD64 (Résolu) Reply with quote

J'ai une plateforme à base d'AMD64.
J'essaye d'appliquer la procédure suivante.

Le soucis, c'est que j'ai toujours la même erreur de compilation et pas moyen de s'en sortir, même en passant les paquets X.org en testing...

-> Le config.log de xorg-server-1.0.2-r7
Mon environnement de compilation :
Code:
Portage 2.1-r1 (default-linux/amd64/2006.0, gcc-3.4.6, glibc-2.3.6-r4, 2.6.14-gentoo-r5-Nimbus x86_64)
=================================================================
System uname: 2.6.14-gentoo-r5-Nimbus x86_64 AMD Athlon(tm) 64 Processor 2800+
Gentoo Base System version 1.6.15
ccache version 2.3 [disabled]
dev-lang/python:     2.3.5-r2, 2.4.2
dev-python/pycrypto: 2.0.1-r5
dev-util/ccache:     2.3
dev-util/confcache:  [Not Present]
sys-apps/sandbox:    1.2.17
sys-devel/autoconf:  2.13, 2.59-r7
sys-devel/automake:  1.4_p6, 1.5, 1.6.3, 1.7.9-r1, 1.8.5-r3, 1.9.6-r2
sys-devel/binutils:  2.16.1-r3
sys-devel/gcc-config: 1.3.13-r3
sys-devel/libtool:   1.5.22
virtual/os-headers:  2.6.11-r2
ACCEPT_KEYWORDS="amd64"
AUTOCLEAN="yes"
CBUILD="x86_64-pc-linux-gnu"
CFLAGS="-march=athlon64 -O3 -pipe -fomit-frame-pointer"
CHOST="x86_64-pc-linux-gnu"
CONFIG_PROTECT="/etc /usr/share/X11/xkb /var/bind"
CONFIG_PROTECT_MASK="/etc/env.d /etc/gconf /etc/revdep-rebuild /etc/terminfo"
CXXFLAGS="-march=athlon64 -O3 -pipe -fomit-frame-pointer"
DISTDIR="/usr/portage/distfiles"
FEATURES="autoconfig distlocks metadata-transfer sandbox sfperms strict"
GENTOO_MIRRORS="http://gentoo.mirror.sdv.fr/distfiles/ http://ftp.club-internet.fr/pub/mirrors/gentoo http://gentoo.modulix.net/gentoo/ ftp://ftp.heanet.ie/pub/gentoo/ rsync://ftp-stud.fht-esslingen.de/gentoo/ rsync://linux.rz.ruhr-uni-bochum.de/gentoo/ rsync://ftp.belnet.be/gentoo/ rsync://trumpetti.atm.tut.fi/gentoo/"
LANG="fr_FR@euro"
LC_ALL="fr_FR@euro"
LINGUAS="fr fr_FR"
MAKEOPTS="-j2"
PKGDIR="/usr/portage/packages"
PORTAGE_RSYNC_OPTS="--recursive --links --safe-links --perms --times --compress --force --whole-file --delete --delete-after --stats --timeout=180 --exclude='/distfiles' --exclude='/local' --exclude='/packages'"
PORTAGE_TMPDIR="/var/tmp"
PORTDIR="/usr/portage"
SYNC="rsync://rsync.gentoo.org/gentoo-portage"
USE="3dnowex X a52 aac aalib acpi alsa amd64 apache2 audiofile avi bash-completion berkdb bitmap-fonts bzip2 calendar cdparanoia cgi cli crypt cups curl dba dlloader dri dts dv dvb dvd dvdread eds emboss encode exif ffmpeg flac foomaticdb fortran ftp gd gif gpm gstreamer ieee1394 imap imlib isdnlog jpeg jpeg2k libwww lirc live lm_sensors logitech-mouse lzw lzw-tiff mad maildir matroska mng mp3 mpeg mysql mysqli nas ncurses network nls no-htdocs nptl nptlonly nvidia ogg oggvorbis opengl oss pam pcre pdflib perl php png pppd python qt qt3 qt4 quicktime readline reflection rtc samba sdl session slang spell spl ssl svg tcpd theora tiff truetype truetype-fonts type1-fonts unicode usb vhosts vorbis xanim xml xml2 xorg xpm xv xvid zlib elibc_glibc input_devices_keyboard input_devices_mouse kernel_linux linguas_fr linguas_fr_FR userland_GNU video_cards_nv video_cards_nvidia video_cards_vesa"
Unset:  CTARGET, EMERGE_DEFAULT_OPTS, INSTALL_MASK, LDFLAGS, PORTAGE_RSYNC_EXTRA_OPTS, PORTDIR_OVERLAY


Si quelqu'un a une piste, je suis preneur :)

2ème question au passage, les pilotes proprio Nvidia fonctionneront bien avec cette nouvelle version de X.org ? (J'en ai absolument besoin pour activer la sortie TV sur ma GF FX 5200)


Last edited by benimbus on Tue Jul 11, 2006 10:11 pm; edited 1 time in total
Back to top
View user's profile Send private message
ghoti
Advocate
Advocate


Joined: 30 Dec 2002
Posts: 3578
Location: Belgium

PostPosted: Sat Jul 08, 2006 11:17 am    Post subject: Re: [X.org] Pb de compilation X.org 7 Reply with quote

benimbus wrote:
Le soucis, c'est que j'ai toujours la même erreur de compilation

C'est moi ou bien ton fichier n'est pas complet ?
Back to top
View user's profile Send private message
benimbus
n00b
n00b


Joined: 12 Jul 2004
Posts: 28
Location: Lyon / France

PostPosted: Sat Jul 08, 2006 12:07 pm    Post subject: Reply with quote

Exact... il manque ca :
Code:
make: *** [all-recursive] Erreur 1

!!! ERROR: x11-base/xorg-server-1.0.2-r7 failed.
Call stack:
  ebuild.sh, line 1539:   Called dyn_compile
  ebuild.sh, line 939:   Called src_compile
  ebuild.sh, line 1248:   Called x-modular_src_compile
  x-modular.eclass, line 327:   Called x-modular_src_make
  x-modular.eclass, line 322:   Called die

!!! emake failed
!!! If you need support, post the topmost build error, and the call stack if relevant.


Dsl...
Back to top
View user's profile Send private message
ghoti
Advocate
Advocate


Joined: 30 Dec 2002
Posts: 3578
Location: Belgium

PostPosted: Sat Jul 08, 2006 1:25 pm    Post subject: Reply with quote

benimbus wrote:
Code:
make: *** [all-recursive] Erreur 1

Etrange qu'il n'y ait pas d'erreur plus haut... :?
Back to top
View user's profile Send private message
benimbus
n00b
n00b


Joined: 12 Jul 2004
Posts: 28
Location: Lyon / France

PostPosted: Sat Jul 08, 2006 4:07 pm    Post subject: Reply with quote

bin, ouais, c'est pas très parlant hélas...
ceci dit, j'ai exactement le même genre d"erreur avec d'autre lib lié à X.org genre x11-libs/libXv-1.0.1 ; x11-libs/libXp-1.0.0 ; x11-libs/libXTrap...

Donc je pense qu'il y a un soucis du côté de mon environnement plutot qu'un bug dans les sources de xorg-server
Back to top
View user's profile Send private message
ghoti
Advocate
Advocate


Joined: 30 Dec 2002
Posts: 3578
Location: Belgium

PostPosted: Sat Jul 08, 2006 5:14 pm    Post subject: Reply with quote

Désolé d'insister mais cette absence de message est tellement inhabituelle ...
Es-tu vraiment certain qu'il n'y a rien entre la dernière ligne de ton fichier
===> (make[1]: Leaving directory `/var/tmp/portage/xorg-server-1.0.2-r7/work/xorg-server-1.0.2/dix')
et la première ligne que tu as indiquée dans ton 'complément' :
===> (make: *** [all-recursive] Erreur 1 )
:?:
Back to top
View user's profile Send private message
benimbus
n00b
n00b


Joined: 12 Jul 2004
Posts: 28
Location: Lyon / France

PostPosted: Sun Jul 09, 2006 7:03 am    Post subject: Reply with quote

Ouais, vraiment certain.... et dans le même genre d'erreur :
Code:
~ # emerge -uDN x11-libs/libXv x11-libs/libXp  x11-libs/libXTrap
Calculating dependencies... done!
>>> Emerging (1 of 3) x11-libs/libXv-1.0.1 to /
>>> checking ebuild checksums ;-)
>>> checking auxfile checksums ;-)
>>> checking miscfile checksums ;-)
>>> checking libXv-1.0.1.tar.bz2 ;-)
>>> Unpacking source...
>>> Unpacking libXv-1.0.1.tar.bz2 to /var/tmp/portage/libXv-1.0.1/work
 * Running elibtoolize in: libXv-1.0.1
 *   Applying portage-1.5.10.patch ...
 *   Applying max_cmd_len-1.5.20.patch ...
 *   Applying sed-1.5.6.patch ...
>>> Source unpacked.
>>> Compiling source in /var/tmp/portage/libXv-1.0.1/work/libXv-1.0.1 ...
 * econf: updating libXv-1.0.1/config.guess with /usr/share/gnuconfig/config.guess
 * econf: updating libXv-1.0.1/config.sub with /usr/share/gnuconfig/config.sub
./configure --prefix=/usr --host=x86_64-pc-linux-gnu --mandir=/usr/share/man --infodir=/usr/share/info --datadir=/usr/share --sysconfdir=/etc --localstatedir=/var/lib --prefix=/usr --datadir=/usr/share --libdir=/usr/lib64 --build=x86_64-pc-linux-gnu
checking for a BSD-compatible install... /bin/install -c
checking whether build environment is sane... yes
checking for gawk... gawk
checking whether make sets $(MAKE)... yes
checking whether to enable maintainer-specific portions of Makefiles... no
checking for x86_64-pc-linux-gnu-gcc... x86_64-pc-linux-gnu-gcc
checking for C compiler default output file name... a.out
checking whether the C compiler works... yes
checking whether we are cross compiling... no
checking for suffix of executables...
checking for suffix of object files... o
checking whether we are using the GNU C compiler... yes
checking whether x86_64-pc-linux-gnu-gcc accepts -g... yes
checking for x86_64-pc-linux-gnu-gcc option to accept ANSI C... none needed
checking for style of include used by make... GNU
checking dependency style of x86_64-pc-linux-gnu-gcc... gcc3
checking build system type... x86_64-pc-linux-gnu
checking host system type... x86_64-pc-linux-gnu
checking for a sed that does not truncate output... /bin/sed
checking for egrep... grep -E
checking for ld used by x86_64-pc-linux-gnu-gcc... /usr/x86_64-pc-linux-gnu/bin/ld
checking if the linker (/usr/x86_64-pc-linux-gnu/bin/ld) is GNU ld... yes
checking for /usr/x86_64-pc-linux-gnu/bin/ld option to reload object files... -r
checking for BSD-compatible nm... /usr/bin/x86_64-pc-linux-gnu-nm -B
checking whether ln -s works... yes
checking how to recognise dependent libraries... pass_all
checking how to run the C preprocessor... x86_64-pc-linux-gnu-gcc -E
checking for ANSI C header files... yes
checking for sys/types.h... yes
checking for sys/stat.h... yes
checking for stdlib.h... yes
checking for string.h... yes
checking for memory.h... yes
checking for strings.h... yes
checking for inttypes.h... yes
checking for stdint.h... yes
checking for unistd.h... yes
checking dlfcn.h usability... yes
checking dlfcn.h presence... yes
checking for dlfcn.h... yes
checking for x86_64-pc-linux-gnu-g++... x86_64-pc-linux-gnu-g++
checking whether we are using the GNU C++ compiler... yes
checking whether x86_64-pc-linux-gnu-g++ accepts -g... yes
checking dependency style of x86_64-pc-linux-gnu-g++... gcc3
checking how to run the C++ preprocessor... x86_64-pc-linux-gnu-g++ -E
checking for x86_64-pc-linux-gnu-g77... x86_64-pc-linux-gnu-g77
checking whether we are using the GNU Fortran 77 compiler... yes
checking whether x86_64-pc-linux-gnu-g77 accepts -g... yes
checking the maximum length of command line arguments... 32768
checking command to parse /usr/bin/x86_64-pc-linux-gnu-nm -B output from x86_64-pc-linux-gnu-gcc object... ok
checking for objdir... .libs
checking for x86_64-pc-linux-gnu-ar... x86_64-pc-linux-gnu-ar
checking for x86_64-pc-linux-gnu-ranlib... x86_64-pc-linux-gnu-ranlib
checking for x86_64-pc-linux-gnu-strip... x86_64-pc-linux-gnu-strip
checking if x86_64-pc-linux-gnu-gcc static flag  works... yes
checking if x86_64-pc-linux-gnu-gcc supports -fno-rtti -fno-exceptions... no
checking for x86_64-pc-linux-gnu-gcc option to produce PIC... -fPIC
checking if x86_64-pc-linux-gnu-gcc PIC flag -fPIC works... yes
checking if x86_64-pc-linux-gnu-gcc supports -c -o file.o... yes
checking whether the x86_64-pc-linux-gnu-gcc linker (/usr/x86_64-pc-linux-gnu/bin/ld -m elf_x86_64) supports shared libraries... yes
checking whether -lc should be explicitly linked in... no
checking dynamic linker characteristics... GNU/Linux ld.so
checking how to hardcode library paths into programs... immediate
checking whether stripping libraries is possible... yes
checking if libtool supports shared libraries... yes
checking whether to build shared libraries... yes
checking whether to build static libraries... yes
configure: creating libtool
appending configuration tag "CXX" to libtool
checking for ld used by x86_64-pc-linux-gnu-g++... /usr/x86_64-pc-linux-gnu/bin/ld -m elf_x86_64
checking if the linker (/usr/x86_64-pc-linux-gnu/bin/ld -m elf_x86_64) is GNU ld... yes
checking whether the x86_64-pc-linux-gnu-g++ linker (/usr/x86_64-pc-linux-gnu/bin/ld -m elf_x86_64) supports shared libraries... yes
checking for x86_64-pc-linux-gnu-g++ option to produce PIC... -fPIC
checking if x86_64-pc-linux-gnu-g++ PIC flag -fPIC works... yes
checking if x86_64-pc-linux-gnu-g++ supports -c -o file.o... yes
checking whether the x86_64-pc-linux-gnu-g++ linker (/usr/x86_64-pc-linux-gnu/bin/ld -m elf_x86_64) supports shared libraries... yes
checking dynamic linker characteristics... GNU/Linux ld.so
checking how to hardcode library paths into programs... immediate
checking whether stripping libraries is possible... yes
appending configuration tag "F77" to libtool
checking if libtool supports shared libraries... yes
checking whether to build shared libraries... yes
checking whether to build static libraries... yes
checking for x86_64-pc-linux-gnu-g77 option to produce PIC... -fPIC
checking if x86_64-pc-linux-gnu-g77 PIC flag -fPIC works... yes
checking if x86_64-pc-linux-gnu-g77 supports -c -o file.o... yes
checking whether the x86_64-pc-linux-gnu-g77 linker (/usr/x86_64-pc-linux-gnu/bin/ld -m elf_x86_64) supports shared libraries... yes
checking dynamic linker characteristics... GNU/Linux ld.so
checking how to hardcode library paths into programs... immediate
checking whether stripping libraries is possible... yes
checking for x86_64-pc-linux-gnu-pkg-config... no
checking for pkg-config... /usr/bin/pkg-config
checking pkg-config is at least version 0.9.0... yes
checking for XV... yes
checking whether malloc(0) returns NULL... yes
configure: creating ./config.status
config.status: creating Makefile
config.status: creating include/Makefile
config.status: creating include/X11/Makefile
config.status: creating include/X11/extensions/Makefile
config.status: creating src/Makefile
config.status: creating man/Makefile
config.status: creating xv.pc
config.status: creating config.h
config.status: executing depfiles commands
make  all-recursive
make[1]: Entering directory `/var/tmp/portage/libXv-1.0.1/work/libXv-1.0.1'
Making all in src
make[2]: Entering directory `/var/tmp/portage/libXv-1.0.1/work/libXv-1.0.1/src'
if /bin/sh ../libtool --mode=compile x86_64-pc-linux-gnu-gcc -DHAVE_CONFIG_H -I. -I. -I..    -I../include -DMALLOC_0_RETURNS_NULL -march=athlon64 -O3 -pipe -fomit-frame-pointer -MT Xv.lo -MD -MP -MF ".deps/Xv.Tpo" \
  -c -o Xv.lo `test -f 'Xv.c' || echo './'`Xv.c; \
then mv -f ".deps/Xv.Tpo" ".deps/Xv.Plo"; \
else rm -f ".deps/Xv.Tpo"; exit 1; \
fi
mkdir .libs
 x86_64-pc-linux-gnu-gcc -DHAVE_CONFIG_H -I. -I. -I.. -I../include -DMALLOC_0_RETURNS_NULL -march=athlon64 -O3 -pipe -fomit-frame-pointer -MT Xv.lo -MD -MP -MF .deps/Xv.Tpo -c Xv.c  -fPIC -DPIC -o .libs/Xv.o
In file included from Xv.c:55:
Xvlibint.h:46:25: X11/Xlibint.h: No such file or directory
Xvlibint.h:47:36: X11/extensions/Xvproto.h: No such file or directory
In file included from Xvlibint.h:48,
                 from Xv.c:55:
../include/X11/extensions/Xvlib.h:56:28: X11/Xfuncproto.h: No such file or directory
../include/X11/extensions/Xvlib.h:57:31: X11/extensions/Xv.h: No such file or directory
In file included from Xvlibint.h:48,
                 from Xv.c:55:
../include/X11/extensions/Xvlib.h:72: error: syntax error before "XvEncodingID"
../include/X11/extensions/Xvlib.h:72: warning: no semicolon at end of struct or union
../include/X11/extensions/Xvlib.h:78: error: syntax error before '}' token
../include/X11/extensions/Xvlib.h:78: warning: data definition has no type or storage class
../include/X11/extensions/Xvlib.h:86: error: syntax error before "XvPortID"
../include/X11/extensions/Xvlib.h:86: warning: no semicolon at end of struct or union
../include/X11/extensions/Xvlib.h:93: error: syntax error before '}' token
../include/X11/extensions/Xvlib.h:93: warning: data definition has no type or storage class
../include/X11/extensions/Xvlib.h:98: error: syntax error before "Bool"
../include/X11/extensions/Xvlib.h:98: warning: no semicolon at end of struct or union
../include/X11/extensions/Xvlib.h:99: warning: data definition has no type or storage class
../include/X11/extensions/Xvlib.h:100: error: syntax error before "drawable"
../include/X11/extensions/Xvlib.h:100: warning: data definition has no type or storage class
../include/X11/extensions/Xvlib.h:102: error: syntax error before "port_id"
../include/X11/extensions/Xvlib.h:102: warning: data definition has no type or storage class
../include/X11/extensions/Xvlib.h:103: error: syntax error before "time"
../include/X11/extensions/Xvlib.h:103: warning: data definition has no type or storage class
../include/X11/extensions/Xvlib.h:104: warning: data definition has no type or storage class
../include/X11/extensions/Xvlib.h:109: error: syntax error before "Bool"
../include/X11/extensions/Xvlib.h:109: warning: no semicolon at end of struct or union
../include/X11/extensions/Xvlib.h:110: warning: data definition has no type or storage class
../include/X11/extensions/Xvlib.h:111: error: syntax error before "port_id"
../include/X11/extensions/Xvlib.h:111: warning: data definition has no type or storage class
../include/X11/extensions/Xvlib.h:112: error: syntax error before "time"
../include/X11/extensions/Xvlib.h:112: warning: data definition has no type or storage class
../include/X11/extensions/Xvlib.h:113: error: syntax error before "attribute"
../include/X11/extensions/Xvlib.h:113: warning: data definition has no type or storage class
../include/X11/extensions/Xvlib.h:115: error: syntax error before '}' token
../include/X11/extensions/Xvlib.h:115: warning: data definition has no type or storage class
../include/X11/extensions/Xvlib.h:119: error: syntax error before "XvVideoNotifyEvent"
../include/X11/extensions/Xvlib.h:119: warning: no semicolon at end of struct or union
../include/X11/extensions/Xvlib.h:120: warning: data definition has no type or storage class
../include/X11/extensions/Xvlib.h:122: error: syntax error before '}' token
../include/X11/extensions/Xvlib.h:122: warning: data definition has no type or storage class
../include/X11/extensions/Xvlib.h:161: error: syntax error before "XPointer"
../include/X11/extensions/Xvlib.h:161: warning: no semicolon at end of struct or union
../include/X11/extensions/Xvlib.h:162: warning: data definition has no type or storage class
../include/X11/extensions/Xvlib.h:166: error: syntax error before "extern"
../include/X11/extensions/Xvlib.h:167: error: syntax error before '*' token
../include/X11/extensions/Xvlib.h:176: error: syntax error before '*' token
../include/X11/extensions/Xvlib.h:183: error: syntax error before '*' token
../include/X11/extensions/Xvlib.h:190: error: syntax error before '*' token
../include/X11/extensions/Xvlib.h:205: error: syntax error before '*' token
../include/X11/extensions/Xvlib.h:220: error: syntax error before '*' token
../include/X11/extensions/Xvlib.h:235: error: syntax error before '*' token
../include/X11/extensions/Xvlib.h:250: error: syntax error before '*' token
../include/X11/extensions/Xvlib.h:256: error: syntax error before '*' token
../include/X11/extensions/Xvlib.h:262: error: syntax error before '*' token
../include/X11/extensions/Xvlib.h:268: error: syntax error before '*' token
../include/X11/extensions/Xvlib.h:274: error: syntax error before '*' token
../include/X11/extensions/Xvlib.h:280: error: syntax error before '*' token
../include/X11/extensions/Xvlib.h:287: error: syntax error before '*' token
../include/X11/extensions/Xvlib.h:294: error: syntax error before '*' token
../include/X11/extensions/Xvlib.h:306: error: syntax error before '*' token
../include/X11/extensions/Xvlib.h:313: error: syntax error before '*' token
../include/X11/extensions/Xvlib.h:317: error: syntax error before '*' token
../include/X11/extensions/Xvlib.h:322: error: syntax error before '*' token
../include/X11/extensions/Xvlib.h:327: error: syntax error before '*' token
../include/X11/extensions/Xvlib.h:328: error: syntax error before '*' token
../include/X11/extensions/Xvlib.h:334: warning: data definition has no type or storage class
../include/X11/extensions/Xvlib.h:337: error: syntax error before '*' token
../include/X11/extensions/Xvlib.h:353: error: syntax error before '*' token
Xv.c:56:33: X11/extensions/Xext.h: No such file or directory
Xv.c:57:36: X11/extensions/extutil.h: No such file or directory
Xv.c:58:33: X11/extensions/XShm.h: No such file or directory
Xv.c:60: error: syntax error before "static"
Xv.c:60: warning: data definition has no type or storage class
Xv.c:61: error: syntax error before '*' token
Xv.c:61: warning: data definition has no type or storage class
Xv.c:62: error: `XvName' undeclared here (not in a function)
Xv.c:69: error: syntax error before "xv_wire_to_event"
Xv.c:69: warning: data definition has no type or storage class
Xv.c:71: error: syntax error before "xv_extension_hooks"
Xv.c:72: warning: initialization makes integer from pointer without a cast
Xv.c:73: warning: excess elements in scalar initializer
Xv.c:73: warning: (near initialization for `xv_extension_hooks')
Xv.c:74: warning: excess elements in scalar initializer
Xv.c:74: warning: (near initialization for `xv_extension_hooks')
Xv.c:75: warning: excess elements in scalar initializer
Xv.c:75: warning: (near initialization for `xv_extension_hooks')
Xv.c:76: warning: excess elements in scalar initializer
Xv.c:76: warning: (near initialization for `xv_extension_hooks')
Xv.c:77: warning: excess elements in scalar initializer
Xv.c:77: warning: (near initialization for `xv_extension_hooks')
Xv.c:78: warning: excess elements in scalar initializer
Xv.c:78: warning: (near initialization for `xv_extension_hooks')
Xv.c:79: warning: excess elements in scalar initializer
Xv.c:79: warning: (near initialization for `xv_extension_hooks')
Xv.c:80: warning: excess elements in scalar initializer
Xv.c:80: warning: (near initialization for `xv_extension_hooks')
Xv.c:81: warning: excess elements in scalar initializer
Xv.c:81: warning: (near initialization for `xv_extension_hooks')
Xv.c:83: warning: excess elements in scalar initializer
Xv.c:83: warning: (near initialization for `xv_extension_hooks')
Xv.c:83: warning: data definition has no type or storage class
Xv.c: In function `XEXT_GENERATE_CLOSE_DISPLAY':
Xv.c:98: error: syntax error before '&' token
Xv.c:99: error: storage class specified for parameter `XEXT_GENERATE_FIND_DISPLAY'
Xv.c:155: error: syntax error before "XvAdaptorInfo"
Xv.c:162: error: syntax error before "xvAdaptorInfo"
Xv.c:162: warning: no semicolon at end of struct or union
Xv.c:284: error: redefinition of parameter 'ii'
Xv.c:153: error: previous definition of 'ii' was here
Xv.c:286: error: syntax error before "if"
Xv.c:315: error: redefinition of parameter 'size'
Xv.c:153: error: previous definition of 'size' was here
Xv.c:315: error: redefinition of parameter 'jj'
Xv.c:153: error: previous definition of 'jj' was here
Xv.c:316: error: redefinition of parameter 'name'
Xv.c:154: error: previous definition of 'name' was here
Xv.c:317: error: syntax error before "XvEncodingInfo"
Xv.c:318: error: redefinition of parameter 'buffer'
Xv.c:157: error: previous definition of 'buffer' was here
Xv.c:323: error: syntax error before "xvEncodingInfo"
Xv.c:323: warning: no semicolon at end of struct or union
Xv.c:411: error: redefinition of parameter 'ii'
Xv.c:284: error: previous definition of 'ii' was here
Xv.c:413: error: syntax error before "if"
Xv.c:612: error: syntax error before "xvGrabPortReply"
Xv.c:818: error: parameter `ret' is initialized
Xv.c:820: error: syntax error before '*' token
Xv.c:845: error: syntax error before "for"
Xv.c:873: error: parameter `ret' is initialized
Xv.c:873: error: conflicting types for 'ret'
Xv.c:818: error: previous definition of 'ret' was here
Xv.c:875: error: syntax error before '*' token
Xv.c:897: error: redefinition of parameter 'i'
Xv.c:843: error: previous definition of 'i' was here
Xv.c:899: error: syntax error before "for"
Xv.c:1024: error: syntax error before "XextCheckExtension"
make[2]: *** [Xv.lo] Erreur 1
make[2]: Leaving directory `/var/tmp/portage/libXv-1.0.1/work/libXv-1.0.1/src'
make[1]: *** [all-recursive] Erreur 1
make[1]: Leaving directory `/var/tmp/portage/libXv-1.0.1/work/libXv-1.0.1'
make: *** [all] Erreur 2

!!! ERROR: x11-libs/libXv-1.0.1 failed.
Call stack:
  ebuild.sh, line 1539:   Called dyn_compile
  ebuild.sh, line 939:   Called src_compile
  ebuild.sh, line 1248:   Called x-modular_src_compile
  x-modular.eclass, line 327:   Called x-modular_src_make
  x-modular.eclass, line 322:   Called die

!!! emake failed
!!! If you need support, post the topmost build error, and the call stack if relevant.
Back to top
View user's profile Send private message
geekounet
Bodhisattva
Bodhisattva


Joined: 11 Oct 2004
Posts: 3771
Location: Wellington, Aotearoa

PostPosted: Sun Jul 09, 2006 8:11 am    Post subject: Reply with quote

Il te manque des libs, c'est normal que ça compile pas. Ça peut être dû au fait que tu ais essayé une première fois, puis rétrogradé en 6.8, et ensuite réessayé de l'installer, ce qui fait que les libX11, etc. n'ont pas été unmergées et qu'elles ont été écrasées par Xorg 6.8. Du coup, en unmergeant de dernier, ya plus aucune libs, mais portage les considère toujours comme installées. (je suis pas sur d'être clair :lol: ).
Enfin même si c'est pas ton cas, il faut réinstaller ces libs manquantes.

Ce que je te conseille : unmerge toute cette liste (emerge -C $(cat modular-x-packages.txt)) et refait ton emerge xorg-x11, le jeu des dépendances te réinstallera bien tout proprement.

Sinon, vaut mieux suivre le howto officiel que celui du wiki, il a de fortes chances d'être plus complet.

Et pour ton nvidia, oui ne t'inquiète pas, ça marche très bien :)
Back to top
View user's profile Send private message
benimbus
n00b
n00b


Joined: 12 Jul 2004
Posts: 28
Location: Lyon / France

PostPosted: Sun Jul 09, 2006 2:16 pm    Post subject: Reply with quote

Ok, je vais essayer de suite... je vous tiens au courant
Back to top
View user's profile Send private message
benimbus
n00b
n00b


Joined: 12 Jul 2004
Posts: 28
Location: Lyon / France

PostPosted: Sun Jul 09, 2006 4:45 pm    Post subject: Reply with quote

Bon ca compil déjà beaucoup mieux mais j'ai encore une erreur avec le xorg-server
Code:
glxcmds.c: In function `__glXBindSwapBarrierSGIX':
glxcmds.c:1749: warning: cast to pointer from integer of different size
glxcmds.c: In function `__glxQueryHyperpipeNetworkSGIX':
glxcmds.c:1796: error: `xGLXQueryHyperpipeNetworkSGIXReq' undeclared (first use in this function)
glxcmds.c:1796: error: (Each undeclared identifier is reported only once
glxcmds.c:1796: error: for each function it appears in.)
glxcmds.c:1796: error: `req' undeclared (first use in this function)
glxcmds.c:1796: error: syntax error before ')' token
glxcmds.c:1797: error: `xGLXQueryHyperpipeNetworkSGIXReply' undeclared (first use in this function)
glxcmds.c:1812: error: `reply' undeclared (first use in this function)
glxcmds.c:1825: error: `sz_xGLXQueryHyperpipeNetworkSGIXReply' undeclared (first use in this function)
glxcmds.c: In function `__glxDestroyHyperpipeConfigSGIX':
glxcmds.c:1836: error: `xGLXDestroyHyperpipeConfigSGIXReq' undeclared (first use in this function)
glxcmds.c:1836: error: `req' undeclared (first use in this function)
glxcmds.c:1837: error: syntax error before ')' token
glxcmds.c:1838: error: `xGLXDestroyHyperpipeConfigSGIXReply' undeclared (first use in this function)
glxcmds.c:1851: error: `reply' undeclared (first use in this function)
glxcmds.c:1863: error: `sz_xGLXDestroyHyperpipeConfigSGIXReply' undeclared (first use in this function)
glxcmds.c: In function `__glxQueryHyperpipeConfigSGIX':
glxcmds.c:1871: error: `xGLXQueryHyperpipeConfigSGIXReq' undeclared (first use in this function)
glxcmds.c:1871: error: `req' undeclared (first use in this function)
glxcmds.c:1872: error: syntax error before ')' token
glxcmds.c:1873: error: `xGLXQueryHyperpipeConfigSGIXReply' undeclared (first use in this function)
glxcmds.c:1889: error: `reply' undeclared (first use in this function)
glxcmds.c:1904: error: `sz_xGLXQueryHyperpipeConfigSGIXReply' undeclared (first use in this function)
glxcmds.c: In function `__glxHyperpipeConfigSGIX':
glxcmds.c:1915: error: `xGLXHyperpipeConfigSGIXReq' undeclared (first use in this function)
glxcmds.c:1915: error: `req' undeclared (first use in this function)
glxcmds.c:1916: error: syntax error before ')' token
glxcmds.c:1917: error: `xGLXHyperpipeConfigSGIXReply' undeclared (first use in this function)
glxcmds.c:1935: error: `reply' undeclared (first use in this function)
glxcmds.c:1949: error: `sz_xGLXHyperpipeConfigSGIXReply' undeclared (first use in this function)
make[2]: *** [glxcmds.lo] Erreur 1
make[2]: *** Attente des tâches non terminées....
 x86_64-pc-linux-gnu-gcc -DHAVE_CONFIG_H -I. -I. -I../../include -I../../include -I../../include -I../../include -I../../include -I../../include -I../../GL/include -I../../hw/xfree86/os-support -DHAVE_DIX_CONFIG_H -I/var/tmp/portage/xorg-server-1.0.2-r7/work/Mesa-6.4.2/include -DXFree86Server -DIN_MODULE -DXFree86Module -DXFree86LOADER -Wall -Wpointer-arith -Wstrict-prototypes -Wmissing-prototypes -Wmissing-declarations -Wnested-externs -fno-strict-aliasing -D_BSD_SOURCE -DHAS_FCHOWN -DHAS_STICKY_DIR_BIT -I../../include -I../../include -I../../Xext -I../../composite -I../../damageext -I../../xfixes -I../../Xi -I../../mi -I../../miext/shadow -I../../miext/damage -I../../render -I../../randr -I../../fb -I../../lbx -march=athlon64 -O3 -pipe -fomit-frame-pointer -MT glxcmdsswap.lo -MD -MP -MF .deps/glxcmdsswap.Tpo -c glxcmdsswap.c  -fPIC -DPIC -o .libs/glxcmdsswap.o
make[2]: Leaving directory `/var/tmp/portage/xorg-server-1.0.2-r7/work/xorg-server-1.0.2/GL/glx'
make[1]: *** [all-recursive] Erreur 1
make[1]: Leaving directory `/var/tmp/portage/xorg-server-1.0.2-r7/work/xorg-server-1.0.2/GL'
make: *** [all-recursive] Erreur 1

!!! ERROR: x11-base/xorg-server-1.0.2-r7 failed.
Call stack:
  ebuild.sh, line 1539:   Called dyn_compile
  ebuild.sh, line 939:   Called src_compile
  ebuild.sh, line 1248:   Called x-modular_src_compile
  x-modular.eclass, line 327:   Called x-modular_src_make
  x-modular.eclass, line 322:   Called die

!!! emake failed
!!! If you need support, post the topmost build error, and the call stack if relevant.
Back to top
View user's profile Send private message
benimbus
n00b
n00b


Joined: 12 Jul 2004
Posts: 28
Location: Lyon / France

PostPosted: Tue Jul 11, 2006 6:51 pm    Post subject: Reply with quote

Pas d'idée ? Si ca continu, je vais être obliger de revenir en arrière... :(
Back to top
View user's profile Send private message
benimbus
n00b
n00b


Joined: 12 Jul 2004
Posts: 28
Location: Lyon / France

PostPosted: Tue Jul 11, 2006 10:10 pm    Post subject: Reply with quote

Ok, au moment ou je perdais espoir, j'ai finis par trouver la solution :)

C'est un bug qui touche l'archi AMD64 : https://bugs.gentoo.org/show_bug.cgi?id=138766.

J'ai donc juste fais :
Code:
~ # vi /etc/portage/package.keywords

Rajouté la ligne :
Code:
>=app-emulation/emul-linux-x86-xlibs-7.0-r1 ~amd64

Puis compiler les 2 lib en question :
Code:
 ~ # emerge emul-linux-x86-xlibs emul-linux-x86-baselibs

Et enfin :
Code:
 ~ # emerge xorg-x11



Voilà, merci à tous ! Sans quoi, j'en serait resté au X.org 6.8 pendant moult temps.... :(
Back to top
View user's profile Send private message
titoucha
Advocate
Advocate


Joined: 21 Jul 2005
Posts: 2374
Location: Genève

PostPosted: Wed Jul 12, 2006 1:14 am    Post subject: Reply with quote

Par curiosité tu avais des versions stables de emul-linux-x86-xlibs et emul-linux-x86-baselibs au départ quant tu avais toutes ces erreurs de compilations, j'ai regardé ta configuration et à un détail ou deux près on a la même et chez moi la compilation c'est passé sans problème.
Back to top
View user's profile Send private message
benimbus
n00b
n00b


Joined: 12 Jul 2004
Posts: 28
Location: Lyon / France

PostPosted: Wed Jul 12, 2006 10:27 am    Post subject: Reply with quote

Oui oui, je suis sur une version stable (sauf pour qq paquets : dbus, ivman, lirc, hal)
Back to top
View user's profile Send private message
titoucha
Advocate
Advocate


Joined: 21 Jul 2005
Posts: 2374
Location: Genève

PostPosted: Wed Jul 12, 2006 5:54 pm    Post subject: Reply with quote

Etrange encore un mystère de l'informatique 8O
Back to top
View user's profile Send private message
Display posts from previous:   
Reply to topic    Gentoo Forums Forum Index French All times are GMT
Page 1 of 1

 
Jump to:  
You cannot post new topics in this forum
You cannot reply to topics in this forum
You cannot edit your posts in this forum
You cannot delete your posts in this forum
You cannot vote in polls in this forum