Gentoo Forums
Gentoo Forums
Gentoo Forums
Quick Search: in
!!! ERROR: kde-base/kdeaccessibility-3.5.2 failed.
View unanswered posts
View posts from last 24 hours

 
Reply to topic    Gentoo Forums Forum Index Duplicate Threads
View previous topic :: View next topic  
Author Message
padoor
Advocate
Advocate


Joined: 30 Dec 2005
Posts: 3995
Location: india

PostPosted: Mon Jun 12, 2006 2:37 pm    Post subject: !!! ERROR: kde-base/kdeaccessibility-3.5.2 failed. Reply with quote

artsplayer.cpp:(.text+0x2dcf): undefined reference to `std::basic_string<char, std::char_traits<char>, std::allocator<char> >::_Rep::_S_empty_rep_storage'
artsplayer.cpp:(.text+0x2de9): undefined reference to `__gnu_cxx::__exchange_and_add(int volatile*, int)'
artsplayer.cpp:(.text+0x2e17): undefined reference to `__gnu_cxx::__exchange_and_add(int volatile*, int)'
artsplayer.cpp:(.text+0x2e4d): undefined reference to `__gnu_cxx::__exchange_and_add(int volatile*, int)'
artsplayer.cpp:(.text+0x2e7c): undefined reference to `__gnu_cxx::__exchange_and_add(int volatile*, int)'
artsplayer.cpp:(.text+0x2ecf): undefined reference to `__gnu_cxx::__exchange_and_add(int volatile*, int)'
.libs/artsplayer.o: In function `ArtsPlayer::currentTime() const':
artsplayer.cpp:(.text+0x2f8e): undefined reference to `std::basic_string<char, std::char_traits<char>, std::allocator<char> >::_Rep::_S_empty_rep_storage'
artsplayer.cpp:(.text+0x2fbb): undefined reference to `__gnu_cxx::__exchange_and_add(int volatile*, int)'
.libs/artsplayer.o: In function `ArtsPlayer::totalTime() const':
artsplayer.cpp:(.text+0x305a): undefined reference to `std::basic_string<char, std::char_traits<char>, std::allocator<char> >::_Rep::_S_empty_rep_storage'
artsplayer.cpp:(.text+0x3087): undefined reference to `__gnu_cxx::__exchange_and_add(int volatile*, int)'
collect2: ld returned 1 exit status
make[4]: *** [libkttsd_artsplugin.la] Error 1
make[4]: Leaving directory `/var/tmp/portage/kdeaccessibility-3.5.2/work/kdeaccessibility-3.5.2/kttsd/players/artsplayer'
make[3]: *** [all-recursive] Error 1
make[3]: Leaving directory `/var/tmp/portage/kdeaccessibility-3.5.2/work/kdeaccessibility-3.5.2/kttsd/players'
make[2]: *** [all-recursive] Error 1
make[2]: Leaving directory `/var/tmp/portage/kdeaccessibility-3.5.2/work/kdeaccessibility-3.5.2/kttsd'
make[1]: *** [all-recursive] Error 1
make[1]: Leaving directory `/var/tmp/portage/kdeaccessibility-3.5.2/work/kdeaccessibility-3.5.2'
make: *** [all] Error 2

!!! ERROR: kde-base/kdeaccessibility-3.5.2 failed.
Call stack:
ebuild.sh, line 1539: Called dyn_compile
ebuild.sh, line 939: Called src_compile
kdeaccessibility-3.5.2.ebuild, line 29: Called kde_src_compile
kde.eclass, line 164: Called kde_src_compile 'all'
kde.eclass, line 299: Called kde_src_compile 'myconf' 'configure' 'make'
kde.eclass, line 295: Called die

!!! died running emake, kde_src_compile:make
!!! If you need support, post the topmost build error, and the call stack if relevant.

similar error is for kttsd is in another topic.
_________________
reach out a little bit more to catch it (DON'T BELIEVE the advocate part under my user name)
Back to top
View user's profile Send private message
Maedhros
Bodhisattva
Bodhisattva


Joined: 14 Apr 2004
Posts: 5511
Location: Durham, UK

PostPosted: Tue Jun 13, 2006 6:29 am    Post subject: Reply with quote

Looks like the same problem as !!! ERROR: kde-base/kttsd-3.5.2 failed., just with a different package.

Moved from Portage & Programming to Duplicate Threads.
_________________
No-one's more important than the earthworm.
Back to top
View user's profile Send private message
Display posts from previous:   
Reply to topic    Gentoo Forums Forum Index Duplicate Threads All times are GMT
Page 1 of 1

 
Jump to:  
You cannot post new topics in this forum
You cannot reply to topics in this forum
You cannot edit your posts in this forum
You cannot delete your posts in this forum
You cannot vote in polls in this forum