Gentoo Forums
Gentoo Forums
Gentoo Forums
Quick Search: in
emerge stardict failed
View unanswered posts
View posts from last 24 hours

 
Reply to topic    Gentoo Forums Forum Index Russian
View previous topic :: View next topic  
Author Message
curbat
Apprentice
Apprentice


Joined: 29 Aug 2004
Posts: 172
Location: Russia

PostPosted: Mon May 08, 2006 3:38 pm    Post subject: emerge stardict failed Reply with quote

Пытаюсь обновить stardict но всё заканчивается

make[3]: Leaving directory `/var/tmp/portage/stardict-2.4.6-r1/work/stardict-2.4.6/src'
make[2]: Leaving directory `/var/tmp/portage/stardict-2.4.6-r1/work/stardict-2.4.6/src'
Making all in tests
make[2]: Entering directory `/var/tmp/portage/stardict-2.4.6-r1/work/stardict-2.4.6/tests'
if i686-pc-linux-gnu-g++ -DHAVE_CONFIG_H -I. -I. -I.. -Wall -DORBIT2=1 -pthread -I/usr/include/libgnomeui-2.0 -I/usr/include/libgnome-2.0 -I/usr/include/libgnomecanvas-2.0 -I/usr/include/gtk-2.0 -I/usr/include/libart-2.0 -I/usr/include/gconf/2 -I/usr/include/libbonoboui-2.0 -I/usr/include/gnome-vfs-2.0 -I/usr/lib/gnome-vfs-2.0/include -I/usr/include/gnome-keyring-1 -I/usr/include/glib-2.0 -I/usr/lib/glib-2.0/include -I/usr/include/orbit-2.0 -I/usr/include/libbonobo-2.0 -I/usr/include/bonobo-activation-2.0 -I/usr/include/pango-1.0 -I/usr/include/freetype2 -I/usr/lib/gtk-2.0/include -I/usr/include/atk-1.0 -I/usr/include/cairo -I/usr/include/libxml2 -I.. -I../src -march=athlon-xp -O2 -fomit-frame-pointer -momit-leaf-frame-pointer -fno-ident -pipe -MT t_config_file.o -MD -MP -MF ".deps/t_config_file.Tpo" -c -o t_config_file.o t_config_file.cpp; \
then mv -f ".deps/t_config_file.Tpo" ".deps/t_config_file.Po"; else rm -f ".deps/t_config_file.Tpo"; exit 1; fi
t_config_file.cpp: In function `bool test_gconf()':
t_config_file.cpp:99: error: syntax error before `+' token
t_config_file.cpp:100: error: syntax error before `+' token
t_config_file.cpp:101: error: request for member `c_str' in `tmp1', which is of
non-aggregate type `std::string ()(...)'
t_config_file.cpp:102: error: request for member `c_str' in `tmp2', which is of
non-aggregate type `std::string ()(...)'
t_config_file.cpp:105: error: conversion from `std::string ()(...)' to
non-scalar type `tmp_file' requested
t_config_file.cpp:106: error: conversion from `std::string ()(...)' to
non-scalar type `tmp_file' requested
make[2]: *** [t_config_file.o] Ошибка 1
make[2]: Leaving directory `/var/tmp/portage/stardict-2.4.6-r1/work/stardict-2.4.6/tests'
make[1]: *** [all-recursive] Ошибка 1
make[1]: Leaving directory `/var/tmp/portage/stardict-2.4.6-r1/work/stardict-2.4.6'
make: *** [all] Ошибка 2

!!! ERROR: app-dicts/stardict-2.4.6-r1 failed.
!!! Function gnome2_src_compile, Line 58, Exitcode 2
!!! compile failure
!!! If you need support, post the topmost build error, NOT this status message.

Из за чего это?
_________________
Registered Linux user #393446
Back to top
View user's profile Send private message
danzz
n00b
n00b


Joined: 14 Jan 2005
Posts: 23
Location: Kemerovo

PostPosted: Mon May 08, 2006 4:35 pm    Post subject: Reply with quote

погляди здесь, что-то вроде похожее:
https://bugs.gentoo.org/show_bug.cgi?id=123772
_________________
wbr!
Back to top
View user's profile Send private message
Display posts from previous:   
Reply to topic    Gentoo Forums Forum Index Russian All times are GMT
Page 1 of 1

 
Jump to:  
You cannot post new topics in this forum
You cannot reply to topics in this forum
You cannot edit your posts in this forum
You cannot delete your posts in this forum
You cannot vote in polls in this forum