Gentoo Forums
Gentoo Forums
Gentoo Forums
Quick Search: in
ACCEPT_KEYWORDS="~amd64" can't -avuDN @world
View unanswered posts
View posts from last 24 hours

 
Reply to topic    Gentoo Forums Forum Index Gentoo on AMD64
View previous topic :: View next topic  
Author Message
YangMame
n00b
n00b


Joined: 20 Jun 2017
Posts: 6

PostPosted: Tue Jun 20, 2017 1:40 am    Post subject: ACCEPT_KEYWORDS="~amd64" can't -avuDN @world Reply with quote

emmm...
after eselect profile set 6 and add ACCEPT_KEYWORDS="~amd64" to make.conf
emerge --ask --update --deep --newuse --with-bdeps=y @world:

Code:
!!! Please attach the following file when seeking support:
!!! /var/tmp/portage/net-nds/openldap-2.4.44-r1/work/openldap-2.4.44-abi_x86_64.amd64/config.log
 * ERROR: net-nds/openldap-2.4.44-r1::gentoo failed (configure phase):
 *   econf failed
 *
 * Call stack:
 *               ebuild.sh, line  115:  Called src_configure
 *             environment, line 4755:  Called multilib-minimal_src_configure
 *             environment, line 3497:  Called multilib_foreach_abi 'multilib-minimal_abi_src_configure'
 *             environment, line 3711:  Called multibuild_foreach_variant '_multilib_multibuild_wrapper' 'multilib-minimal_abi_src_configure'
 *             environment, line 3427:  Called _multibuild_run '_multilib_multibuild_wrapper' 'multilib-minimal_abi_src_configure'
 *             environment, line 3425:  Called _multilib_multibuild_wrapper 'multilib-minimal_abi_src_configure'
 *             environment, line  695:  Called multilib-minimal_abi_src_configure
 *             environment, line 3491:  Called multilib_src_configure
 *             environment, line 4051:  Called econf '--libexecdir=/usr/lib64/openldap' '--disable-static' '--disable-backends' '--disable-slapd' '--disable-bdb' '--disable-hdb' '--disable-mdb' '--disable-overlays' '--disable-syslog' '--enable-ipv6' '--without-cyrus-sasl' '--disable-spasswd' '--enable-wrappers' '--with-tls=openssl' '--enable-dynamic' '--enable-local' '--enable-proctitle' '--enable-shared'
 *        phase-helpers.sh, line  665:  Called __helpers_die 'econf failed'
 *   isolated-functions.sh, line  117:  Called die
 * The specific snippet of code:
 *         die "$@"
 *
 * If you need support, post the output of `emerge --info '=net-nds/openldap-2.4.44-r1::gentoo'`,
 * the complete build log and the output of `emerge -pqv '=net-nds/openldap-2.4.44-r1::gentoo'`.
 * The complete build log is located at '/var/tmp/portage/net-nds/openldap-2.4.44-r1/temp/build.log'.
 * The ebuild environment file is located at '/var/tmp/portage/net-nds/openldap-2.4.44-r1/temp/environment'.
 * Working directory: '/var/tmp/portage/net-nds/openldap-2.4.44-r1/work/openldap-2.4.44-abi_x86_64.amd64'
 * S: '/var/tmp/portage/net-nds/openldap-2.4.44-r1/work/openldap-2.4.44'

>>> Failed to emerge net-nds/openldap-2.4.44-r1, Log file:

>>>  '/var/tmp/portage/net-nds/openldap-2.4.44-r1/temp/build.log'

 * Messages for package sys-fs/eudev-3.2.2-r1:

 *
 * As of 2013-01-29, eudev-3.2.2 provides the new interface renaming functionality,
 * as described in the URL below:
 * https://www.freedesktop.org/wiki/Software/systemd/PredictableNetworkInterfaceNames
 *
 * This functionality is enabled BY DEFAULT because eudev has no means of synchronizing
 * between the default or user-modified choice of sys-fs/udev.  If you wish to disable
 * this new iface naming, please be sure that /etc/udev/rules.d/80-net-name-slot.rules
 * exists: touch /etc/udev/rules.d/80-net-name-slot.rules
 *

 * Messages for package net-nds/openldap-2.4.44-r1:

 * ERROR: net-nds/openldap-2.4.44-r1::gentoo failed (configure phase):
 *   econf failed
 *
 * Call stack:
 *               ebuild.sh, line  115:  Called src_configure
 *             environment, line 4755:  Called multilib-minimal_src_configure
 *             environment, line 3497:  Called multilib_foreach_abi 'multilib-minimal_abi_src_configure'
 *             environment, line 3711:  Called multibuild_foreach_variant '_multilib_multibuild_wrapper' 'multilib-minimal_abi_src_configure'
 *             environment, line 3427:  Called _multibuild_run '_multilib_multibuild_wrapper' 'multilib-minimal_abi_src_configure'
 *             environment, line 3425:  Called _multilib_multibuild_wrapper 'multilib-minimal_abi_src_configure'
 *             environment, line  695:  Called multilib-minimal_abi_src_configure
 *             environment, line 3491:  Called multilib_src_configure
 *             environment, line 4051:  Called econf '--libexecdir=/usr/lib64/openldap' '--disable-static' '--disable-backends' '--disable-slapd' '--disable-bdb' '--disable-hdb' '--disable-mdb' '--disable-overlays' '--disable-syslog' '--enable-ipv6' '--without-cyrus-sasl' '--disable-spasswd' '--enable-wrappers' '--with-tls=openssl' '--enable-dynamic' '--enable-local' '--enable-proctitle' '--enable-shared'
 *        phase-helpers.sh, line  665:  Called __helpers_die 'econf failed'
 *   isolated-functions.sh, line  117:  Called die
 * The specific snippet of code:
 *         die "$@"
 *
 * If you need support, post the output of `emerge --info '=net-nds/openldap-2.4.44-r1::gentoo'`,
 * the complete build log and the output of `emerge -pqv '=net-nds/openldap-2.4.44-r1::gentoo'`.
 * The complete build log is located at '/var/tmp/portage/net-nds/openldap-2.4.44-r1/temp/build.log'.
 * The ebuild environment file is located at '/var/tmp/portage/net-nds/openldap-2.4.44-r1/temp/environment'.
 * Working directory: '/var/tmp/portage/net-nds/openldap-2.4.44-r1/work/openldap-2.4.44-abi_x86_64.amd64'
 * S: '/var/tmp/portage/net-nds/openldap-2.4.44-r1/work/openldap-2.4.44'

 * Regenerating GNU info directory index...
 * Processed 93 info files.

!!! existing preserved libs:
>>> package: dev-libs/openssl-1.1.0f
 *  - /usr/lib64/libssl.so.1.0.0
 *      used by /usr/bin/wget (net-misc/wget-1.19.1-r1)
 *      used by /usr/lib64/python2.7/lib-dynload/_ssl.so (dev-lang/python-2.7.12)
 *      used by /usr/lib64/python3.4/lib-dynload/_ssl.cpython-34m.so (dev-lang/python-3.4.5)
 *  - /usr/lib64/libcrypto.so.1.0.0
 *      used by /bin/ping6 (net-misc/iputils-20151218)
 *      used by /usr/bin/ssh (net-misc/openssh-7.5_p1-r1)
 *      used by /usr/bin/ssh-add (net-misc/openssh-7.5_p1-r1)
 *      used by 11 other files
Use emerge @preserved-rebuild to rebuild packages using these libraries
 * After world updates, it is important to remove obsolete packages with
 * emerge --depclean. Refer to `man emerge` for more information.

then i try to emerge @preserved-rebuild:
Code:
Python build finished successfully!
The necessary bits to build these optional modules were not found:
_sqlite3              _tkinter                                 
To find the necessary bits, look in setup.py in detect_modules() for the module's name.


Failed to build these modules:
_hashlib              _ssl                                     

running build_scripts
creating build/scripts-3.4
copying and adjusting /var/tmp/portage/dev-lang/python-3.4.6/work/Python-3.4.6/Tools/scripts/pydoc3 -> build/scripts-3.4
copying and adjusting /var/tmp/portage/dev-lang/python-3.4.6/work/Python-3.4.6/Tools/scripts/idle3 -> build/scripts-3.4
copying and adjusting /var/tmp/portage/dev-lang/python-3.4.6/work/Python-3.4.6/Tools/scripts/2to3 -> build/scripts-3.4
copying and adjusting /var/tmp/portage/dev-lang/python-3.4.6/work/Python-3.4.6/Tools/scripts/pyvenv -> build/scripts-3.4
changing mode of build/scripts-3.4/pydoc3 from 644 to 755
changing mode of build/scripts-3.4/idle3 from 644 to 755
changing mode of build/scripts-3.4/2to3 from 644 to 755
changing mode of build/scripts-3.4/pyvenv from 644 to 755
renaming build/scripts-3.4/pydoc3 to build/scripts-3.4/pydoc3.4
renaming build/scripts-3.4/idle3 to build/scripts-3.4/idle3.4
renaming build/scripts-3.4/2to3 to build/scripts-3.4/2to3-3.4
renaming build/scripts-3.4/pyvenv to build/scripts-3.4/pyvenv-3.4
make: *** [Makefile:582: sharedmods] Error 1
 * ERROR: dev-lang/python-3.4.6::gentoo failed (compile phase):
 *   emake failed
 *
 * If you need support, post the output of `emerge --info '=dev-lang/python-3.4.6::gentoo'`,
 * the complete build log and the output of `emerge -pqv '=dev-lang/python-3.4.6::gentoo'`.
 * The complete build log is located at '/var/tmp/portage/dev-lang/python-3.4.6/temp/build.log'.
 * The ebuild environment file is located at '/var/tmp/portage/dev-lang/python-3.4.6/temp/environment'.
 * Working directory: '/var/tmp/portage/dev-lang/python-3.4.6/work/x86_64-pc-linux-gnu'
 * S: '/var/tmp/portage/dev-lang/python-3.4.6/work/Python-3.4.6'

>>> Failed to emerge dev-lang/python-3.4.6, Log file:

>>>  '/var/tmp/portage/dev-lang/python-3.4.6/temp/build.log'

 * Messages for package dev-lang/python-3.4.6:

 * ERROR: dev-lang/python-3.4.6::gentoo failed (compile phase):
 *   emake failed
 *
 * If you need support, post the output of `emerge --info '=dev-lang/python-3.4.6::gentoo'`,
 * the complete build log and the output of `emerge -pqv '=dev-lang/python-3.4.6::gentoo'`.
 * The complete build log is located at '/var/tmp/portage/dev-lang/python-3.4.6/temp/build.log'.
 * The ebuild environment file is located at '/var/tmp/portage/dev-lang/python-3.4.6/temp/environment'.
 * Working directory: '/var/tmp/portage/dev-lang/python-3.4.6/work/x86_64-pc-linux-gnu'
 * S: '/var/tmp/portage/dev-lang/python-3.4.6/work/Python-3.4.6'

the log of net-nds/openldap:
Code:
 * Package:    net-nds/openldap-2.4.44-r1
 * Repository: gentoo
 * Maintainer: ldap-bugs@gentoo.org
 * USE:        abi_x86_64 amd64 berkdb crypt elibc_glibc ipv6 kernel_linux minimal ssl syslog tcpd userland_GNU
 * FEATURES:   preserve-libs sandbox userpriv usersandbox
 * No datadir scan needed, openldap not installed
>>> Unpacking source...
>>> Unpacking openldap-2.4.44.tgz to /var/tmp/portage/net-nds/openldap-2.4.44-r1/work
>>> Unpacking rfc2307bis.schema-20140524 to /var/tmp/portage/net-nds/openldap-2.4.44-r1/work
unpack rfc2307bis.schema-20140524: file format not recognized. Ignoring.
>>> Source unpacked in /var/tmp/portage/net-nds/openldap-2.4.44-r1/work
>>> Preparing source in /var/tmp/portage/net-nds/openldap-2.4.44-r1/work/openldap-2.4.44 ...
 * Applying openldap-2.4.17-gcc44.patch ...                                   [ ok ]
 * Applying openldap-2.2.14-perlthreadsfix.patch ...                          [ ok ]
 * Applying openldap-2.4.15-ppolicy.patch ...                                 [ ok ]
 * Applying openldap-2.4.35-contrib-smbk5pwd.patch ...                        [ ok ]
 * Applying openldap-2.4.35-contrib-samba4.patch ...                          [ ok ]
 * Applying openldap-2.4.11-libldap_r.patch ...                               [ ok ]
 * Applying openldap-2.4.17-fix-lmpasswd-gnutls-symbols.patch ...             [ ok ]
 * Applying openldap-2.4.28-gnutls-gcrypt.patch ...                           [ ok ]
 * Applying openldap-2.4.6-evolution-ntlm.patch ...                           [ ok ]
 * Applying openldap-2.4.28-fix-dash.patch ...                                [ ok ]
 * Applying openldap-2.4.31-gcc47.patch ...                                   [ ok ]
 * Applying openldap-2.4.42-mdb-unbundle.patch ...                            [ ok ]
 * Making sure upstream build strip does not do stripping too early
 * Running eautoreconf in '/var/tmp/portage/net-nds/openldap-2.4.44-r1/work/openldap-2.4.44' ...
 * Running libtoolize --install --copy --force ...                            [ ok ]
 * Running aclocal ...                                                        [ ok ]
 * This package has a configure.in file which has long been deprecated.  Please
 * update it to use configure.ac instead as newer versions of autotools will die
 * when it finds this file.  See https://bugs.gentoo.org/426262 for details.
 * Running autoconf --force ...                                               [ ok ]
 * Running autoheader ...                                                     [ ok ]
 * Running elibtoolize in: openldap-2.4.44/
 * Running elibtoolize in: openldap-2.4.44/build/
 *   Applying portage/1.2.0 patch ...
 *   Applying sed/1.5.6 patch ...
 *   Applying as-needed/2.4.3 patch ...
 * Running elibtoolize in: openldap-2.4.44/contrib/ldapc++/
 *   Applying install-sh/1.5.4 patch ...
 *   Applying portage/1.5.10 patch ...
 *   Applying max_cmd_len/1.5.20 patch ...
 *   Applying sed/1.5.6 patch ...
 *   Applying as-needed/1.5 patch ...
 *   Applying target-nm/2.4.2 patch ...
 * Running elibtoolize in: openldap-2.4.44/contrib/ldaptcl/
 * Running elibtoolize in: openldap-2.4.44/doc/install/
>>> Source prepared.
>>> Configuring source in /var/tmp/portage/net-nds/openldap-2.4.44-r1/work/openldap-2.4.44 ...
 * abi_x86_64.amd64: running multilib-minimal_abi_src_configure
 * econf: updating openldap-2.4.44/build/config.guess with /usr/share/gnuconfig/config.guess
 * econf: updating openldap-2.4.44/build/config.sub with /usr/share/gnuconfig/config.sub
 * econf: updating openldap-2.4.44/contrib/ldapc++/config.guess with /usr/share/gnuconfig/config.guess
 * econf: updating openldap-2.4.44/contrib/ldapc++/config.sub with /usr/share/gnuconfig/config.sub
/var/tmp/portage/net-nds/openldap-2.4.44-r1/work/openldap-2.4.44/configure --prefix=/usr --build=x86_64-pc-linux-gnu --host=x86_64-pc-linux-gnu --mandir=/usr/share/man --infodir=/usr/share/info --datadir=/usr/share --sysconfdir=/etc --localstatedir=/var/lib --disable-dependency-tracking --disable-silent-rules --libdir=/usr/lib64 --libexecdir=/usr/lib64/openldap --disable-static --disable-backends --disable-slapd --disable-bdb --disable-hdb --disable-mdb --disable-overlays --disable-syslog --enable-ipv6 --without-cyrus-sasl --disable-spasswd --enable-wrappers --with-tls=openssl --enable-dynamic --enable-local --enable-proctitle --enable-shared
Configuring OpenLDAP 2.4.44-Release ...
checking build system type... x86_64-pc-linux-gnu
checking host system type... x86_64-pc-linux-gnu
checking target system type... x86_64-pc-linux-gnu
checking for a BSD-compatible install... /usr/lib/portage/python3.4/ebuild-helpers/xattr/install -c
checking whether build environment is sane... yes
/bin/sh: /var/tmp/portage/net-nds/openldap-2.4.44-r1/work/openldap-2.4.44/build/missing: No such file or directory
configure: WARNING: 'missing' script is too old or missing
checking for a thread-safe mkdir -p... /bin/mkdir -p
checking for gawk... gawk
checking whether make sets $(MAKE)... yes
checking whether make supports nested variables... yes
checking configure arguments... configure: WARNING: slapd disabled, ignoring --enable-wrappers argument
done
checking how to print strings... printf
checking for style of include used by make... GNU
checking for x86_64-pc-linux-gnu-gcc... x86_64-pc-linux-gnu-gcc
checking whether the C compiler works... yes
checking for C compiler default output file name... a.out
checking for suffix of executables...
checking whether we are cross compiling... no
checking for suffix of object files... o
checking whether we are using the GNU C compiler... yes
checking whether x86_64-pc-linux-gnu-gcc accepts -g... yes
checking for x86_64-pc-linux-gnu-gcc option to accept ISO C89... none needed
checking whether x86_64-pc-linux-gnu-gcc understands -c and -o together... yes
checking dependency style of x86_64-pc-linux-gnu-gcc... none
checking for a sed that does not truncate output... /bin/sed
checking for grep that handles long lines and -e... /bin/grep
checking for egrep... /bin/grep -E
checking for fgrep... /bin/grep -F
checking for ld used by x86_64-pc-linux-gnu-gcc... /usr/x86_64-pc-linux-gnu/bin/ld
checking if the linker (/usr/x86_64-pc-linux-gnu/bin/ld) is GNU ld... yes
checking for BSD- or MS-compatible name lister (nm)... /usr/bin/x86_64-pc-linux-gnu-nm -B
checking the name lister (/usr/bin/x86_64-pc-linux-gnu-nm -B) interface... BSD nm
checking whether ln -s works... yes
checking the maximum length of command line arguments... 1572864
checking how to convert x86_64-pc-linux-gnu file names to x86_64-pc-linux-gnu format... func_convert_file_noop
checking how to convert x86_64-pc-linux-gnu file names to toolchain format... func_convert_file_noop
checking for /usr/x86_64-pc-linux-gnu/bin/ld option to reload object files... -r
checking for x86_64-pc-linux-gnu-objdump... objdump
checking how to recognize dependent libraries... pass_all
checking for x86_64-pc-linux-gnu-dlltool... dlltool
checking how to associate runtime and link libraries... printf %s\n
checking for x86_64-pc-linux-gnu-ar... x86_64-pc-linux-gnu-ar
checking for archiver @FILE support... @
checking for x86_64-pc-linux-gnu-strip... /bin/true
checking for x86_64-pc-linux-gnu-ranlib... x86_64-pc-linux-gnu-ranlib
checking command to parse /usr/bin/x86_64-pc-linux-gnu-nm -B output from x86_64-pc-linux-gnu-gcc object... ok
checking for sysroot... no
checking for a working dd... /bin/dd
checking how to truncate binary pipes... /bin/dd bs=4096 count=1
checking for x86_64-pc-linux-gnu-mt... no
checking for mt... no
checking if : is a manifest tool... no
checking how to run the C preprocessor... x86_64-pc-linux-gnu-gcc -E
checking for ANSI C header files... yes
checking for sys/types.h... yes
checking for sys/stat.h... yes
checking for stdlib.h... yes
checking for string.h... yes
checking for memory.h... yes
checking for strings.h... yes
checking for inttypes.h... yes
checking for stdint.h... yes
checking for unistd.h... yes
checking for dlfcn.h... yes
checking for objdir... .libs
checking if x86_64-pc-linux-gnu-gcc supports -fno-rtti -fno-exceptions... no
checking for x86_64-pc-linux-gnu-gcc option to produce PIC... -fPIC -DPIC
checking if x86_64-pc-linux-gnu-gcc PIC flag -fPIC -DPIC works... yes
checking if x86_64-pc-linux-gnu-gcc static flag -static works... yes
checking if x86_64-pc-linux-gnu-gcc supports -c -o file.o... yes
checking if x86_64-pc-linux-gnu-gcc supports -c -o file.o... (cached) yes
checking whether the x86_64-pc-linux-gnu-gcc linker (/usr/x86_64-pc-linux-gnu/bin/ld -m elf_x86_64) supports shared libraries... yes
checking whether -lc should be explicitly linked in... no
checking dynamic linker characteristics... GNU/Linux ld.so
checking how to hardcode library paths into programs... immediate
checking for shl_load... no
checking for shl_load in -ldld... no
checking for dlopen... no
checking for dlopen in -ldl... yes
checking whether a program can dlopen itself... yes
checking whether a statically linked program can dlopen itself... no
checking whether stripping libraries is possible... no
checking if libtool supports shared libraries... yes
checking whether to build shared libraries... yes
checking whether to build static libraries... no
checking how to run the C preprocessor... x86_64-pc-linux-gnu-gcc -E
checking whether we are using MS Visual C++... no
checking for be_app in -lbe... no
checking for x86_64-pc-linux-gnu-gcc... (cached) x86_64-pc-linux-gnu-gcc
checking whether we are using the GNU C compiler... (cached) yes
checking whether x86_64-pc-linux-gnu-gcc accepts -g... (cached) yes
checking for x86_64-pc-linux-gnu-gcc option to accept ISO C89... (cached) none needed
checking whether x86_64-pc-linux-gnu-gcc understands -c and -o together... (cached) yes
checking dependency style of x86_64-pc-linux-gnu-gcc... (cached) none
checking for x86_64-pc-linux-gnu-gcc depend flag... -M
checking for afopen in -ls... no
checking for EBCDIC... no
checking for ANSI C header files... yes
checking for dirent.h that defines DIR... yes
checking for library containing opendir... none required
checking for sys/wait.h that is POSIX.1 compatible... yes
checking whether termios.h defines TIOCGWINSZ... no
checking whether sys/ioctl.h defines TIOCGWINSZ... yes
checking arpa/inet.h usability... yes
checking arpa/inet.h presence... yes
checking for arpa/inet.h... yes
checking arpa/nameser.h usability... yes
checking arpa/nameser.h presence... yes
checking for arpa/nameser.h... yes
checking assert.h usability... yes
checking assert.h presence... yes
checking for assert.h... yes
checking bits/types.h usability... yes
checking bits/types.h presence... yes
checking for bits/types.h... yes
checking conio.h usability... no
checking conio.h presence... no
checking for conio.h... no
checking crypt.h usability... yes
checking crypt.h presence... yes
checking for crypt.h... yes
checking direct.h usability... no
checking direct.h presence... no
checking for direct.h... no
checking errno.h usability... yes
checking errno.h presence... yes
checking for errno.h... yes
checking fcntl.h usability... yes
checking fcntl.h presence... yes
checking for fcntl.h... yes
checking filio.h usability... no
checking filio.h presence... no
checking for filio.h... no
checking getopt.h usability... yes
checking getopt.h presence... yes
checking for getopt.h... yes
checking grp.h usability... yes
checking grp.h presence... yes
checking for grp.h... yes
checking io.h usability... no
checking io.h presence... no
checking for io.h... no
checking libutil.h usability... no
checking libutil.h presence... no
checking for libutil.h... no
checking limits.h usability... yes
checking limits.h presence... yes
checking for limits.h... yes
checking locale.h usability... yes
checking locale.h presence... yes
checking for locale.h... yes
checking malloc.h usability... yes
checking malloc.h presence... yes
checking for malloc.h... yes
checking for memory.h... (cached) yes
checking psap.h usability... no
checking psap.h presence... no
checking for psap.h... no
checking pwd.h usability... yes
checking pwd.h presence... yes
checking for pwd.h... yes
checking process.h usability... no
checking process.h presence... no
checking for process.h... no
checking sgtty.h usability... yes
checking sgtty.h presence... yes
checking for sgtty.h... yes
checking shadow.h usability... yes
checking shadow.h presence... yes
checking for shadow.h... yes
checking stddef.h usability... yes
checking stddef.h presence... yes
checking for stddef.h... yes
checking for string.h... (cached) yes
checking for strings.h... (cached) yes
checking sysexits.h usability... yes
checking sysexits.h presence... yes
checking for sysexits.h... yes
checking sys/file.h usability... yes
checking sys/file.h presence... yes
checking for sys/file.h... yes
checking sys/filio.h usability... no
checking sys/filio.h presence... no
checking for sys/filio.h... no
checking sys/fstyp.h usability... no
checking sys/fstyp.h presence... no
checking for sys/fstyp.h... no
checking sys/errno.h usability... yes
checking sys/errno.h presence... yes
checking for sys/errno.h... yes
checking sys/ioctl.h usability... yes
checking sys/ioctl.h presence... yes
checking for sys/ioctl.h... yes
checking sys/param.h usability... yes
checking sys/param.h presence... yes
checking for sys/param.h... yes
checking sys/privgrp.h usability... no
checking sys/privgrp.h presence... no
checking for sys/privgrp.h... no
checking sys/resource.h usability... yes
checking sys/resource.h presence... yes
checking for sys/resource.h... yes
checking sys/select.h usability... yes
checking sys/select.h presence... yes
checking for sys/select.h... yes
checking sys/socket.h usability... yes
checking sys/socket.h presence... yes
checking for sys/socket.h... yes
checking for sys/stat.h... (cached) yes
checking sys/syslog.h usability... yes
checking sys/syslog.h presence... yes
checking for sys/syslog.h... yes
checking sys/time.h usability... yes
checking sys/time.h presence... yes
checking for sys/time.h... yes
checking for sys/types.h... (cached) yes
checking sys/uio.h usability... yes
checking sys/uio.h presence... yes
checking for sys/uio.h... yes
checking sys/vmount.h usability... no
checking sys/vmount.h presence... no
checking for sys/vmount.h... no
checking syslog.h usability... yes
checking syslog.h presence... yes
checking for syslog.h... yes
checking termios.h usability... yes
checking termios.h presence... yes
checking for termios.h... yes
checking for unistd.h... (cached) yes
checking utime.h usability... yes
checking utime.h presence... yes
checking for utime.h... yes
checking for resolv.h... yes
checking for netinet/tcp.h... yes
checking for sys/ucred.h... no
checking for sigaction... yes
checking for sigset... yes
checking for socket... yes
checking for select... yes
checking for sys/select.h... (cached) yes
checking for sys/socket.h... (cached) yes
checking types of arguments for select... int,fd_set *,struct timeval *
checking for poll... yes
checking poll.h usability... yes
checking poll.h presence... yes
checking for poll.h... yes
checking sys/poll.h usability... yes
checking sys/poll.h presence... yes
checking for sys/poll.h... yes
checking sys/epoll.h usability... yes
checking sys/epoll.h presence... yes
checking for sys/epoll.h... yes
checking for epoll system call... yes
checking sys/devpoll.h usability... no
checking sys/devpoll.h presence... no
checking for sys/devpoll.h... no
checking declaration of sys_errlist... yes
checking for strerror... yes
checking for strerror_r... yes
checking non-posix strerror_r... no
checking for regex.h... yes
checking for library containing regfree... none required
checking for compatible POSIX regex... yes
checking sys/uuid.h usability... no
checking sys/uuid.h presence... no
checking for sys/uuid.h... no
checking uuid/uuid.h usability... yes
checking uuid/uuid.h presence... yes
checking for uuid/uuid.h... yes
checking for library containing uuid_generate... -luuid
checking for library containing uuid_unparse_lower... none required
checking for resolver link (default)... no
checking for resolver link (-lresolv)... yes
checking for hstrerror... yes
checking for getaddrinfo... yes
checking for getnameinfo... yes
checking for gai_strerror... yes
checking for inet_ntop... yes
checking INET6_ADDRSTRLEN... yes
checking struct sockaddr_storage... yes
checking sys/un.h usability... yes
checking sys/un.h presence... yes
checking for sys/un.h... yes
checking openssl/ssl.h usability... yes
checking openssl/ssl.h presence... yes
checking for openssl/ssl.h... yes
checking for SSL_library_init in -lssl... no
checking for ssl3_accept in -lssl... no
configure: error: Could not locate TLS/SSL package

!!! Please attach the following file when seeking support:
!!! /var/tmp/portage/net-nds/openldap-2.4.44-r1/work/openldap-2.4.44-abi_x86_64.amd64/config.log
 * ERROR: net-nds/openldap-2.4.44-r1::gentoo failed (configure phase):
 *   econf failed
 *
 * Call stack:
 *               ebuild.sh, line  115:  Called src_configure
 *             environment, line 4755:  Called multilib-minimal_src_configure
 *             environment, line 3497:  Called multilib_foreach_abi 'multilib-minimal_abi_src_configure'
 *             environment, line 3711:  Called multibuild_foreach_variant '_multilib_multibuild_wrapper' 'multilib-minimal_abi_src_configure'
 *             environment, line 3427:  Called _multibuild_run '_multilib_multibuild_wrapper' 'multilib-minimal_abi_src_configure'
 *             environment, line 3425:  Called _multilib_multibuild_wrapper 'multilib-minimal_abi_src_configure'
 *             environment, line  695:  Called multilib-minimal_abi_src_configure
 *             environment, line 3491:  Called multilib_src_configure
 *             environment, line 4051:  Called econf '--libexecdir=/usr/lib64/openldap' '--disable-static' '--disable-backends' '--disable-slapd' '--disable-bdb' '--disable-hdb' '--disable-mdb' '--disable-overlays' '--disable-syslog' '--enable-ipv6' '--without-cyrus-sasl' '--disable-spasswd' '--enable-wrappers' '--with-tls=openssl' '--enable-dynamic' '--enable-local' '--enable-proctitle' '--enable-shared'
 *        phase-helpers.sh, line  665:  Called __helpers_die 'econf failed'
 *   isolated-functions.sh, line  117:  Called die
 * The specific snippet of code:
 *         die "$@"
 *
 * If you need support, post the output of `emerge --info '=net-nds/openldap-2.4.44-r1::gentoo'`,
 * the complete build log and the output of `emerge -pqv '=net-nds/openldap-2.4.44-r1::gentoo'`.
 * The complete build log is located at '/var/tmp/portage/net-nds/openldap-2.4.44-r1/temp/build.log'.
 * The ebuild environment file is located at '/var/tmp/portage/net-nds/openldap-2.4.44-r1/temp/environment'.
 * Working directory: '/var/tmp/portage/net-nds/openldap-2.4.44-r1/work/openldap-2.4.44-abi_x86_64.amd64'
 * S:
 * '/var/tmp/portage/net-nds/openldap-2.4.44-r1/work/openldap-2.4.44'

the part of [/quote]log of dev-lang/python-3.4.6:
[code:1:0b3b67285e]x86_64-pc-linux-gnu-gcc -pthread -fPIC -Wno-unused-result -DNDEBUG -march=haswell -O3 -pipe -fwrapv -Werror=declaration-after-statement -I. -I/var/tmp/portage/dev-lang/python-3.4.6/work/Python-3.4.6/Include -I/var/tmp/portage/dev-lang/python-3.4.6/work/x86_64-pc-linux-gnu -c /var/tmp/portage/dev-lang/python-3.4.6/work/Python-3.4.6/Modules/_ssl.c -o build/temp.linux-x86_64-3.4/var/tmp/portage/dev-lang/python-3.4.6/work/Python-3.4.6/Modules/_ssl.o
/var/tmp/portage/dev-lang/python-3.4.6/work/Python-3.4.6/Modules/_ssl.c: In function '_create_tuple_for_X509_NAME':
/var/tmp/portage/dev-lang/python-3.4.6/work/Python-3.4.6/Modules/_ssl.c:694:35: error: dereferencing pointer to incomplete type 'X509_NAME_ENTRY {aka struct X509_name_entry_st}'
if (rdn_level != entry->set) {
^
/var/tmp/portage/dev-lang/python-3.4.6/work/Python-3.4.6/Modules/_ssl.c: In function '_get_peer_alt_names':
/var/tmp/portage/dev-lang/python-3.4.6/work/Python-3.4.6/Modules/_ssl.c:814:16: error: dereferencing pointer to incomplete type 'X509_EXTENSION {aka struct X509_extension_st}'
p = ext->value->data;
^
/var/tmp/portage/dev-lang/python-3.4.6/work/Python-3.4.6/Modules/_ssl.c:886:57: warning: implicit declaration of function 'ASN1_STRING_data' [-Wimplicit-function-declaration]
v = PyUnicode_FromStringAndSize((char *)ASN1_STRING_data(as),
^
/var/tmp/portage/dev-lang/python-3.4.6/work/Python-3.4.6/Modules/_ssl.c:886:49: warning: cast to pointer from integer of different size [-Wint-to-pointer-cast]
v = PyUnicode_FromStringAndSize((char *)ASN1_STRING_data(as),
^
/var/tmp/portage/dev-lang/python-3.4.6/work/Python-3.4.6/Modules/_ssl.c: In function '_get_crl_dp':
/var/tmp/portage/dev-lang/python-3.4.6/work/Python-3.4.6/Modules/_ssl.c:1041:22: error: dereferencing pointer to incomplete type 'X509 {aka struct x509_st}'
dps = certificate->crldp;
^
/var/tmp/portage/dev-lang/python-3.4.6/work/Python-3.4.6/Modules/_ssl.c: In function '_decode_certificate':
/var/tmp/portage/dev-lang/python-3.4.6/work/Python-3.4.6/Modules/_ssl.c:1164:17: warning: implicit declaration of function 'X509_get_notBefore' [-Wimplicit-function-declaration]
notBefore = X509_get_notBefore(certificate);
^
/var/tmp/portage/dev-lang/python-3.4.6/work/Python-3.4.6/Modules/_ssl.c:1164:15: warning: assignment makes pointer from integer without a cast [-Wint-conversion]
notBefore = X509_get_notBefore(certificate);
^
/var/tmp/portage/dev-lang/python-3.4.6/work/Python-3.4.6/Modules/_ssl.c:1181:16: warning: implicit declaration of function 'X509_get_notAfter' [-Wimplicit-function-declaration]
notAfter = X509_get_notAfter(certificate);
^
/var/tmp/portage/dev-lang/python-3.4.6/work/Python-3.4.6/Modules/_ssl.c:1181:14: warning: assignment makes pointer from integer without a cast [-Wint-conversion]
notAfter = X509_get_notAfter(certificate);
^
/var/tmp/portage/dev-lang/python-3.4.6/work/Python-3.4.6/Modules/_ssl.c: In function 'PySSL_compression':
/var/tmp/portage/dev-lang/python-3.4.6/work/Python-3.4.6/Modules/_ssl.c:1430:43: error: dereferencing pointer to incomplete type 'COMP_METHOD {aka const struct comp_method_st}'
if (comp_method == NULL || comp_method->type == NID_undef)
^
/var/tmp/portage/dev-lang/python-3.4.6/work/Python-3.4.6/Modules/_ssl.c: In function 'context_new':
/var/tmp/portage/dev-lang/python-3.4.6/work/Python-3.4.6/Modules/_ssl.c:1991:27: warning: implicit declaration of function 'TLSv1_method' [-Wimplicit-function-declaration]
ctx = SSL_CTX_new(TLSv1_method());
^
/var/tmp/portage/dev-lang/python-3.4.6/work/Python-3.4.6/Modules/_ssl.c:1991:27: warning: passing argument 1 of 'SSL_CTX_new' makes pointer from integer without a cast [-Wint-conversion]
In file included from /var/tmp/portage/dev-lang/python-3.4.6/work/Python-3.4.6/Modules/_ssl.c:64:0:
/usr/include/openssl/ssl.h:1321:17: note: expected 'const SSL_METHOD * {aka const struct ssl_method_st *}' but argument is of type 'int'
__owur SSL_CTX *SSL_CTX_new(const SSL_METHOD *meth);
^
/var/tmp/portage/dev-lang/python-3.4.6/work/Python-3.4.6/Modules/_ssl.c:1994:27: warning: implicit declaration of function 'TLSv1_1_method' [-Wimplicit-function-declaration]
ctx = SSL_CTX_new(TLSv1_1_method());
^
/var/tmp/portage/dev-lang/python-3.4.6/work/Python-3.4.6/Modules/_ssl.c:1994:27: warning: passing argument 1 of 'SSL_CTX_new' makes pointer from integer without a cast [-Wint-conversion]
In file included from /var/tmp/portage/dev-lang/python-3.4.6/work/Python-3.4.6/Modules/_ssl.c:64:0:
/usr/include/openssl/ssl.h:1321:17: note: expected 'const SSL_METHOD * {aka const struct ssl_method_st *}' but argument is of type 'int'
__owur SSL_CTX *SSL_CTX_new(const SSL_METHOD *meth);
^
/var/tmp/portage/dev-lang/python-3.4.6/work/Python-3.4.6/Modules/_ssl.c:1996:27: warning: implicit declaration of function 'TLSv1_2_method' [-Wimplicit-function-declaration]
ctx = SSL_CTX_new(TLSv1_2_method());
^
/var/tmp/portage/dev-lang/python-3.4.6/work/Python-3.4.6/Modules/_ssl.c:1996:27: warning: passing argument 1 of 'SSL_CTX_new' makes pointer from integer without a cast [-Wint-conversion]
In file included from /var/tmp/portage/dev-lang/python-3.4.6/work/Python-3.4.6/Modules/_ssl.c:64:0:
/usr/include/openssl/ssl.h:1321:17: note: expected 'const SSL_METHOD * {aka const struct ssl_method_st *}' but argument is of type 'int'
__owur SSL_CTX *SSL_CTX_new(const SSL_METHOD *meth);
^
/var/tmp/portage/dev-lang/python-3.4.6/work/Python-3.4.6/Modules/_ssl.c:2004:27: warning: implicit declaration of function 'SSLv2_method' [-Wimplicit-function-declaration]
ctx = SSL_CTX_new(SSLv2_method());
^
/var/tmp/portage/dev-lang/python-3.4.6/work/Python-3.4.6/Modules/_ssl.c:2004:27: warning: passing argument 1 of 'SSL_CTX_new' makes pointer from integer without a cast [-Wint-conversion]
In file included from /var/tmp/portage/dev-lang/python-3.4.6/work/Python-3.4.6/Modules/_ssl.c:64:0:
/usr/include/openssl/ssl.h:1321:17: note: expected 'const SSL_METHOD * {aka const struct ssl_method_st *}' but argument is of type 'int'
__owur SSL_CTX *SSL_CTX_new(const SSL_METHOD *meth);
^
/var/tmp/portage/dev-lang/python-3.4.6/work/Python-3.4.6/Modules/_ssl.c: In function 'get_verify_flags':
/var/tmp/portage/dev-lang/python-3.4.6/work/Python-3.4.6/Modules/_ssl.c:2265:46: error: dereferencing pointer to incomplete type 'X509_STORE {aka struct x509_store_st}'
flags = X509_VERIFY_PARAM_get_flags(store->param);
^
/var/tmp/portage/dev-lang/python-3.4.6/work/Python-3.4.6/Modules/_ssl.c: In function 'load_cert_chain':
/var/tmp/portage/dev-lang/python-3.4.6/work/Python-3.4.6/Modules/_ssl.c:2458:48: error: dereferencing pointer to incomplete type 'SSL_CTX {aka struct ssl_ctx_st}'
pem_password_cb *orig_passwd_cb = self->ctx->default_passwd_callback;
^
/var/tmp/portage/dev-lang/python-3.4.6/work/Python-3.4.6/Modules/_ssl.c: In function 'load_dh_params':
/var/tmp/portage/dev-lang/python-3.4.6/work/Python-3.4.6/Modules/_ssl.c:2776:5: warning: implicit declaration of function 'DH_free' [-Wimplicit-function-declaration]
DH_free(dh);
^
/var/tmp/portage/dev-lang/python-3.4.6/work/Python-3.4.6/Modules/_ssl.c: In function 'cert_store_stats':
/var/tmp/portage/dev-lang/python-3.4.6/work/Python-3.4.6/Modules/_ssl.c:3045:20: error: dereferencing pointer to incomplete type 'X509_OBJECT {aka struct x509_object_st}'
switch (obj->type) {
^
/var/tmp/portage/dev-lang/python-3.4.6/work/Python-3.4.6/Modules/_ssl.c:3055:18: error: 'X509_LU_PKEY' undeclared (first use in this function)
case X509_LU_PKEY:
^
/var/tmp/portage/dev-lang/python-3.4.6/work/Python-3.4.6/Modules/_ssl.c:3055:18: note: each undeclared identifier is reported only once for each function it appears in
/var/tmp/portage/dev-lang/python-3.4.6/work/Python-3.4.6/Modules/_ssl.c: In function 'PySSL_RAND':
/var/tmp/portage/dev-lang/python-3.4.6/work/Python-3.4.6/Modules/_ssl.c:3265:14: warning: implicit declaration of function 'RAND_pseudo_bytes' [-Wimplicit-function-declaration]
ok = RAND_pseudo_bytes((unsigned char*)PyBytes_AS_STRING(bytes), len);
^
/var/tmp/portage/dev-lang/python-3.4.6/work/Python-3.4.6/Modules/_ssl.c: At top level:
/var/tmp/portage/dev-lang/python-3.4.6/work/Python-3.4.6/Modules/_ssl.c:3789:24: error: unknown type name 'CRYPTO_THREADID'
_ssl_threadid_callback(CRYPTO_THREADID *id)
^
/var/tmp/portage/dev-lang/python-3.4.6/work/Python-3.4.6/Modules/_ssl.c: In function '_ssl_thread_locking_function':
/var/tmp/portage/dev-lang/python-3.4.6/work/Python-3.4.6/Modules/_ssl.c:3822:16: error: 'CRYPTO_LOCK' undeclared (first use in this function)
if (mode & CRYPTO_LOCK) {
^
/var/tmp/portage/dev-lang/python-3.4.6/work/Python-3.4.6/Modules/_ssl.c: In function '_setup_ssl_threads':
/var/tmp/portage/dev-lang/python-3.4.6/work/Python-3.4.6/Modules/_ssl.c:3834:28: warning: implicit declaration of function 'CRYPTO_num_locks' [-Wimplicit-function-declaration]
_ssl_locks_count = CRYPTO_num_locks();
^
/var/tmp/portage/dev-lang/python-3.4.6/work/Python-3.4.6/Modules/_ssl.c:3853:9: warning: implicit declaration of function 'CRYPTO_set_locking_callback' [-Wimplicit-function-declaration]
CRYPTO_set_locking_callback(_ssl_thread_locking_function);
^
/var/tmp/portage/dev-lang/python-3.4.6/work/Python-3.4.6/Modules/_ssl.c:3855:9: warning: implicit declaration of function 'CRYPTO_THREADID_set_callback' [-Wimplicit-function-declaration]
CRYPTO_THREADID_set_callback(_ssl_threadid_callback);
^
/var/tmp/portage/dev-lang/python-3.4.6/work/Python-3.4.6/Modules/_ssl.c:3855:38: error: '_ssl_threadid_callback' undeclared (first use in this function)
CRYPTO_THREADID_set_callback(_ssl_threadid_callback);
^
/var/tmp/portage/dev-lang/python-3.4.6/work/Python-3.4.6/Modules/_ssl.c: In function 'PyInit__ssl':
/var/tmp/portage/dev-lang/python-3.4.6/work/Python-3.4.6/Modules/_ssl.c:3927:5: warning: implicit declaration of function 'SSL_load_error_strings' [-Wimplicit-function-declaration]
SSL_load_error_strings();
^
/var/tmp/portage/dev-lang/python-3.4.6/work/Python-3.4.6/Modules/_ssl.c:3928:5: warning: implicit declaration of function 'SSL_library_init' [-Wimplicit-function-declaration]
SSL_library_init();
^
/var/tmp/portage/dev-lang/python-3.4.6/work/Python-3.4.6/Modules/_ssl.c:3935:5: warning: implicit declaration of function 'OpenSSL_add_all_algorithms' [-Wimplicit-function-declaration]
OpenSSL_add_all_algorithms();
^
/var/tmp/portage/dev-lang/python-3.4.6/work/Python-3.4.6/Modules/_ssl.c:4189:14: warning: implicit declaration of function 'SSLeay' [-Wimplicit-function-declaration]
libver = SSLeay();
^
/var/tmp/portage/dev-lang/python-3.4.6/work/Python-3.4.6/Modules/_ssl.c:4199:30: warning: implicit declaration of function 'SSLeay_version' [-Wimplicit-function-declaration]
r = PyUnicode_FromString(SSLeay_version(SSLEAY_VERSION));
^
/var/tmp/portage/dev-lang/python-3.4.6/work/Python-3.4.6/Modules/_ssl.c:4199:45: error: 'SSLEAY_VERSION' undeclared (first use in this function)
r = PyUnicode_FromString(SSLeay_version(SSLEAY_VERSION));
^
building '_hashlib' extension
x86_64-pc-linux-gnu-gcc -pthread -fPIC -Wno-unused-result -DNDEBUG -march=haswell -O3 -pipe -fwrapv -Werror=declaration-after-statement -I. -I/var/tmp/portage/dev-lang/python-3.4.6/work/Python-3.4.6/Include -I/var/tmp/portage/dev-lang/python-3.4.6/work/x86_64-pc-linux-gnu -c /var/tmp/portage/dev-lang/python-3.4.6/work/Python-3.4.6/Modules/_hashopenssl.c -o build/temp.linux-x86_64-3.4/var/tmp/portage/dev-lang/python-3.4.6/work/Python-3.4.6/Modules/_hashopenssl.o
/var/tmp/portage/dev-lang/python-3.4.6/work/Python-3.4.6/Modules/_hashopenssl.c:42:26: error: field 'ctx' has incomplete type
EVP_MD_CTX ctx; /* OpenSSL message digest context */
^
/var/tmp/portage/dev-lang/python-3.4.6/work/Python-3.4.6/Modules/_hashopenssl.c: In function 'EVP_dealloc':
/var/tmp/portage/dev-lang/python-3.4.6/work/Python-3.4.6/Modules/_hashopenssl.c:109:5: warning: implicit declaration of function 'EVP_MD_CTX_cleanup' [-Wimplicit-function-declaration]
EVP_MD_CTX_cleanup(&self->ctx);
^
/var/tmp/portage/dev-lang/python-3.4.6/work/Python-3.4.6/Modules/_hashopenssl.c: In function 'EVP_digest':
/var/tmp/portage/dev-lang/python-3.4.6/work/Python-3.4.6/Modules/_hashopenssl.c:145:16: error: storage size of 'temp_ctx' isn't known
EVP_MD_CTX temp_ctx;
^
/var/tmp/portage/dev-lang/python-3.4.6/work/Python-3.4.6/Modules/_hashopenssl.c: In function 'EVP_hexdigest':
/var/tmp/portage/dev-lang/python-3.4.6/work/Python-3.4.6/Modules/_hashopenssl.c:165:16: error: storage size of 'temp_ctx' isn't known
EVP_MD_CTX temp_ctx;
^
/var/tmp/portage/dev-lang/python-3.4.6/work/Python-3.4.6/Modules/_hashopenssl.c: In function 'PKCS5_PBKDF2_HMAC_fast':
/var/tmp/portage/dev-lang/python-3.4.6/work/Python-3.4.6/Modules/_hashopenssl.c:497:14: error: storage size of 'hctx_tpl' isn't known
HMAC_CTX hctx_tpl, hctx;
^
/var/tmp/portage/dev-lang/python-3.4.6/work/Python-3.4.6/Modules/_hashopenssl.c:497:24: error: storage size of 'hctx' isn't known
HMAC_CTX hctx_tpl, hctx;
^
/var/tmp/portage/dev-lang/python-3.4.6/work/Python-3.4.6/Modules/_hashopenssl.c:503:5: warning: implicit declaration of function 'HMAC_CTX_init' [-Wimplicit-function-declaration]
HMAC_CTX_init(&hctx_tpl);
^
/var/tmp/portage/dev-lang/python-3.4.6/work/Python-3.4.6/Modules/_hashopenssl.c:508:9: warning: implicit declaration of function 'HMAC_CTX_cleanup' [-Wimplicit-function-declaration]
HMAC_CTX_cleanup(&hctx_tpl);
^
/var/tmp/portage/dev-lang/python-3.4.6/work/Python-3.4.6/Modules/_hashopenssl.c: In function 'PyInit__hashlib':
/var/tmp/portage/dev-lang/python-3.4.6/work/Python-3.4.6/Modules/_hashopenssl.c:848:5: warning: implicit declaration of function 'OpenSSL_add_all_digests' [-Wimplicit-function-declaration]
OpenSSL_add_all_digests();
^
/var/tmp/portage/dev-lang/python-3.4.6/work/Python-3.4.6/Modules/_hashopenssl.c:849:5: warning: implicit declaration of function 'ERR_load_crypto_strings' [-Wimplicit-function-declaration]
ERR_load_crypto_strings();
^
building '_sha256' extension
x86_64-pc-linux-gnu-gcc -pthread -fPIC -Wno-unused-result -DNDEBUG -march=haswell -O3 -pipe -fwrapv -Werror=declaration-after-statement -I. -I/var/tmp/portage/dev-lang/python-3.4.6/work/Python-3.4.6/Include -I/var/tmp/portage/dev-lang/python-3.4.6/work/x86_64-pc-linux-gnu -c /var/tmp/portage/dev-lang/python-3.4.6/work/Python-3.4.6/Modules/sha256module.c -o build/temp.linux-x86_64-3.4/var/tmp/portage/dev-lang/python-3.4.6/work/Python-3.4.6/Modules/sha256module.o
x86_64-pc-linux-gnu-gcc -pthread -shared -Wl,-O1 -Wl,--as-needed -L. -Wno-unused-result -DNDEBUG -march=haswell -O3 -pipe -fwrapv build/temp.linux-x86_64-3.4/var/tmp/portage/dev-lang/python-3.4.6/work/Python-3.4.6/Modules/sha256module.o -L. -L/usr/local/lib64 -lpython3.4m -o build/lib.linux-x86_64-3.4/_sha256.cpython-34m.so
building '_sha512' extension
x86_64-pc-linux-gnu-gcc -pthread -fPIC -Wno-unused-result -DNDEBUG -march=haswell -O3 -pipe -fwrapv -Werror=declaration-after-statement -I. -I/var/tmp/portage/dev-lang/python-3.4.6/work/Python-3.4.6/Include -I/var/tmp/portage/dev-lang/python-3.4.6/work/x86_64-pc-linux-gnu -c /var/tmp/portage/dev-lang/python-3.4.6/work/Python-3.4.6/Modules/sha512module.c -o build/temp.linux-x86_64-3.4/var/tmp/portage/dev-lang/python-3.4.6/work/Python-3.4.6/Modules/sha512module.o
x86_64-pc-linux-gnu-gcc -pthread -shared -Wl,-O1 -Wl,--as-needed -L. -Wno-unused-result -DNDEBUG -march=haswell -O3 -pipe -fwrapv build/temp.linux-x86_64-3.4/var/tmp/portage/dev-lang/python-3.4.6/work/Python-3.4.6/Modules/sha512module.o -L. -L/usr/local/lib64 -lpython3.4m -o build/lib.linux-x86_64-3.4/_sha512.cpython-34m.so
building '_md5' extension
x86_64-pc-linux-gnu-gcc -pthread -fPIC -Wno-unused-result -DNDEBUG -march=haswell -O3 -pipe -fwrapv -Werror=declaration-after-statement -I. -I/var/tmp/portage/dev-lang/python-3.4.6/work/Python-3.4.6/Include -I/var/tmp/portage/dev-lang/python-3.4.6/work/x86_64-pc-linux-gnu -c /var/tmp/portage/dev-lang/python-3.4.6/work/Python-3.4.6/Modules/md5module.c -o build/temp.linux-x86_64-3.4/var/tmp/portage/dev-lang/python-3.4.6/work/Python-3.4.6/Modules/md5module.o
x86_64-pc-linux-gnu-gcc -pthread -shared -Wl,-O1 -Wl,--as-needed -L. -Wno-unused-result -DNDEBUG -march=haswell -O3 -pipe -fwrapv build/temp.linux-x86_64-3.4/var/tmp/portage/dev-lang/python-3.4.6/work/Python-3.4.6/Modules/md5module.o -L. -L/usr/local/lib64 -lpython3.4m -o build/lib.linux-x86_64-3.4/_md5.cpython-34m.so
building '_sha1' extension
x86_64-pc-linux-gnu-gcc -pthread -fPIC -Wno-unused-result -DNDEBUG -march=haswell -O3 -pipe -fwrapv -Werror=declaration-after-statement -I. -I/var/tmp/portage/dev-lang/python-3.4.6/work/Python-3.4.6/Include -I/var/tmp/portage/dev-lang/python-3.4.6/work/x86_64-pc-linux-gnu -c /var/tmp/portage/dev-lang/python-3.4.6/work/Python-3.4.6/Modules/sha1module.c -o build/temp.linux-x86_64-3.4/var/tmp/portage/dev-lang/python-3.4.6/work/Python-3.4.6/Modules/sha1module.o
x86_64-pc-linux-gnu-gcc -pthread -shared -Wl,-O1 -Wl,--as-needed -L. -Wno-unused-result -DNDEBUG -march=haswell -O3 -pipe -fwrapv build/temp.linux-x86_64-3.4/var/tmp/portage/dev-lang/python-3.4.6/work/Python-3.4.6/Modules/sha1module.o -L. -L/usr/local/lib64 -lpython3.4m -o build/lib.linux-x86_64-3.4/_sha1.cpython-34m.so
building '_dbm' extension
x86_64-pc-linux-gnu-gcc -pthread -fPIC -Wno-unused-result -DNDEBUG -march=haswell -O3 -pipe -fwrapv -Werror=declaration-after-statement -DHAVE_GDBM_NDBM_H -I. -I/var/tmp/portage/dev-lang/python-3.4.6/work/Python-3.4.6/Include -I/var/tmp/portage/dev-lang/python-3.4.6/work/x86_64-pc-linux-gnu -c /var/tmp/portage/dev-lang/python-3.4.6/work/Python-3.4.6/Modules/_dbmmodule.c -o build/temp.linux-x86_64-3.4/var/tmp/portage/dev-lang/python-3.4.6/work/Python-3.4.6/Modules/_dbmmodule.o
x86_64-pc-linux-gnu-gcc -pthread -shared -Wl,-O1 -Wl,--as-needed -L. -Wno-unused-result -DNDEBUG -march=haswell -O3 -pipe -fwrapv build/temp.linux-x86_64-3.4/var/tmp/portage/dev-lang/python-3.4.6/work/Python-3.4.6/Modules/_dbmmodule.o -L. -L/usr/local/lib64 -lgdbm -lgdbm_compat -lpython3.4m -o build/lib.linux-x86_64-3.4/_dbm.cpython-34m.so
building '_gdbm' extension
x86_64-pc-linux-gnu-gcc -pthread -fPIC -Wno-unused-result -DNDEBUG -march=haswell -O3 -pipe -fwrapv -Werror=declaration-after-statement -I. -I/var/tmp/portage/dev-lang/python-3.4.6/work/Python-3.4.6/Include -I/var/tmp/portage/dev-lang/python-3.4.6/work/x86_64-pc-linux-gnu -c /var/tmp/portage/dev-lang/python-3.4.6/work/Python-3.4.6/Modules/_gdbmmodule.c -o build/temp.linux-x86_64-3.4/var/tmp/portage/dev-lang/python-3.4.6/work/Python-3.4.6/Modules/_gdbmmodule.o
x86_64-pc-linux-gnu-gcc -pthread -shared -Wl,-O1 -Wl,--as-needed -L. -Wno-unused-result -DNDEBUG -march=haswell -O3 -pipe -fwrapv build/temp.linux-x86_64-3.4/var/tmp/portage/dev-lang/python-3.4.6/work/Python-3.4.6/Modules/_gdbmmodule.o -L. -L/usr/local/lib64 -lgdbm -lpython3.4m -o build/lib.linux-x86_64-3.4/_gdbm.cpython-34m.so
building 'termios' extension
x86_64-pc-linux-gnu-gcc -pthread -fPIC -Wno-unused-result -DNDEBUG -march=haswell -O3 -pipe -fwrapv -Werror=declaration-after-statement -I. -I/var/tmp/portage/dev-lang/python-3.4.6/work/Python-3.4.6/Include -I/var/tmp/portage/dev-lang/python-3.4.6/work/x86_64-pc-linux-gnu -c /var/tmp/portage/dev-lang/python-3.4.6/work/Python-3.4.6/Modules/termios.c -o build/temp.linux-x86_64-3.4/var/tmp/portage/dev-lang/python-3.4.6/work/Python-3.4.6/Modules/termios.o
x86_64-pc-linux-gnu-gcc -pthread -shared -Wl,-O1 -Wl,--as-needed -L. -Wno-unused-result -DNDEBUG -march=haswell -O3 -pipe -fwrapv build/temp.linux-x86_64-3.4/var/tmp/portage/dev-lang/python-3.4.6/work/Python-3.4.6/Modules/termios.o -L. -L/usr/local/lib64 -lpython3.4m -o build/lib.linux-x86_64-3.4/termios.cpython-34m.so
building 'resource' extension
x86_64-pc-linux-gnu-gcc -pthread -fPIC -Wno-unused-result -DNDEBUG -march=haswell -O3 -pipe -fwrapv -Werror=declaration-after-statement -I. -I/var/tmp/portage/dev-lang/python-3.4.6/work/Python-3.4.6/Include -I/var/tmp/portage/dev-lang/python-3.4.6/work/x86_64-pc-linux-gnu -c /var/tmp/portage/dev-lang/python-3.4.6/work/Python-3.4.6/Modules/resource.c -o build/temp.linux-x86_64-3.4/var/tmp/portage/dev-lang/python-3.4.6/work/Python-3.4.6/Modules/resource.o
x86_64-pc-linux-gnu-gcc -pthread -shared -Wl,-O1 -Wl,--as-needed -L. -Wno-unused-result -DNDEBUG -march=haswell -O3 -pipe -fwrapv build/temp.linux-x86_64-3.4/var/tmp/portage/dev-lang/python-3.4.6/work/Python-3.4.6/Modules/resource.o -L. -L/usr/local/lib64 -lpython3.4m -o build/lib.linux-x86_64-3.4/resource.cpython-34m.so
building 'nis' extension
x86_64-pc-linux-gnu-gcc -pthread -fPIC -Wno-unused-result -DNDEBUG -march=haswell -O3 -pipe -fwrapv -Werror=declaration-after-statement -I. -I/var/tmp/portage/dev-lang/python-3.4.6/work/Python-3.4.6/Include -I/var/tmp/portage/dev-lang/python-3.4.6/work/x86_64-pc-linux-gnu -c /var/tmp/portage/dev-lang/python-3.4.6/work/Python-3.4.6/Modules/nismodule.c -o build/temp.linux-x86_64-3.4/var/tmp/portage/dev-lang/python-3.4.6/work/Python-3.4.6/Modules/nismodule.o
x86_64-pc-linux-gnu-gcc -pthread -shared -Wl,-O1 -Wl,--as-needed -L. -Wno-unused-result -DNDEBUG -march=haswell -O3 -pipe -fwrapv build/temp.linux-x86_64-3.4/var/tmp/portage/dev-lang/python-3.4.6/work/Python-3.4.6/Modules/nismodule.o -L. -L/usr/local/lib64 -lnsl -lpython3.4m -o build/lib.linux-x86_64-3.4/nis.cpython-34m.so
building '_curses' extension
x86_64-pc-linux-gnu-gcc -pthread -fPIC -Wno-unused-result -DNDEBUG -march=haswell -O3 -pipe -fwrapv -Werror=declaration-after-statement -DHAVE_NCURSESW=1 -I/usr/include/ncursesw -I. -I/var/tmp/portage/dev-lang/python-3.4.6/work/Python-3.4.6/Include -I/var/tmp/portage/dev-lang/python-3.4.6/work/x86_64-pc-linux-gnu -c /var/tmp/portage/dev-lang/python-3.4.6/work/Python-3.4.6/Modules/_cursesmodule.c -o build/temp.linux-x86_64-3.4/var/tmp/portage/dev-lang/python-3.4.6/work/Python-3.4.6/Modules/_cursesmodule.o
x86_64-pc-linux-gnu-gcc -pthread -shared -Wl,-O1 -Wl,--as-needed -L. -Wno-unused-result -DNDEBUG -march=haswell -O3 -pipe -fwrapv build/temp.linux-x86_64-3.4/var/tmp/portage/dev-lang/python-3.4.6/work/Python-3.4.6/Modules/_cursesmodule.o -L. -L/usr/local/lib64 -lncursesw -lpython3.4m -o build/lib.linux-x86_64-3.4/_curses.cpython-34m.so
building '_curses_panel' extension
x86_64-pc-linux-gnu-gcc -pthread -fPIC -Wno-unused-result -DNDEBUG -march=haswell -O3 -pipe -fwrapv -Werror=declaration-after-statement -DHAVE_NCURSESW=1 -I/usr/include/ncursesw -I. -I/var/tmp/portage/dev-lang/python-3.4.6/work/Python-3.4.6/Include -I/var/tmp/portage/dev-lang/python-3.4.6/work/x86_64-pc-linux-gnu -c /var/tmp/portage/dev-lang/python-3.4.6/work/Python-3.4.6/Modules/_curses_panel.c -o build/temp.linux-x86_64-3.4/var/tmp/portage/dev-lang/python-3.4.6/work/Python-3.4.6/Modules/_curses_panel.o
x86_64-pc-linux-gnu-gcc -pthread -shared -Wl,-O1 -Wl,--as-needed -L. -Wno-unused-result -DNDEBUG -march=haswell -O3 -pipe -fwrapv build/temp.linux-x86_64-3.4/var/tmp/portage/dev-lang/python-3.4.6/work/Python-3.4.6/Modules/_curses_panel.o -L. -L/usr/local/lib64 -lpanelw -lncursesw -lpython3.4m -o build/lib.linux-x86_64-3.4/_curses_panel.cpython-34m.so
building 'zlib' extension
x86_64-pc-linux-gnu-gcc -pthread -fPIC -Wno-unused-result -DNDEBUG -march=haswell -O3 -pipe -fwrapv -Werror=declaration-after-statement -I. -I/var/tmp/portage/dev-lang/python-3.4.6/work/Python-3.4.6/Include -I/var/tmp/portage/dev-lang/python-3.4.6/work/x86_64-pc-linux-gnu -c /var/tmp/portage/dev-lang/python-3.4.6/work/Python-3.4.6/Modules/zlibmodule.c -o build/temp.linux-x86_64-3.4/var/tmp/portage/dev-lang/python-3.4.6/work/Python-3.4.6/Modules/zlibmodule.o
x86_64-pc-linux-gnu-gcc -pthread -shared -Wl,-O1 -Wl,--as-needed -L. -Wno-unused-result -DNDEBUG -march=haswell -O3 -pipe -fwrapv build/temp.linux-x86_64-3.4/var/tmp/portage/dev-lang/python-3.4.6/work/Python-3.4.6/Modules/zlibmodule.o -L. -L/usr/local/lib64 -lz -lpython3.4m -o build/lib.linux-x86_64-3.4/zlib.cpython-34m.so
building 'binascii' extension
x86_64-pc-linux-gnu-gcc -pthread -fPIC -Wno-unused-result -DNDEBUG -march=haswell -O3 -pipe -fwrapv -Werror=declaration-after-statement -I. -I/var/tmp/portage/dev-lang/python-3.4.6/work/Python-3.4.6/Include -I/var/tmp/portage/dev-lang/python-3.4.6/work/x86_64-pc-linux-gnu -c /var/tmp/portage/dev-lang/python-3.4.6/work/Python-3.4.6/Modules/binascii.c -o build/temp.linux-x86_64-3.4/var/tmp/portage/dev-lang/python-3.4.6/work/Python-3.4.6/Modules/binascii.o -DUSE_ZLIB_CRC32
x86_64-pc-linux-gnu-gcc -pthread -shared -Wl,-O1 -Wl,--as-needed -L. -Wno-unused-result -DNDEBUG -march=haswell -O3 -pipe -fwrapv build/temp.linux-x86_64-3.4/var/tmp/portage/dev-lang/python-3.4.6/work/Python-3.4.6/Modules/binascii.o -L. -L/usr/local/lib64 -lz -lpython3.4m -o build/lib.linux-x86_64-3.4/binascii.cpython-34m.so
building '_bz2' extension
x86_64-pc-linux-gnu-gcc -pthread -fPIC -Wno-unused-result -DNDEBUG -march=haswell -O3 -pipe -fwrapv -Werror=declaration-after-statement -I. -I/var/tmp/portage/dev-lang/python-3.4.6/work/Python-3.4.6/Include -I/var/tmp/portage/dev-lang/python-3.4.6/work/x86_64-pc-linux-gnu -c /var/tmp/portage/dev-lang/python-3.4.6/work/Python-3.4.6/Modules/_bz2module.c -o build/temp.linux-x86_64-3.4/var/tmp/portage/dev-lang/python-3.4.6/work/Python-3.4.6/Modules/_bz2module.o
x86_64-pc-linux-gnu-gcc -pthread -shared -Wl,-O1 -Wl,--as-needed -L. -Wno-unused-result -DNDEBUG -march=haswell -O3 -pipe -fwrapv build/temp.linux-x86_64-3.4/var/tmp/portage/dev-lang/python-3.4.6/work/Python-3.4.6/Modules/_bz2module.o -L. -L/usr/local/lib64 -lbz2 -lpython3.4m -o build/lib.linux-x86_64-3.4/_bz2.cpython-34m.so
building '_lzma' extension
x86_64-pc-linux-gnu-gcc -pthread -fPIC -Wno-unused-result -DNDEBUG -march=haswell -O3 -pipe -fwrapv -Werror=declaration-after-statement -I. -I/var/tmp/portage/dev-lang/python-3.4.6/work/Python-3.4.6/Include -I/var/tmp/portage/dev-lang/python-3.4.6/work/x86_64-pc-linux-gnu -c /var/tmp/portage/dev-lang/python-3.4.6/work/Python-3.4.6/Modules/_lzmamodule.c -o build/temp.linux-x86_64-3.4/var/tmp/portage/dev-lang/python-3.4.6/work/Python-3.4.6/Modules/_lzmamodule.o
x86_64-pc-linux-gnu-gcc -pthread -shared -Wl,-O1 -Wl,--as-needed -L. -Wno-unused-result -DNDEBUG -march=haswell -O3 -pipe -fwrapv build/temp.linux-x86_64-3.4/var/tmp/portage/dev-lang/python-3.4.6/work/Python-3.4.6/Modules/_lzmamodule.o -L. -L/usr/local/lib64 -llzma -lpython3.4m -o build/lib.linux-x86_64-3.4/_lzma.cpython-34m.so
building 'pyexpat' extension
x86_64-pc-linux-gnu-gcc -pthread -fPIC -Wno-unused-result -DNDEBUG -march=haswell -O3 -pipe -fwrapv -Werror=declaration-after-statement -I. -I/var/tmp/portage/dev-lang/python-3.4.6/work/Python-3.4.6/Include -I/var/tmp/portage/dev-lang/python-3.4.6/work/x86_64-pc-linux-gnu -c /var/tmp/portage/dev-lang/python-3.4.6/work/Python-3.4.6/Modules/pyexpat.c -o build/temp.linux-x86_64-3.4/var/tmp/portage/dev-lang/python-3.4.6/work/Python-3.4.6/Modules/pyexpat.o
x86_64-pc-linux-gnu-gcc -pthread -shared -Wl,-O1 -Wl,--as-needed -L. -Wno-unused-result -DNDEBUG -march=haswell -O3 -pipe -fwrapv build/temp.linux-x86_64-3.4/var/tmp/portage/dev-lang/python-3.4.6/work/Python-3.4.6/Modules/pyexpat.o -L. -L/usr/local/lib64 -lexpat -lpython3.4m -o build/lib.linux-x86_64-3.4/pyexpat.cpython-34m.so
building '_elementtree' extension
x86_64-pc-linux-gnu-gcc -pthread -fPIC -Wno-unused-result -DNDEBUG -march=haswell -O3 -pipe -fwrapv -Werror=declaration-after-statement -DUSE_PYEXPAT_CAPI -I. -I/var/tmp/portage/dev-lang/python-3.4.6/work/Python-3.4.6/Include -I/var/tmp/portage/dev-lang/python-3.4.6/work/x86_64-pc-linux-gnu -c /var/tmp/portage/dev-lang/python-3.4.6/work/Python-3.4.6/Modules/_elementtree.c -o build/temp.linux-x86_64-3.4/var/tmp/portage/dev-lang/python-3.4.6/work/Python-3.4.6/Modules/_elementtree.o
x86_64-pc-linux-gnu-gcc -pthread -shared -Wl,-O1 -Wl,--as-needed -L. -Wno-unused-result -DNDEBUG -march=haswell -O3 -pipe -fwrapv build/temp.linux-x86_64-3.4/var/tmp/portage/dev-lang/python-3.4.6/work/Python-3.4.6/Modules/_elementtree.o -L. -L/usr/local/lib64 -lexpat -lpython3.4m -o build/lib.linux-x86_64-3.4/_elementtree.cpython-34m.so
building '_multibytecodec' extension
creating build/temp.linux-x86_64-3.4/var/tmp/portage/dev-lang/python-3.4.6/work/Python-3.4.6/Modules/cjkcodecs
x86_64-pc-linux-gnu-gcc -pthread -fPIC -Wno-unused-result -DNDEBUG -march=haswell -O3 -pipe -fwrapv -Werror=declaration-after-statement -I. -I/var/tmp/portage/dev-lang/python-3.4.6/work/Python-3.4.6/Include -I/var/tmp/portage/dev-lang/python-3.4.6/work/x86_64-pc-linux-gnu -c /var/tmp/portage/dev-lang/python-3.4.6/work/Python-3.4.6/Modules/cjkcodecs/multibytecodec.c -o build/temp.linux-x86_64-3.4/var/tmp/portage/dev-lang/python-3.4.6/work/Python-3.4.6/Modules/cjkcodecs/multibytecodec.o
x86_64-pc-linux-gnu-gcc -pthread -shared -Wl,-O1 -Wl,--as-needed -L. -Wno-unused-result -DNDEBUG -march=haswell -O3 -pipe -fwrapv build/temp.linux-x86_64-3.4/var/tmp/portage/dev-lang/python-3.4.6/work/Python-3.4.6/Modules/cjkcodecs/multibytecodec.o -L. -L/usr/local/lib64 -lpython3.4m -o build/lib.linux-x86_64-3.4/_multibytecodec.cpython-34m.so
building '_codecs_kr' extension
x86_64-pc-linux-gnu-gcc -pthread -fPIC -Wno-unused-result -DNDEBUG -march=haswell -O3 -pipe -fwrapv -Werror=declaration-after-statement -I. -I/var/tmp/portage/dev-lang/python-3.4.6/work/Python-3.4.6/Include -I/var/tmp/portage/dev-lang/python-3.4.6/work/x86_64-pc-linux-gnu -c /var/tmp/portage/dev-lang/python-3.4.6/work/Python-3.4.6/Modules/cjkcodecs/_codecs_kr.c -o build/temp.linux-x86_64-3.4/var/tmp/portage/dev-lang/python-3.4.6/work/Python-3.4.6/Modules/cjkcodecs/_codecs_kr.o
x86_64-pc-linux-gnu-gcc -pthread -shared -Wl,-O1 -Wl,--as-needed -L. -Wno-unused-result -DNDEBUG -march=haswell -O3 -pipe -fwrapv build/temp.linux-x86_64-3.4/var/tmp/portage/dev-lang/python-3.4.6/work/Python-3.4.6/Modules/cjkcodecs/_codecs_kr.o -L. -L/usr/local/lib64 -lpython3.4m -o build/lib.linux-x86_64-3.4/_codecs_kr.cpython-34m.so
building '_codecs_jp' extension
x86_64-pc-linux-gnu-gcc -pthread -fPIC -Wno-unused-result -DNDEBUG -march=haswell -O3 -pipe -fwrapv -Werror=declaration-after-statement -I. -I/var/tmp/portage/dev-lang/python-3.4.6/work/Python-3.4.6/Include -I/var/tmp/portage/dev-lang/python-3.4.6/work/x86_64-pc-linux-gnu -c /var/tmp/portage/dev-lang/python-3.4.6/work/Python-3.4.6/Modules/cjkcodecs/_codecs_jp.c -o build/temp.linux-x86_64-3.4/var/tmp/portage/dev-lang/python-3.4.6/work/Python-3.4.6/Modules/cjkcodecs/_codecs_jp.o
x86_64-pc-linux-gnu-gcc -pthread -shared -Wl,-O1 -Wl,--as-needed -L. -Wno-unused-result -DNDEBUG -march=haswell -O3 -pipe -fwrapv build/temp.linux-x86_64-3.4/var/tmp/portage/dev-lang/python-3.4.6/work/Python-3.4.6/Modules/cjkcodecs/_codecs_jp.o -L. -L/usr/local/lib64 -lpython3.4m -o build/lib.linux-x86_64-3.4/_codecs_jp.cpython-34m.so
building '_codecs_cn' extension
x86_64-pc-linux-gnu-gcc -pthread -fPIC -Wno-unused-result -DNDEBUG -march=haswell -O3 -pipe -fwrapv -Werror=declaration-after-statement -I. -I/var/tmp/portage/dev-lang/python-3.4.6/work/Python-3.4.6/Include -I/var/tmp/portage/dev-lang/python-3.4.6/work/x86_64-pc-linux-gnu -c /var/tmp/portage/dev-lang/python-3.4.6/work/Python-3.4.6/Modules/cjkcodecs/_codecs_cn.c -o build/temp.linux-x86_64-3.4/var/tmp/portage/dev-lang/python-3.4.6/work/Python-3.4.6/Modules/cjkcodecs/_codecs_cn.o
x86_64-pc-linux-gnu-gcc -pthread -shared -Wl,-O1 -Wl,--as-needed -L. -Wno-unused-result -DNDEBUG -march=haswell -O3 -pipe -fwrapv build/temp.linux-x86_64-3.4/var/tmp/portage/dev-lang/python-3.4.6/work/Python-3.4.6/Modules/cjkcodecs/_codecs_cn.o -L. -L/usr/local/lib64 -lpython3.4m -o build/lib.linux-x86_64-3.4/_codecs_cn.cpython-34m.so
building '_codecs_tw' extension
x86_64-pc-linux-gnu-gcc -pthread -fPIC -Wno-unused-result -DNDEBUG -march=haswell -O3 -pipe -fwrapv -Werror=declaration-after-statement -I. -I/var/tmp/portage/dev-lang/python-3.4.6/work/Python-3.4.6/Include -I/var/tmp/portage/dev-lang/python-3.4.6/work/x86_64-pc-linux-gnu -c /var/tmp/portage/dev-lang/python-3.4.6/work/Python-3.4.6/Modules/cjkcodecs/_codecs_tw.c -o build/temp.linux-x86_64-3.4/var/tmp/portage/dev-lang/python-3.4.6/work/Python-3.4.6/Modules/cjkcodecs/_codecs_tw.o
x86_64-pc-linux-gnu-gcc -pthread -shared -Wl,-O1 -Wl,--as-needed -L. -Wno-unused-result -DNDEBUG -march=haswell -O3 -pipe -fwrapv build/temp.linux-x86_64-3.4/var/tmp/portage/dev-lang/python-3.4.6/work/Python-3.4.6/Modules/cjkcodecs/_codecs_tw.o -L. -L/usr/local/lib64 -lpython3.4m -o build/lib.linux-x86_64-3.4/_codecs_tw.cpython-34m.so
building '_codecs_hk' extension
x86_64-pc-linux-gnu-gcc -pthread -fPIC -Wno-unused-resul


Last edited by YangMame on Tue Jun 20, 2017 9:51 am; edited 3 times in total
Back to top
View user's profile Send private message
fedeliallalinea
Bodhisattva
Bodhisattva


Joined: 08 Mar 2003
Posts: 15538
Location: here

PostPosted: Tue Jun 20, 2017 5:19 am    Post subject: Reply with quote

You should post full build.log with wgetpaste.
There are no errors in chunk of log that you posted
_________________
Questions are guaranteed in life; Answers aren't.
Back to top
View user's profile Send private message
YangMame
n00b
n00b


Joined: 20 Jun 2017
Posts: 6

PostPosted: Tue Jun 20, 2017 9:34 am    Post subject: Reply with quote

fedeliallalinea wrote:
You should post full build.log with wgetpaste.
There are no errors in chunk of log that you posted

ok ... please see it again...thks!
Back to top
View user's profile Send private message
fedeliallalinea
Bodhisattva
Bodhisattva


Joined: 08 Mar 2003
Posts: 15538
Location: here

PostPosted: Tue Jun 20, 2017 9:54 am    Post subject: Reply with quote

For openldap you can post output of commands
Code:
# emerge -pv net-nds/openldap
# emerge -pv dev-libs/openssl


For python problem you should use wgetpaste for post build.log, the forum truncate the posts that are too long.
_________________
Questions are guaranteed in life; Answers aren't.
Back to top
View user's profile Send private message
YangMame
n00b
n00b


Joined: 20 Jun 2017
Posts: 6

PostPosted: Tue Jun 20, 2017 10:13 am    Post subject: Reply with quote

fedeliallalinea wrote:
For openldap you can post output of commands
Code:
# emerge -pv net-nds/openldap
# emerge -pv dev-libs/openssl


For python problem you should use wgetpaste for post build.log, the forum truncate the posts that are too long.

Code:
 emerge -pv net-nds/openldap

These are the packages that would be merged, in order:

Calculating dependencies... done!
[ebuild  N     ] net-nds/openldap-2.4.44-r1::gentoo  USE="berkdb crypt ipv6 minimal ssl syslog tcpd -cxx -debug -experimental -gnutls -iodbc -kerberos -kinit -libressl -odbc -overlays -pbkdf2 -perl -samba -sasl (-selinux) -slp -smbkrb5passwd -static-libs" ABI_X86="(64) -32 (-x32)" 0 KiB

Total: 1 package (1 new), Size of downloads: 0 KiB

Code:
emerge -pv openssl

These are the packages that would be merged, in order:

Calculating dependencies... done!
[ebuild   R   #] dev-libs/openssl-1.1.0f:0/1.1::gentoo  USE="asm zlib -bindist -rfc3779 -sctp -static-libs {-test} -tls-heartbeat -vanilla" ABI_X86="(64) -32 (-x32)" CPU_FLAGS_X86="(sse2)" 0 KiB

Total: 1 package (1 reinstall), Size of downloads: 0 KiB

I'm a new gentoo user, so...

[Moderator edit: changed [quote] tags to [code] tags to preserve output layout. -Hu]
Back to top
View user's profile Send private message
YangMame
n00b
n00b


Joined: 20 Jun 2017
Posts: 6

PostPosted: Tue Jun 20, 2017 10:15 am    Post subject: Reply with quote

fedeliallalinea wrote:
For openldap you can post output of commands
Code:
# emerge -pv net-nds/openldap
# emerge -pv dev-libs/openssl


For python problem you should use wgetpaste for post build.log, the forum truncate the posts that are too long.

and the python log :https://paste.pound-python.org/show/Mh18w3ipeTHFKB2MkoyG/
Back to top
View user's profile Send private message
fedeliallalinea
Bodhisattva
Bodhisattva


Joined: 08 Mar 2003
Posts: 15538
Location: here

PostPosted: Tue Jun 20, 2017 10:20 am    Post subject: Reply with quote

Ok I think the problem is openssl-1.1.0f. It's strage that portage want to install this version because is hard masked.
You have in /etc/portage/package.unmask a openssl entry? If yes remove it
_________________
Questions are guaranteed in life; Answers aren't.
Back to top
View user's profile Send private message
YangMame
n00b
n00b


Joined: 20 Jun 2017
Posts: 6

PostPosted: Tue Jun 20, 2017 10:28 am    Post subject: Reply with quote

fedeliallalinea wrote:
Ok I think the problem is openssl-1.1.0f. It's strage that portage want to install this version because is hard masked.
You have in /etc/portage/package.unmask a openssl entry? If yes remove it

yeah..
Quote:
# required by net-misc/openssh-7.5_p1-r2::gentoo[ssl,-libressl,-static]
# required by virtual/ssh-0::gentoo[-minimal]
# required by @system
# required by @world (argument)
# /usr/portage/profiles/package.mask:
# Lars Wendler <polynomial-c@gentoo.org> (26 Aug 2016)
# Masked while being tested and reverse deps aren't fully compatible
=dev-libs/openssl-1.1.0f

just del =dev-libs/openssl-1.1.0f?
I am trying to emerge...
Back to top
View user's profile Send private message
fedeliallalinea
Bodhisattva
Bodhisattva


Joined: 08 Mar 2003
Posts: 15538
Location: here

PostPosted: Tue Jun 20, 2017 10:30 am    Post subject: Reply with quote

YangMame wrote:
just del =dev-libs/openssl-1.1.0f?
I am trying to emerge...

Yes or comment line adding # at the beginning
_________________
Questions are guaranteed in life; Answers aren't.
Back to top
View user's profile Send private message
YangMame
n00b
n00b


Joined: 20 Jun 2017
Posts: 6

PostPosted: Tue Jun 20, 2017 10:36 am    Post subject: Reply with quote

fedeliallalinea wrote:
YangMame wrote:
just del =dev-libs/openssl-1.1.0f?
I am trying to emerge...

Yes or comment line adding # at the beginning

OK it works,thank you!
Back to top
View user's profile Send private message
Display posts from previous:   
Reply to topic    Gentoo Forums Forum Index Gentoo on AMD64 All times are GMT
Page 1 of 1

 
Jump to:  
You cannot post new topics in this forum
You cannot reply to topics in this forum
You cannot edit your posts in this forum
You cannot delete your posts in this forum
You cannot vote in polls in this forum