Gentoo Forums
Gentoo Forums
Gentoo Forums
Quick Search: in
Проблема со сборкой зависимостей xorg
View unanswered posts
View posts from last 24 hours

 
Reply to topic    Gentoo Forums Forum Index Russian
View previous topic :: View next topic  
Author Message
ctull
n00b
n00b


Joined: 22 Mar 2005
Posts: 25
Location: Kaliningrad

PostPosted: Tue Mar 14, 2006 12:31 pm    Post subject: Проблема со сборкой зависимосте Reply with quote

Решил перейти с xfree на xorg, столкнулся с траблой, не хочет собираться некое ttmkfdir, пишет:
Code:

In file included from ttmkfdir.cpp:2:
/usr/lib/gcc-lib/i686-pc-linux-gnu/3.3.5-20050130/include/g++-v3/iostream:44:28: bits/c++config.h: No such file or directory
In file included from /usr/lib/gcc-lib/i686-pc-linux-gnu/3.3.5-20050130/include/g++-v3/ios:44,
                 from /usr/lib/gcc-lib/i686-pc-linux-gnu/3.3.5-20050130/include/g++-v3/ostream:45,
                 from /usr/lib/gcc-lib/i686-pc-linux-gnu/3.3.5-20050130/include/g++-v3/iostream:45,
                 from ttmkfdir.cpp:2:
/usr/lib/gcc-lib/i686-pc-linux-gnu/3.3.5-20050130/include/g++-v3/iosfwd:45:28: bits/c++config.h: No such file or directory
/usr/lib/gcc-lib/i686-pc-linux-gnu/3.3.5-20050130/include/g++-v3/iosfwd:46:29: bits/c++locale.h: No such file or directory
In file included from /usr/lib/gcc-lib/i686-pc-linux-gnu/3.3.5-20050130/include/g++-v3/iosfwd:47,
                 from /usr/lib/gcc-lib/i686-pc-linux-gnu/3.3.5-20050130/include/g++-v3/ios:44,
                 from /usr/lib/gcc-lib/i686-pc-linux-gnu/3.3.5-20050130/include/g++-v3/ostream:45,
                 from /usr/lib/gcc-lib/i686-pc-linux-gnu/3.3.5-20050130/include/g++-v3/iostream:45,
                 from ttmkfdir.cpp:2:
/usr/lib/gcc-lib/i686-pc-linux-gnu/3.3.5-20050130/include/g++-v3/cctype:48:28: bits/c++config.h: No such file or directory
In file included from /usr/lib/gcc-lib/i686-pc-linux-gnu/3.3.5-20050130/include/g++-v3/iosfwd:48,
                 from /usr/lib/gcc-lib/i686-pc-linux-gnu/3.3.5-20050130/include/g++-v3/ios:44,
                 from /usr/lib/gcc-lib/i686-pc-linux-gnu/3.3.5-20050130/include/g++-v3/ostream:45,
                 from /usr/lib/gcc-lib/i686-pc-linux-gnu/3.3.5-20050130/include/g++-v3/iostream:45,
                 from ttmkfdir.cpp:2:
/usr/lib/gcc-lib/i686-pc-linux-gnu/3.3.5-20050130/include/g++-v3/bits/stringfwd.h:44:28: bits/c++config.h: No such file or directory
In file included from /usr/lib/gcc-lib/i686-pc-linux-gnu/3.3.5-20050130/include/g++-v3/i686-pc-linux-gnu/bits/c++io.h:35,
                 from /usr/lib/gcc-lib/i686-pc-linux-gnu/3.3.5-20050130/include/g++-v3/bits/fpos.h:44,
                 from /usr/lib/gcc-lib/i686-pc-linux-gnu/3.3.5-20050130/include/g++-v3/iosfwd:49,
                 from /usr/lib/gcc-lib/i686-pc-linux-gnu/3.3.5-20050130/include/g++-v3/ios:44,
                 from /usr/lib/gcc-lib/i686-pc-linux-gnu/3.3.5-20050130/include/g++-v3/ostream:45,
                 from /usr/lib/gcc-lib/i686-pc-linux-gnu/3.3.5-20050130/include/g++-v3/iostream:45,
                 from ttmkfdir.cpp:2:
/usr/lib/gcc-lib/i686-pc-linux-gnu/3.3.5-20050130/include/g++-v3/cstdio:49:28: bits/c++config.h: No such file or directory
In file included from /usr/lib/gcc-lib/i686-pc-linux-gnu/3.3.5-20050130/include/g++-v3/bits/fpos.h:45,
                 from /usr/lib/gcc-lib/i686-pc-linux-gnu/3.3.5-20050130/include/g++-v3/iosfwd:49,
                 from /usr/lib/gcc-lib/i686-pc-linux-gnu/3.3.5-20050130/include/g++-v3/ios:44,
                 from /usr/lib/gcc-lib/i686-pc-linux-gnu/3.3.5-20050130/include/g++-v3/ostream:45,
                 from /usr/lib/gcc-lib/i686-pc-linux-gnu/3.3.5-20050130/include/g++-v3/iostream:45,
                 from ttmkfdir.cpp:2:
/usr/lib/gcc-lib/i686-pc-linux-gnu/3.3.5-20050130/include/g++-v3/cwchar:49:28: bits/c++config.h: No such file or directory
In file included from /usr/lib/gcc-lib/i686-pc-linux-gnu/3.3.5-20050130/include/g++-v3/ios:48,
                 from /usr/lib/gcc-lib/i686-pc-linux-gnu/3.3.5-20050130/include/g++-v3/ostream:45,
                 from /usr/lib/gcc-lib/i686-pc-linux-gnu/3.3.5-20050130/include/g++-v3/iostream:45,
                 from ttmkfdir.cpp:2:
/usr/lib/gcc-lib/i686-pc-linux-gnu/3.3.5-20050130/include/g++-v3/bits/localefwd.h:45:28: bits/c++config.h: No such file or directory
/usr/lib/gcc-lib/i686-pc-linux-gnu/3.3.5-20050130/include/g++-v3/bits/localefwd.h:46:80: bits/c++locale.h: No such file or directory
In file included from /usr/lib/gcc-lib/i686-pc-linux-gnu/3.3.5-20050130/include/g++-v3/ios:49,
                 from /usr/lib/gcc-lib/i686-pc-linux-gnu/3.3.5-20050130/include/g++-v3/ostream:45,
                 from /usr/lib/gcc-lib/i686-pc-linux-gnu/3.3.5-20050130/include/g++-v3/iostream:45,
                 from ttmkfdir.cpp:2:
/usr/lib/gcc-lib/i686-pc-linux-gnu/3.3.5-20050130/include/g++-v3/bits/ios_base.h:45:28: bits/atomicity.h: No such file or directory
In file included from /usr/lib/gcc-lib/i686-pc-linux-gnu/3.3.5-20050130/include/g++-v3/bits/locale_classes.h:47,
                 from /usr/lib/gcc-lib/i686-pc-linux-gnu/3.3.5-20050130/include/g++-v3/bits/ios_base.h:47,
                 from /usr/lib/gcc-lib/i686-pc-linux-gnu/3.3.5-20050130/include/g++-v3/ios:49,
                 from /usr/lib/gcc-lib/i686-pc-linux-gnu/3.3.5-20050130/include/g++-v3/ostream:45,
                 from /usr/lib/gcc-lib/i686-pc-linux-gnu/3.3.5-20050130/include/g++-v3/iostream:45,
                 from ttmkfdir.cpp:2:
/usr/lib/gcc-lib/i686-pc-linux-gnu/3.3.5-20050130/include/g++-v3/string:45:28: bits/c++config.h: No such file or directory
In file included from /usr/lib/gcc-lib/i686-pc-linux-gnu/3.3.5-20050130/include/g++-v3/memory:54,
                 from /usr/lib/gcc-lib/i686-pc-linux-gnu/3.3.5-20050130/include/g++-v3/string:48,
                 from /usr/lib/gcc-lib/i686-pc-linux-gnu/3.3.5-20050130/include/g++-v3/bits/locale_classes.h:47,
                 from /usr/lib/gcc-lib/i686-pc-linux-gnu/3.3.5-20050130/include/g++-v3/bits/ios_base.h:47,
                 from /usr/lib/gcc-lib/i686-pc-linux-gnu/3.3.5-20050130/include/g++-v3/ios:49,
                 from /usr/lib/gcc-lib/i686-pc-linux-gnu/3.3.5-20050130/include/g++-v3/ostream:45,
                 from /usr/lib/gcc-lib/i686-pc-linux-gnu/3.3.5-20050130/include/g++-v3/iostream:45,
                 from ttmkfdir.cpp:2:
/usr/lib/gcc-lib/i686-pc-linux-gnu/3.3.5-20050130/include/g++-v3/bits/stl_algobase.h:64:28: bits/c++config.h: No such file or directory
In file included from /usr/lib/gcc-lib/i686-pc-linux-gnu/3.3.5-20050130/include/g++-v3/bits/stl_algobase.h:67,
                 from /usr/lib/gcc-lib/i686-pc-linux-gnu/3.3.5-20050130/include/g++-v3/memory:54,
                 from /usr/lib/gcc-lib/i686-pc-linux-gnu/3.3.5-20050130/include/g++-v3/string:48,
                 from /usr/lib/gcc-lib/i686-pc-linux-gnu/3.3.5-20050130/include/g++-v3/bits/locale_classes.h:47,
                 from /usr/lib/gcc-lib/i686-pc-linux-gnu/3.3.5-20050130/include/g++-v3/bits/ios_base.h:47,
                 from /usr/lib/gcc-lib/i686-pc-linux-gnu/3.3.5-20050130/include/g++-v3/ios:49,
                 from /usr/lib/gcc-lib/i686-pc-linux-gnu/3.3.5-20050130/include/g++-v3/ostream:45,
                 from /usr/lib/gcc-lib/i686-pc-linux-gnu/3.3.5-20050130/include/g++-v3/iostream:45,
                 from ttmkfdir.cpp:2:
/usr/lib/gcc-lib/i686-pc-linux-gnu/3.3.5-20050130/include/g++-v3/cstdlib:49:28: bits/c++config.h: No such file or directory
In file included from /usr/lib/gcc-lib/i686-pc-linux-gnu/3.3.5-20050130/include/g++-v3/bits/stl_algobase.h:72,
                 from /usr/lib/gcc-lib/i686-pc-linux-gnu/3.3.5-20050130/include/g++-v3/memory:54,
                 from /usr/lib/gcc-lib/i686-pc-linux-gnu/3.3.5-20050130/include/g++-v3/string:48,
                 from /usr/lib/gcc-lib/i686-pc-linux-gnu/3.3.5-20050130/include/g++-v3/bits/locale_classes.h:47,
                 from /usr/lib/gcc-lib/i686-pc-linux-gnu/3.3.5-20050130/include/g++-v3/bits/ios_base.h:47,
                 from /usr/lib/gcc-lib/i686-pc-linux-gnu/3.3.5-20050130/include/g++-v3/ios:49,
                 from /usr/lib/gcc-lib/i686-pc-linux-gnu/3.3.5-20050130/include/g++-v3/ostream:45,
                 from /usr/lib/gcc-lib/i686-pc-linux-gnu/3.3.5-20050130/include/g++-v3/iostream:45,
                 from ttmkfdir.cpp:2:
/usr/lib/gcc-lib/i686-pc-linux-gnu/3.3.5-20050130/include/g++-v3/bits/type_traits.h:54:28: bits/c++config.h: No such file or directory
In file included from /usr/lib/gcc-lib/i686-pc-linux-gnu/3.3.5-20050130/include/g++-v3/bits/stl_iterator_base_funcs.h:68,
                 from /usr/lib/gcc-lib/i686-pc-linux-gnu/3.3.5-20050130/include/g++-v3/bits/stl_algobase.h:74,
                 from /usr/lib/gcc-lib/i686-pc-linux-gnu/3.3.5-20050130/include/g++-v3/memory:54,
                 from /usr/lib/gcc-lib/i686-pc-linux-gnu/3.3.5-20050130/include/g++-v3/string:48,
                 from /usr/lib/gcc-lib/i686-pc-linux-gnu/3.3.5-20050130/include/g++-v3/bits/locale_classes.h:47,
                 from /usr/lib/gcc-lib/i686-pc-linux-gnu/3.3.5-20050130/include/g++-v3/bits/ios_base.h:47,
                 from /usr/lib/gcc-lib/i686-pc-linux-gnu/3.3.5-20050130/include/g++-v3/ios:49,
                 from /usr/lib/gcc-lib/i686-pc-linux-gnu/3.3.5-20050130/include/g++-v3/ostream:45,
                 from /usr/lib/gcc-lib/i686-pc-linux-gnu/3.3.5-20050130/include/g++-v3/iostream:45,
                 from ttmkfdir.cpp:2:
/usr/lib/gcc-lib/i686-pc-linux-gnu/3.3.5-20050130/include/g++-v3/bits/concept_check.h:40:28: bits/c++config.h: No such file or directory
In file included from /usr/lib/gcc-lib/i686-pc-linux-gnu/3.3.5-20050130/include/g++-v3/memory:55,
                 from /usr/lib/gcc-lib/i686-pc-linux-gnu/3.3.5-20050130/include/g++-v3/string:48,
                 from /usr/lib/gcc-lib/i686-pc-linux-gnu/3.3.5-20050130/include/g++-v3/bits/locale_classes.h:47,
                 from /usr/lib/gcc-lib/i686-pc-linux-gnu/3.3.5-20050130/include/g++-v3/bits/ios_base.h:47,
                 from /usr/lib/gcc-lib/i686-pc-linux-gnu/3.3.5-20050130/include/g++-v3/ios:49,
                 from /usr/lib/gcc-lib/i686-pc-linux-gnu/3.3.5-20050130/include/g++-v3/ostream:45,
                 from /usr/lib/gcc-lib/i686-pc-linux-gnu/3.3.5-20050130/include/g++-v3/iostream:45,
                 from ttmkfdir.cpp:2:
/usr/lib/gcc-lib/i686-pc-linux-gnu/3.3.5-20050130/include/g++-v3/bits/stl_alloc.h:91:28: bits/atomicity.h: No such file or directory
In file included from /usr/lib/gcc-lib/i686-pc-linux-gnu/3.3.5-20050130/include/g++-v3/memory:55,
                 from /usr/lib/gcc-lib/i686-pc-linux-gnu/3.3.5-20050130/include/g++-v3/string:48,
                 from /usr/lib/gcc-lib/i686-pc-linux-gnu/3.3.5-20050130/include/g++-v3/bits/locale_classes.h:47,
                 from /usr/lib/gcc-lib/i686-pc-linux-gnu/3.3.5-20050130/include/g++-v3/bits/ios_base.h:47,
                 from /usr/lib/gcc-lib/i686-pc-linux-gnu/3.3.5-20050130/include/g++-v3/ios:49,
                 from /usr/lib/gcc-lib/i686-pc-linux-gnu/3.3.5-20050130/include/g++-v3/ostream:45,
                 from /usr/lib/gcc-lib/i686-pc-linux-gnu/3.3.5-20050130/include/g++-v3/iostream:45,
                 from ttmkfdir.cpp:2:
/usr/lib/gcc-lib/i686-pc-linux-gnu/3.3.5-20050130/include/g++-v3/bits/stl_alloc.h:382: error: parse
   error before `;' token
/usr/lib/gcc-lib/i686-pc-linux-gnu/3.3.5-20050130/include/g++-v3/bits/stl_alloc.h:452: error: syntax
   error before `<' token
/usr/lib/gcc-lib/i686-pc-linux-gnu/3.3.5-20050130/include/g++-v3/bits/stl_alloc.h:452: error: `
   __threads' was not declared in this scope
/usr/lib/gcc-lib/i686-pc-linux-gnu/3.3.5-20050130/include/g++-v3/bits/stl_alloc.h:452: error: `
   __inst' was not declared in this scope
/usr/lib/gcc-lib/i686-pc-linux-gnu/3.3.5-20050130/include/g++-v3/bits/stl_alloc.h:452: error: template
   argument 1 is invalid
/usr/lib/gcc-lib/i686-pc-linux-gnu/3.3.5-20050130/include/g++-v3/bits/stl_alloc.h:452: error: template
   argument 2 is invalid
In file included from /usr/lib/gcc-lib/i686-pc-linux-gnu/3.3.5-20050130/include/g++-v3/string:53,
                 from /usr/lib/gcc-lib/i686-pc-linux-gnu/3.3.5-20050130/include/g++-v3/bits/locale_classes.h:47,
                 from /usr/lib/gcc-lib/i686-pc-linux-gnu/3.3.5-20050130/include/g++-v3/bits/ios_base.h:47,
                 from /usr/lib/gcc-lib/i686-pc-linux-gnu/3.3.5-20050130/include/g++-v3/ios:49,
                 from /usr/lib/gcc-lib/i686-pc-linux-gnu/3.3.5-20050130/include/g++-v3/ostream:45,
                 from /usr/lib/gcc-lib/i686-pc-linux-gnu/3.3.5-20050130/include/g++-v3/iostream:45,
                 from ttmkfdir.cpp:2:
/usr/lib/gcc-lib/i686-pc-linux-gnu/3.3.5-20050130/include/g++-v3/bits/basic_string.h:45:28: bits/atomicity.h: No such file or directory
In file included from /usr/lib/gcc-lib/i686-pc-linux-gnu/3.3.5-20050130/include/g++-v3/string:53,
                 from /usr/lib/gcc-lib/i686-pc-linux-gnu/3.3.5-20050130/include/g++-v3/bits/locale_classes.h:47,
                 from /usr/lib/gcc-lib/i686-pc-linux-gnu/3.3.5-20050130/include/g++-v3/bits/ios_base.h:47,
                 from /usr/lib/gcc-lib/i686-pc-linux-gnu/3.3.5-20050130/include/g++-v3/ios:49,
                 from /usr/lib/gcc-lib/i686-pc-linux-gnu/3.3.5-20050130/include/g++-v3/ostream:45,
                 from /usr/lib/gcc-lib/i686-pc-linux-gnu/3.3.5-20050130/include/g++-v3/iostream:45,
                 from ttmkfdir.cpp:2:
/usr/lib/gcc-lib/i686-pc-linux-gnu/3.3.5-20050130/include/g++-v3/bits/basic_string.h:166: error: '
   _Atomic_word' is used as a type, but is not defined as a type.
In file included from /usr/lib/gcc-lib/i686-pc-linux-gnu/3.3.5-20050130/include/g++-v3/bits/ios_base.h:47,
                 from /usr/lib/gcc-lib/i686-pc-linux-gnu/3.3.5-20050130/include/g++-v3/ios:49,
                 from /usr/lib/gcc-lib/i686-pc-linux-gnu/3.3.5-20050130/include/g++-v3/ostream:45,
                 from /usr/lib/gcc-lib/i686-pc-linux-gnu/3.3.5-20050130/include/g++-v3/iostream:45,
                 from ttmkfdir.cpp:2:
/usr/lib/gcc-lib/i686-pc-linux-gnu/3.3.5-20050130/include/g++-v3/bits/locale_classes.h:48:28: bits/atomicity.h: No such file or directory
In file included from /usr/lib/gcc-lib/i686-pc-linux-gnu/3.3.5-20050130/include/g++-v3/bits/ios_base.h:47,
                 from /usr/lib/gcc-lib/i686-pc-linux-gnu/3.3.5-20050130/include/g++-v3/ios:49,
                 from /usr/lib/gcc-lib/i686-pc-linux-gnu/3.3.5-20050130/include/g++-v3/ostream:45,
                 from /usr/lib/gcc-lib/i686-pc-linux-gnu/3.3.5-20050130/include/g++-v3/iostream:45,
                 from ttmkfdir.cpp:2:
/usr/lib/gcc-lib/i686-pc-linux-gnu/3.3.5-20050130/include/g++-v3/bits/locale_classes.h:163: error: `
   _GLIBCPP_NUM_CATEGORIES' was not declared in this scope
/usr/lib/gcc-lib/i686-pc-linux-gnu/3.3.5-20050130/include/g++-v3/bits/locale_classes.h:170: error: ISO
   C++ forbids variable-size array `_S_categories'
/usr/lib/gcc-lib/i686-pc-linux-gnu/3.3.5-20050130/include/g++-v3/bits/locale_classes.h:170: error: data
   member may not have variably modified type `const
   char*[(std::locale::_S_extra_categories_size + 6)]'
/usr/lib/gcc-lib/i686-pc-linux-gnu/3.3.5-20050130/include/g++-v3/bits/locale_classes.h:212: error: '
   _Atomic_word' is used as a type, but is not defined as a type.
/usr/lib/gcc-lib/i686-pc-linux-gnu/3.3.5-20050130/include/g++-v3/bits/locale_classes.h:217: error: ISO
   C++ forbids variable-size array `_M_names'
/usr/lib/gcc-lib/i686-pc-linux-gnu/3.3.5-20050130/include/g++-v3/bits/locale_classes.h:217: error: data
   member may not have variably modified type `
   char*[(std::locale::_S_extra_categories_size + 6)]'
/usr/lib/gcc-lib/i686-pc-linux-gnu/3.3.5-20050130/include/g++-v3/bits/locale_classes.h: In
   member function `void std::locale::_Impl::_M_add_reference()':
/usr/lib/gcc-lib/i686-pc-linux-gnu/3.3.5-20050130/include/g++-v3/bits/locale_classes.h:228: error: `
   _M_references' undeclared (first use this function)
/usr/lib/gcc-lib/i686-pc-linux-gnu/3.3.5-20050130/include/g++-v3/bits/locale_classes.h:228: error: (Each
   undeclared identifier is reported only once for each function it appears
   in.)
/usr/lib/gcc-lib/i686-pc-linux-gnu/3.3.5-20050130/include/g++-v3/bits/locale_classes.h:228: error: `
   __atomic_add' undeclared (first use this function)
/usr/lib/gcc-lib/i686-pc-linux-gnu/3.3.5-20050130/include/g++-v3/bits/locale_classes.h: In
   member function `void std::locale::_Impl::_M_remove_reference()':
/usr/lib/gcc-lib/i686-pc-linux-gnu/3.3.5-20050130/include/g++-v3/bits/locale_classes.h:233: error: `
   __exchange_and_add' undeclared (first use this function)
/usr/lib/gcc-lib/i686-pc-linux-gnu/3.3.5-20050130/include/g++-v3/bits/locale_classes.h: In
   member function `bool std::locale::_Impl::_M_check_same_name()':
/usr/lib/gcc-lib/i686-pc-linux-gnu/3.3.5-20050130/include/g++-v3/bits/locale_classes.h:260: error: `
   _M_names' undeclared (first use this function)
/usr/lib/gcc-lib/i686-pc-linux-gnu/3.3.5-20050130/include/g++-v3/bits/locale_classes.h: At
   global scope:
/usr/lib/gcc-lib/i686-pc-linux-gnu/3.3.5-20050130/include/g++-v3/bits/locale_classes.h:342: error: '
   _Atomic_word' is used as a type, but is not defined as a type.
/usr/lib/gcc-lib/i686-pc-linux-gnu/3.3.5-20050130/include/g++-v3/bits/locale_classes.h:346: error: parse
   error before `;' token
/usr/lib/gcc-lib/i686-pc-linux-gnu/3.3.5-20050130/include/g++-v3/bits/locale_classes.h:358: error: `
   __cloc' was not declared in this scope
/usr/lib/gcc-lib/i686-pc-linux-gnu/3.3.5-20050130/include/g++-v3/bits/locale_classes.h:358: error: parse
   error before `char'
/usr/lib/gcc-lib/i686-pc-linux-gnu/3.3.5-20050130/include/g++-v3/bits/locale_classes.h:362: error: declaration
   of `int std::locale::facet::__c_locale'
/usr/lib/gcc-lib/i686-pc-linux-gnu/3.3.5-20050130/include/g++-v3/bits/locale_classes.h:346: error: conflicts
   with previous declaration `int std::locale::facet::__c_locale'
/usr/lib/gcc-lib/i686-pc-linux-gnu/3.3.5-20050130/include/g++-v3/bits/locale_classes.h:362: error: parse
   error before `(' token
/usr/lib/gcc-lib/i686-pc-linux-gnu/3.3.5-20050130/include/g++-v3/bits/locale_classes.h:365: error: `
   __cloc' was not declared in this scope
/usr/lib/gcc-lib/i686-pc-linux-gnu/3.3.5-20050130/include/g++-v3/bits/locale_classes.h:365: error: invalid
   data member initialization
/usr/lib/gcc-lib/i686-pc-linux-gnu/3.3.5-20050130/include/g++-v3/bits/locale_classes.h:365: error: (use
   `=' to initialize static data members)
/usr/lib/gcc-lib/i686-pc-linux-gnu/3.3.5-20050130/include/g++-v3/bits/locale_classes.h:365: error: variable
   or field `_S_destroy_c_locale' declared void
/usr/lib/gcc-lib/i686-pc-linux-gnu/3.3.5-20050130/include/g++-v3/bits/locale_classes.h:400: error: parse
   error before `;' token
/usr/lib/gcc-lib/i686-pc-linux-gnu/3.3.5-20050130/include/g++-v3/bits/locale_classes.h: In
   member function `size_t std::locale::id::_M_id() const':
/usr/lib/gcc-lib/i686-pc-linux-gnu/3.3.5-20050130/include/g++-v3/bits/locale_classes.h:416: error: `
   _S_highwater' undeclared (first use this function)
/usr/lib/gcc-lib/i686-pc-linux-gnu/3.3.5-20050130/include/g++-v3/bits/locale_classes.h:416: error: `
   __exchange_and_add' undeclared (first use this function)
In file included from /usr/lib/gcc-lib/i686-pc-linux-gnu/3.3.5-20050130/include/g++-v3/ios:49,
                 from /usr/lib/gcc-lib/i686-pc-linux-gnu/3.3.5-20050130/include/g++-v3/ostream:45,
                 from /usr/lib/gcc-lib/i686-pc-linux-gnu/3.3.5-20050130/include/g++-v3/iostream:45,
                 from ttmkfdir.cpp:2:
/usr/lib/gcc-lib/i686-pc-linux-gnu/3.3.5-20050130/include/g++-v3/bits/ios_base.h: At
   global scope:
/usr/lib/gcc-lib/i686-pc-linux-gnu/3.3.5-20050130/include/g++-v3/bits/ios_base.h:385: error: '
   _Atomic_word' is used as a type, but is not defined as a type.
/usr/lib/gcc-lib/i686-pc-linux-gnu/3.3.5-20050130/include/g++-v3/bits/ios_base.h: In
   constructor `std::ios_base::_Callback_list::_Callback_list(void
   (*)(std::ios_base::event, std::ios_base&, int), int,
   std::ios_base::_Callback_list*)':
/usr/lib/gcc-lib/i686-pc-linux-gnu/3.3.5-20050130/include/g++-v3/bits/ios_base.h:389: error: class
   `std::ios_base::_Callback_list' does not have any field named `_M_refcount'
/usr/lib/gcc-lib/i686-pc-linux-gnu/3.3.5-20050130/include/g++-v3/bits/ios_base.h: In
   member function `void std::ios_base::_Callback_list::_M_add_reference()':
/usr/lib/gcc-lib/i686-pc-linux-gnu/3.3.5-20050130/include/g++-v3/bits/ios_base.h:392: error: `
   _M_refcount' undeclared (first use this function)
/usr/lib/gcc-lib/i686-pc-linux-gnu/3.3.5-20050130/include/g++-v3/bits/ios_base.h:392: error: `
   __atomic_add' undeclared (first use this function)
/usr/lib/gcc-lib/i686-pc-linux-gnu/3.3.5-20050130/include/g++-v3/bits/ios_base.h: In
   member function `int std::ios_base::_Callback_list::_M_remove_reference()':
/usr/lib/gcc-lib/i686-pc-linux-gnu/3.3.5-20050130/include/g++-v3/bits/ios_base.h:396: error: `
   __exchange_and_add' undeclared (first use this function)
In file included from /usr/lib/gcc-lib/i686-pc-linux-gnu/3.3.5-20050130/include/g++-v3/ios:50,
                 from /usr/lib/gcc-lib/i686-pc-linux-gnu/3.3.5-20050130/include/g++-v3/ostream:45,
                 from /usr/lib/gcc-lib/i686-pc-linux-gnu/3.3.5-20050130/include/g++-v3/iostream:45,
                 from ttmkfdir.cpp:2:
/usr/lib/gcc-lib/i686-pc-linux-gnu/3.3.5-20050130/include/g++-v3/streambuf:45:28: bits/c++config.h: No such file or directory
In file included from /usr/lib/gcc-lib/i686-pc-linux-gnu/3.3.5-20050130/include/g++-v3/bits/locale_facets.h:46,
                 from /usr/lib/gcc-lib/i686-pc-linux-gnu/3.3.5-20050130/include/g++-v3/bits/basic_ios.h:44,
                 from /usr/lib/gcc-lib/i686-pc-linux-gnu/3.3.5-20050130/include/g++-v3/ios:51,
                 from /usr/lib/gcc-lib/i686-pc-linux-gnu/3.3.5-20050130/include/g++-v3/ostream:45,
                 from /usr/lib/gcc-lib/i686-pc-linux-gnu/3.3.5-20050130/include/g++-v3/iostream:45,
                 from ttmkfdir.cpp:2:
/usr/lib/gcc-lib/i686-pc-linux-gnu/3.3.5-20050130/include/g++-v3/cwctype:49:28: bits/c++config.h: No such file or directory
In file included from /usr/lib/gcc-lib/i686-pc-linux-gnu/3.3.5-20050130/include/g++-v3/bits/basic_ios.h:44,
                 from /usr/lib/gcc-lib/i686-pc-linux-gnu/3.3.5-20050130/include/g++-v3/ios:51,
                 from /usr/lib/gcc-lib/i686-pc-linux-gnu/3.3.5-20050130/include/g++-v3/ostream:45,
                 from /usr/lib/gcc-lib/i686-pc-linux-gnu/3.3.5-20050130/include/g++-v3/iostream:45,
                 from ttmkfdir.cpp:2:
/usr/lib/gcc-lib/i686-pc-linux-gnu/3.3.5-20050130/include/g++-v3/bits/locale_facets.h: At
   global scope:
/usr/lib/gcc-lib/i686-pc-linux-gnu/3.3.5-20050130/include/g++-v3/bits/locale_facets.h:66: error: parse
   error before `&' token
/usr/lib/gcc-lib/i686-pc-linux-gnu/3.3.5-20050130/include/g++-v3/bits/locale_facets.h:72: error: parse
   error before `&' token
/usr/lib/gcc-lib/i686-pc-linux-gnu/3.3.5-20050130/include/g++-v3/bits/locale_facets.h:72: error: template-id
   `__convert_to_v<>' for `void std::__convert_to_v(...)' does not match any
   template declaration
/usr/lib/gcc-lib/i686-pc-linux-gnu/3.3.5-20050130/include/g++-v3/bits/locale_facets.h:77: error: parse
   error before `&' token
/usr/lib/gcc-lib/i686-pc-linux-gnu/3.3.5-20050130/include/g++-v3/bits/locale_facets.h:77: error: template-id
   `__convert_to_v<>' for `void std::__convert_to_v(...)' does not match any
   template declaration
/usr/lib/gcc-lib/i686-pc-linux-gnu/3.3.5-20050130/include/g++-v3/bits/locale_facets.h:94: error: parse
   error before `&' token
/usr/lib/gcc-lib/i686-pc-linux-gnu/3.3.5-20050130/include/g++-v3/bits/locale_facets.h:94: error: template-id
   `__convert_to_v<>' for `void std::__convert_to_v(...)' does not match any
   template declaration
/usr/lib/gcc-lib/i686-pc-linux-gnu/3.3.5-20050130/include/g++-v3/bits/locale_facets.h:99: error: parse
   error before `&' token
/usr/lib/gcc-lib/i686-pc-linux-gnu/3.3.5-20050130/include/g++-v3/bits/locale_facets.h:99: error: template-id
   `__convert_to_v<>' for `void std::__convert_to_v(...)' does not match any
   template declaration
/usr/lib/gcc-lib/i686-pc-linux-gnu/3.3.5-20050130/include/g++-v3/bits/locale_facets.h:104: error: parse
   error before `&' token
/usr/lib/gcc-lib/i686-pc-linux-gnu/3.3.5-20050130/include/g++-v3/bits/locale_facets.h:104: error: template-id
   `__convert_to_v<>' for `void std::__convert_to_v(...)' does not match any
   template declaration
In file included from /usr/lib/gcc-lib/i686-pc-linux-gnu/3.3.5-20050130/include/g++-v3/bits/basic_ios.h:44,
                 from /usr/lib/gcc-lib/i686-pc-linux-gnu/3.3.5-20050130/include/g++-v3/ios:51,
                 from /usr/lib/gcc-lib/i686-pc-linux-gnu/3.3.5-20050130/include/g++-v3/ostream:45,
                 from /usr/lib/gcc-lib/i686-pc-linux-gnu/3.3.5-20050130/include/g++-v3/iostream:45,
                 from ttmkfdir.cpp:2:
/usr/lib/gcc-lib/i686-pc-linux-gnu/3.3.5-20050130/include/g++-v3/bits/locale_facets.h:344: error: '
   __c_locale' is used as a type, but is not defined as a type.
/usr/lib/gcc-lib/i686-pc-linux-gnu/3.3.5-20050130/include/g++-v3/bits/locale_facets.h:358: error: parse
   error before `__cloc'
In file included from /usr/lib/gcc-lib/i686-pc-linux-gnu/3.3.5-20050130/include/g++-v3/bits/basic_ios.h:44,
                 from /usr/lib/gcc-lib/i686-pc-linux-gnu/3.3.5-20050130/include/g++-v3/ios:51,
                 from /usr/lib/gcc-lib/i686-pc-linux-gnu/3.3.5-20050130/include/g++-v3/ostream:45,
                 from /usr/lib/gcc-lib/i686-pc-linux-gnu/3.3.5-20050130/include/g++-v3/iostream:45,
                 from ttmkfdir.cpp:2:
/usr/lib/gcc-lib/i686-pc-linux-gnu/3.3.5-20050130/include/g++-v3/bits/locale_facets.h:611: error: parse
   error before `__cloc'
/usr/lib/gcc-lib/i686-pc-linux-gnu/3.3.5-20050130/include/g++-v3/bits/locale_facets.h:615: error: ISO
   C++ forbids defining types within return type
/usr/lib/gcc-lib/i686-pc-linux-gnu/3.3.5-20050130/include/g++-v3/bits/locale_facets.h:615: error: syntax
   error before `(' token
/usr/lib/gcc-lib/i686-pc-linux-gnu/3.3.5-20050130/include/g++-v3/bits/locale_facets.h:616: error: non-
   member function `int std::decimal_point()' cannot have `const' method
   qualifier
/usr/lib/gcc-lib/i686-pc-linux-gnu/3.3.5-20050130/include/g++-v3/bits/locale_facets.h: In
   function `int std::decimal_point()':
/usr/lib/gcc-lib/i686-pc-linux-gnu/3.3.5-20050130/include/g++-v3/bits/locale_facets.h:616: error: invalid
   use of `this' in non-member function
/usr/lib/gcc-lib/i686-pc-linux-gnu/3.3.5-20050130/include/g++-v3/bits/locale_facets.h: At
   global scope:
/usr/lib/gcc-lib/i686-pc-linux-gnu/3.3.5-20050130/include/g++-v3/bits/locale_facets.h:619: error: parse
   error before `)' token
/usr/lib/gcc-lib/i686-pc-linux-gnu/3.3.5-20050130/include/g++-v3/bits/locale_facets.h:623: error: parse
   error before `)' token
/usr/lib/gcc-lib/i686-pc-linux-gnu/3.3.5-20050130/include/g++-v3/bits/locale_facets.h:627: error: parse
   error before `)' token
/usr/lib/gcc-lib/i686-pc-linux-gnu/3.3.5-20050130/include/g++-v3/bits/locale_facets.h:631: error: parse
   error before `)' token
/usr/lib/gcc-lib/i686-pc-linux-gnu/3.3.5-20050130/include/g++-v3/bits/locale_facets.h:639: error: syntax
   error before `(' token
/usr/lib/gcc-lib/i686-pc-linux-gnu/3.3.5-20050130/include/g++-v3/bits/locale_facets.h:643: error: syntax
   error before `(' token
/usr/lib/gcc-lib/i686-pc-linux-gnu/3.3.5-20050130/include/g++-v3/bits/locale_facets.h:647: error: syntax
   error before `(' token
/usr/lib/gcc-lib/i686-pc-linux-gnu/3.3.5-20050130/include/g++-v3/bits/locale_facets.h:651: error: syntax
   error before `(' token
/usr/lib/gcc-lib/i686-pc-linux-gnu/3.3.5-20050130/include/g++-v3/bits/locale_facets.h:655: error: syntax
   error before `(' token
/usr/lib/gcc-lib/i686-pc-linux-gnu/3.3.5-20050130/include/g++-v3/bits/locale_facets.h:660: error: `
   __c_locale' was not declared in this scope
/usr/lib/gcc-lib/i686-pc-linux-gnu/3.3.5-20050130/include/g++-v3/bits/locale_facets.h:660: error: parse
   error before `=' token
/usr/lib/gcc-lib/i686-pc-linux-gnu/3.3.5-20050130/include/g++-v3/bits/locale_facets.h:664: error: syntax
   error before `::' token
/usr/lib/gcc-lib/i686-pc-linux-gnu/3.3.5-20050130/include/g++-v3/bits/locale_facets.h:664: error: syntax
   error before `<' token
/usr/lib/gcc-lib/i686-pc-linux-gnu/3.3.5-20050130/include/g++-v3/bits/locale_facets.h:667: error: syntax
   error before `::' token
/usr/lib/gcc-lib/i686-pc-linux-gnu/3.3.5-20050130/include/g++-v3/bits/locale_facets.h:667: error: destructors
   must be member functions
/usr/lib/gcc-lib/i686-pc-linux-gnu/3.3.5-20050130/include/g++-v3/bits/locale_facets.h:671: error: syntax
   error before `::' token
/usr/lib/gcc-lib/i686-pc-linux-gnu/3.3.5-20050130/include/g++-v3/bits/locale_facets.h:671: error: `
   __c_locale' was not declared in this scope
/usr/lib/gcc-lib/i686-pc-linux-gnu/3.3.5-20050130/include/g++-v3/bits/locale_facets.h:671: error: parse
   error before `)' token
/usr/lib/gcc-lib/i686-pc-linux-gnu/3.3.5-20050130/include/g++-v3/bits/locale_facets.h:671: error: new
   declaration `int _M_initialize_numpunct(...)'
/usr/lib/gcc-lib/i686-pc-linux-gnu/3.3.5-20050130/include/g++-v3/bits/locale_facets.h:660: error: ambiguates
   old declaration `void _M_initialize_numpunct(...)'
/usr/lib/gcc-lib/i686-pc-linux-gnu/3.3.5-20050130/include/g++-v3/bits/locale_facets.h:683: error: parse
   error before `<' token
/usr/lib/gcc-lib/i686-pc-linux-gnu/3.3.5-20050130/include/g++-v3/bits/locale_facets.h:690: error: `
   _CharT' was not declared in this scope
/usr/lib/gcc-lib/i686-pc-linux-gnu/3.3.5-20050130/include/g++-v3/bits/locale_facets.h:690: error: syntax
   error before `;' token
/usr/lib/gcc-lib/i686-pc-linux-gnu/3.3.5-20050130/include/g++-v3/bits/locale_facets.h:694: error: only
   declarations of constructors can be `explicit'
/usr/lib/gcc-lib/i686-pc-linux-gnu/3.3.5-20050130/include/g++-v3/bits/locale_facets.h: In
   function `int numpunct_byname(const char*, unsigned int)':
/usr/lib/gcc-lib/i686-pc-linux-gnu/3.3.5-20050130/include/g++-v3/bits/locale_facets.h:694: error: `
   int numpunct_byname(const char*, unsigned int)' redeclared as different kind
   of symbol
/usr/lib/gcc-lib/i686-pc-linux-gnu/3.3.5-20050130/include/g++-v3/bits/locale_facets.h:683: error: previous
   declaration of `template<class _CharT> class numpunct_byname'
/usr/lib/gcc-lib/i686-pc-linux-gnu/3.3.5-20050130/include/g++-v3/bits/locale_facets.h:683: error: previous
   non-function declaration `template<class _CharT> class numpunct_byname'
/usr/lib/gcc-lib/i686-pc-linux-gnu/3.3.5-20050130/include/g++-v3/bits/locale_facets.h:694: error: conflicts
   with function declaration `int numpunct_byname(const char*, unsigned int)'
/usr/lib/gcc-lib/i686-pc-linux-gnu/3.3.5-20050130/include/g++-v3/bits/locale_facets.h:694: error: only
   constructors take base initializers
/usr/lib/gcc-lib/i686-pc-linux-gnu/3.3.5-20050130/include/g++-v3/bits/locale_facets.h:694: error: parse
   error before `<' token
/usr/lib/gcc-lib/i686-pc-linux-gnu/3.3.5-20050130/include/g++-v3/bits/locale_facets.h:695: confused by earlier errors, bailing out
make: *** [ttmkfdir.o] Error 1

!!! ERROR: x11-misc/ttmkfdir-3.0.9-r3 failed.
!!! Function src_compile, Line 43, Exitcode 2
!!! emake failed
!!! If you need support, post the topmost build error, NOT this status message.


со всеми флагами уже перепробовал, в make.conf CFLAGS="-march=pentium3 -O3 -pipe -fomit-frame-pointer"

поиогите, плиз, с ситуевиной
_________________
С офигенными регардами и вишесами,
CTиLL
RLU# 379019
2:478/90@fidonet
Back to top
View user's profile Send private message
fedukoff
Apprentice
Apprentice


Joined: 19 Dec 2005
Posts: 229
Location: Latvia

PostPosted: Tue Mar 14, 2006 1:40 pm    Post subject: Reply with quote

попробуй revdep-rebuild запустить
Back to top
View user's profile Send private message
ctull
n00b
n00b


Joined: 22 Mar 2005
Posts: 25
Location: Kaliningrad

PostPosted: Tue Mar 14, 2006 2:03 pm    Post subject: Reply with quote

fedukoff wrote:
попробуй revdep-rebuild запустить


и что, иксы избавятся от этой зависимости, я так понял, что это приблуда для поддержки трутайповых шрифтов, если из USE-флагов ее убрать, ситуация изменится?
_________________
С офигенными регардами и вишесами,
CTиLL
RLU# 379019
2:478/90@fidonet
Back to top
View user's profile Send private message
fedukoff
Apprentice
Apprentice


Joined: 19 Dec 2005
Posts: 229
Location: Latvia

PostPosted: Tue Mar 14, 2006 2:15 pm    Post subject: Reply with quote

Похоже, он у тебя ругается на "отсутствие наличия" файлов c++config.h, c++locale.h.
Можно еще попытаться проверить к какому ебилду принадлежат эти файлы
Code:
equery b c++config.h

и переемержить этот ебилд....
Back to top
View user's profile Send private message
ctull
n00b
n00b


Joined: 22 Mar 2005
Posts: 25
Location: Kaliningrad

PostPosted: Tue Mar 14, 2006 2:40 pm    Post subject: Reply with quote

fedukoff wrote:
Похоже, он у тебя ругается на "отсутствие наличия" файлов c++config.h, c++locale.h.
Можно еще попытаться проверить к какому ебилду принадлежат эти файлы
Code:
equery b c++config.h

и переемержить этот ебилд....


спасибо, попробую, больше соображений никаких нет?
что если, действительно, попробовать с юз-флагами, в теории должно получиться?
_________________
С офигенными регардами и вишесами,
CTиLL
RLU# 379019
2:478/90@fidonet
Back to top
View user's profile Send private message
fedukoff
Apprentice
Apprentice


Joined: 19 Dec 2005
Posts: 229
Location: Latvia

PostPosted: Tue Mar 14, 2006 2:44 pm    Post subject: Reply with quote

Quote:
что если, действительно, попробовать с юз-флагами, в теории должно получиться?

Теоритически должно получиться, но практически без трутайпных шрифтов жизнь - не жизнь :)
Back to top
View user's profile Send private message
ctull
n00b
n00b


Joined: 22 Mar 2005
Posts: 25
Location: Kaliningrad

PostPosted: Fri Mar 17, 2006 11:56 am    Post subject: Reply with quote

fedukoff wrote:
Quote:
что если, действительно, попробовать с юз-флагами, в теории должно получиться?

Теоритически должно получиться, но практически без трутайпных шрифтов жизнь - не жизнь :)


все завелось, просто у хидеров (c++config.h и пр.) расширение по неизвестным причинам отсутствовало.
возник теперь по самой xorg вопрос, где крутить, чтобы иксы кодировку нужную выдавали, задолбался уже на кракозябры смотреть, они, кстати, не везде, всякие abiword и некоторые гномовые приложения нормально показывают тект, а вот sylpheed, xmms -- не хотят, врубиться не могу, в чем дело?
_________________
С офигенными регардами и вишесами,
CTиLL
RLU# 379019
2:478/90@fidonet
Back to top
View user's profile Send private message
Laitr Keiows
Moderator
Moderator


Joined: 04 Jul 2005
Posts: 891
Location: Kobe, Japan

PostPosted: Tue Mar 21, 2006 11:59 am    Post subject: Reply with quote

ctull wrote:
всякие abiword и некоторые гномовые приложения нормально показывают тект, а вот sylpheed, xmms -- не хотят, врубиться не могу, в чем дело?

Уникод или нет?
Back to top
View user's profile Send private message
ctull
n00b
n00b


Joined: 22 Mar 2005
Posts: 25
Location: Kaliningrad

PostPosted: Tue Mar 21, 2006 1:07 pm    Post subject: Reply with quote

Laitr Keiows wrote:

Уникод или нет?


Да, в X-ах юникод почему-то, хотя локаль KOI8-R, где ковырять, чтобы поставить на место?
_________________
С офигенными регардами и вишесами,
CTиLL
RLU# 379019
2:478/90@fidonet
Back to top
View user's profile Send private message
Display posts from previous:   
Reply to topic    Gentoo Forums Forum Index Russian All times are GMT
Page 1 of 1

 
Jump to:  
You cannot post new topics in this forum
You cannot reply to topics in this forum
You cannot edit your posts in this forum
You cannot delete your posts in this forum
You cannot vote in polls in this forum