Gentoo Forums
Gentoo Forums
Gentoo Forums
Quick Search: in
[kde3.5.1] problèmes compilation (résolu)
View unanswered posts
View posts from last 24 hours

 
Reply to topic    Gentoo Forums Forum Index French
View previous topic :: View next topic  
Author Message
loopx
Advocate
Advocate


Joined: 01 Apr 2005
Posts: 2787
Location: Belgium / Liège

PostPosted: Mon Feb 06, 2006 10:33 pm    Post subject: [kde3.5.1] problèmes compilation (résolu) Reply with quote

Bon, j'en peux plus, ca fait 6 fois qui me refais la meme erreur, après 30 minutes de compilation :(:(:(

en fait, j'ai récupéré mon bon pc, et j'ai replace le dur ou il y avait gentoo. J'ai du la mettre à jour, et je veux passer de kde 3.4 au 3.5.

J'ai aussi changé de compilateur (3.3 => 3.4) et ses deux version ont été mise à jour. J'ai aussi changé le type d'inscruction (de i386 => i686).

Tout fonctionne, mais je sais pas pourquoi, il trouve pas ce un fichier. J'ai réemerger 3x libstdc++-v3, j'ai fais un revdep-rebuild, j'ai aussi testé le python-updater, le fix_libtool_files avec des version à gauche à droite et du oldarch i386-linux-gnu etc... Ca m'a afficher plein de truc pour mettre à jour les liens? vers les librairie, mais visiblement, c'est pas suffisant :(.

Alors je m'en remet à vous ...

Code:

/bin/sh ../libtool --silent --tag=CXX --mode=link i686-pc-linux-gnu-g++  -Wno-long-long -Wundef -ansi -D_XOPEN_SOURCE=500 -D_BSD_SOURCE -Wcast-align -Wconversion -Wchar-subscripts -Wall -W -Wpointer-arith -DNDEBUG -DNO_DEBUG -O2 -O2 -march=i686 -fomit-frame-pointer -pipe -Wformat-security -Wmissing-format-attribute -Wno-non-virtual-dtor -fno-exceptions -fno-check-new -fno-common  -DQT_CLEAN_NAMESPACE -DQT_NO_ASCII_CAST -DQT_NO_STL -DQT_NO_COMPAT -DQT_NO_TRANSLATION    -o libkio.la -rpath /usr/kde/3.5/lib -version-info 6:0:2 -no-undefined -Wl,--no-undefined -Wl,--allow-shlib-undefined -L/usr/kde/3.5/lib -L/usr/qt/3/lib -L/usr/lib     dummy.lo kssl/libkssl.la kio/libkiocore.la kio/libksycoca.la bookmarks/libkbookmarks.la kfile/libkfile.la ../kdeui/libkdeui.la ../kdesu/libkdesu.la ../kwallet/client/libkwalletclient.la -lz -lfam
grep: /usr/lib/gcc/i686-pc-linux-gnu/3.3.5-20050130/libstdc++.la: No such file or directory
/bin/sed: can't read /usr/lib/gcc/i686-pc-linux-gnu/3.3.5-20050130/libstdc++.la: No such file or directory
libtool: link: `/usr/lib/gcc/i686-pc-linux-gnu/3.3.5-20050130/libstdc++.la' is not a valid libtool archive
make[3]: *** [libkio.la] Error 1
make[3]: Leaving directory `/var/tmp/portage/kdelibs-3.5.1/work/kdelibs-3.5.1/kio'
make[2]: *** [all-recursive] Error 1
make[2]: Leaving directory `/var/tmp/portage/kdelibs-3.5.1/work/kdelibs-3.5.1/kio'
make[1]: *** [all-recursive] Error 1
make[1]: Leaving directory `/var/tmp/portage/kdelibs-3.5.1/work/kdelibs-3.5.1'
make: *** [all] Error 2

!!! ERROR: kde-base/kdelibs-3.5.1 failed.
Call stack:
  ebuild.sh, line 1894:   Called dyn_compile
  ebuild.sh, line 941:   Called src_compile
  kdelibs-3.5.1.ebuild, line 82:   Called kde_src_compile
  kde.eclass, line 74:   Called kde_src_compile 'compile'
  kde.eclass, line 187:   Called kde_src_compile 'all' 'myconf' 'configure'

!!! died running emake, kde_src_compile:make
!!! If you need support, post the topmost build error, and the call stack if relevant.

_________________
Mon MediaWiki perso : http://pix-mania.dyndns.org


Last edited by loopx on Wed Feb 08, 2006 8:13 pm; edited 2 times in total
Back to top
View user's profile Send private message
k-root
Guru
Guru


Joined: 08 Jan 2005
Posts: 427

PostPosted: Mon Feb 06, 2006 11:19 pm    Post subject: Re: [kde3.5.1] problème compilation 1er package Reply with quote

loopx wrote:
J'ai aussi changé de compilateur (3.3 => 3.4) et ses deux version ont été mise à jour. J'ai aussi changé le type d'inscruction (de i386 => i.

[code]grep: /usr/lib/gcc/i686-pc-linux-gnu/3.3.5-20050130/libstdc++.la: No such file or directory
/bin/sed: can't read /usr/lib/gcc/i686-pc-linux-gnu/3.3.5-20050130/libstdc++.la: No such file or directory

hum ... aparament c'est gcc-3.3.5 qui est utiliser
selectione gcc-3.4.5
Quote:
gcc-config -l

_________________
boozo wrote:
Gentoo, ça mange des ours et baffe des buffles par 37°C avec un bob et des tongs
Back to top
View user's profile Send private message
loopx
Advocate
Advocate


Joined: 01 Apr 2005
Posts: 2787
Location: Belgium / Liège

PostPosted: Tue Feb 07, 2006 12:17 am    Post subject: Reply with quote

Code:

loop ~ # gcc-config -l
 [1] i386-pc-linux-gnu-3.3.5-20050130
 [2] i386-pc-linux-gnu-3.3.5-20050130-hardened
 [3] i386-pc-linux-gnu-3.3.5-20050130-hardenednopie
 [4] i386-pc-linux-gnu-3.3.5-20050130-hardenednopiessp
 [5] i386-pc-linux-gnu-3.3.5-20050130-hardenednossp
 [6] i686-pc-linux-gnu-3.4.5 *
 [7] i686-pc-linux-gnu-3.4.5-hardened
 [8] i686-pc-linux-gnu-3.4.5-hardenednopie
 [9] i686-pc-linux-gnu-3.4.5-hardenednopiessp
 [10] i686-pc-linux-gnu-3.4.5-hardenednossp


amarok pose le meme problème :( :
Code:

/bin/sh ../../../../libtool --silent --mode=link --tag=CXX i686-pc-linux-gnu-g++  -Wno-long-long -Wundef -ansi -D_XOPEN_SOURCE=500 -D_BSD_SOURCE -Wcast-align -Wconversion -Wchar-subscripts -Wall -W -Wpointer-arith -DNDEBUG -DNO_DEBUG -O2 -O2 -march=i686 -fomit-frame-pointer -pipe -fno-inline -Wformat-security -Wmissing-format-attribute -Wno-non-virtual-dtor -fno-exceptions -fno-check-new -fno-common -DQT_CLEAN_NAMESPACE -DQT_NO_ASCII_CAST -DQT_NO_STL -DQT_NO_COMPAT -DQT_NO_TRANSLATION    -o libamarok_void-engine_plugin.la -rpath /usr/kde/3.4/lib/kde3 -avoid-version -module -no-undefined -Wl,--no-undefined -Wl,--allow-shlib-undefined -R /usr/kde/3.4/lib -R /usr/kde/3.4/lib -R /usr/qt/3/lib -R /usr/lib  -L/usr/kde/3.4/lib -L/usr/qt/3/lib -L/usr/lib    void-engine.lo ../../../../amarok/src/engine/libengine.la ../../../../amarok/src/plugin/libplugin.la -lkdecore
grep: //usr/lib/gcc/i686-pc-linux-gnu/3.3.5-20050130/libstdc++.la: No such file or directory
/bin/sed: can't read //usr/lib/gcc/i686-pc-linux-gnu/3.3.5-20050130/libstdc++.la: No such file or directory
libtool: link: `//usr/lib/gcc/i686-pc-linux-gnu/3.3.5-20050130/libstdc++.la' is not a valid libtool archive
make[5]: *** [libamarok_void-engine_plugin.la] Error 1
make[5]: Leaving directory `/var/tmp/portage/amarok-1.3.8/work/amarok-1.3.8/amarok/src/engine/void'
make[4]: *** [all-recursive] Error 1
make[4]: Leaving directory `/var/tmp/portage/amarok-1.3.8/work/amarok-1.3.8/amarok/src/engine'
make[3]: *** [all-recursive] Error 1
make[3]: Leaving directory `/var/tmp/portage/amarok-1.3.8/work/amarok-1.3.8/amarok/src'
make[2]: *** [all-recursive] Error 1
make[2]: Leaving directory `/var/tmp/portage/amarok-1.3.8/work/amarok-1.3.8/amarok'
make[1]: *** [all-recursive] Error 1
make[1]: Leaving directory `/var/tmp/portage/amarok-1.3.8/work/amarok-1.3.8'
make: *** [all] Error 2

!!! ERROR: media-sound/amarok-1.3.8 failed.
Call stack:
  ebuild.sh, line 1894:   Called dyn_compile
  ebuild.sh, line 941:   Called src_compile
  amarok-1.3.8.ebuild, line 101:   Called kde_src_compile
  kde.eclass, line 74:   Called kde_src_compile 'compile'
  kde.eclass, line 187:   Called kde_src_compile 'all' 'myconf' 'configure'

!!! died running emake, kde_src_compile:make
!!! If you need support, post the topmost build error, and the call stack if relevant.

_________________
Mon MediaWiki perso : http://pix-mania.dyndns.org
Back to top
View user's profile Send private message
TGL
Bodhisattva
Bodhisattva


Joined: 02 Jun 2002
Posts: 1978
Location: Rennes, France

PostPosted: Tue Feb 07, 2006 12:26 am    Post subject: Reply with quote

Essaye ça :
Code:
# fix_libtool_files.sh 3.3.5-20050130
Back to top
View user's profile Send private message
loopx
Advocate
Advocate


Joined: 01 Apr 2005
Posts: 2787
Location: Belgium / Liège

PostPosted: Wed Feb 08, 2006 4:55 pm    Post subject: Reply with quote

Bon, j'ai refais quelques manip, quelques emerge a gauche et a droite, et maintenant, je n'ai plus la meme erreur... Ca ne bloque plus au premier packet, mais ca fait une sale erreur dans une des dépendance de kde (j'ai le meme genre d'erreur avec le packet amarok)

Code:

/bin/sh ../libtool --silent --mode=compile --tag=CXX i686-pc-linux-gnu-g++ -DHAVE_CONFIG_H -I. -I. -I.. -I/usr/kde/3.5/include/arts -I/usr/kde/3.5/include -I/usr/qt/3/include -I.   -DQT_THREAD_SUPPORT  -D_REENTRANT -D_FILE_OFFSET_BITS=64  -Wno-long-long -Wundef -ansi -D_XOPEN_SOURCE=500 -D_BSD_SOURCE -Wcast-align -Wconversion -Wchar-subscripts -Wall -W -Wpointer-arith -DNDEBUG -DNO_DEBUG -O2 -O2 -march=i686 -fomit-frame-pointer -pipe -Wformat-security -Wmissing-format-attribute -Wno-non-virtual-dtor -fno-exceptions -fno-check-new -fno-common -DQT_CLEAN_NAMESPACE -DQT_NO_ASCII_CAST -DQT_NO_STL -DQT_NO_COMPAT -DQT_NO_TRANSLATION -D_GNU_SOURCE  -c -o konq_historymgr.lo `test -f 'konq_historymgr.cc' || echo './'`konq_historymgr.cc
/bin/sh ../libtool --silent --mode=compile --tag=CXX i686-pc-linux-gnu-g++ -DHAVE_CONFIG_H -I. -I. -I.. -I/usr/kde/3.5/include/arts -I/usr/kde/3.5/include -I/usr/qt/3/include -I.   -DQT_THREAD_SUPPORT  -D_REENTRANT -D_FILE_OFFSET_BITS=64  -Wno-long-long -Wundef -ansi -D_XOPEN_SOURCE=500 -D_BSD_SOURCE -Wcast-align -Wconversion -Wchar-subscripts -Wall -W -Wpointer-arith -DNDEBUG -DNO_DEBUG -O2 -O2 -march=i686 -fomit-frame-pointer -pipe -Wformat-security -Wmissing-format-attribute -Wno-non-virtual-dtor -fno-exceptions -fno-check-new -fno-common -DQT_CLEAN_NAMESPACE -DQT_NO_ASCII_CAST -DQT_NO_STL -DQT_NO_COMPAT -DQT_NO_TRANSLATION -D_GNU_SOURCE  -c -o kivdirectoryoverlay.lo `test -f 'kivdirectoryoverlay.cc' || echo './'`kivdirectoryoverlay.cc
/bin/sh ../libtool --silent --mode=compile --tag=CXX i686-pc-linux-gnu-g++ -DHAVE_CONFIG_H -I. -I. -I.. -I/usr/kde/3.5/include/arts -I/usr/kde/3.5/include -I/usr/qt/3/include -I.   -DQT_THREAD_SUPPORT  -D_REENTRANT -D_FILE_OFFSET_BITS=64  -Wno-long-long -Wundef -ansi -D_XOPEN_SOURCE=500 -D_BSD_SOURCE -Wcast-align -Wconversion -Wchar-subscripts -Wall -W -Wpointer-arith -DNDEBUG -DNO_DEBUG -O2 -O2 -march=i686 -fomit-frame-pointer -pipe -Wformat-security -Wmissing-format-attribute -Wno-non-virtual-dtor -fno-exceptions -fno-check-new -fno-common -DQT_CLEAN_NAMESPACE -DQT_NO_ASCII_CAST -DQT_NO_STL -DQT_NO_COMPAT -DQT_NO_TRANSLATION -D_GNU_SOURCE  -c -o konq_faviconmgr.lo `test -f 'konq_faviconmgr.cc' || echo './'`konq_faviconmgr.cc
/bin/sh ../libtool --silent --mode=compile --tag=CXX i686-pc-linux-gnu-g++ -DHAVE_CONFIG_H -I. -I. -I.. -I/usr/kde/3.5/include/arts -I/usr/kde/3.5/include -I/usr/qt/3/include -I.   -DQT_THREAD_SUPPORT  -D_REENTRANT -D_FILE_OFFSET_BITS=64  -Wno-long-long -Wundef -ansi -D_XOPEN_SOURCE=500 -D_BSD_SOURCE -Wcast-align -Wconversion -Wchar-subscripts -Wall -W -Wpointer-arith -DNDEBUG -DNO_DEBUG -O2 -O2 -march=i686 -fomit-frame-pointer -pipe -Wformat-security -Wmissing-format-attribute -Wno-non-virtual-dtor -fno-exceptions -fno-check-new -fno-common -DQT_CLEAN_NAMESPACE -DQT_NO_ASCII_CAST -DQT_NO_STL -DQT_NO_COMPAT -DQT_NO_TRANSLATION -D_GNU_SOURCE  -c -o konq_filetip.lo `test -f 'konq_filetip.cc' || echo './'`konq_filetip.cc
/usr/kde/3.5/bin/dcopidl2cpp --c++-suffix cc --no-signals --no-stub konq_undo.kidl
/usr/kde/3.5/bin/dcopidl2cpp --c++-suffix cc --no-signals --no-stub konq_historycomm.kidl
/usr/kde/3.5/bin/dcopidl2cpp --c++-suffix cc --no-signals --no-stub konq_faviconmgr.kidl
/bin/sh ../libtool --silent --mode=link --tag=CXX i686-pc-linux-gnu-g++  -Wno-long-long -Wundef -ansi -D_XOPEN_SOURCE=500 -D_BSD_SOURCE -Wcast-align -Wconversion -Wchar-subscripts -Wall -W -Wpointer-arith -DNDEBUG -DNO_DEBUG -O2 -O2 -march=i686 -fomit-frame-pointer -pipe -Wformat-security -Wmissing-format-attribute -Wno-non-virtual-dtor -fno-exceptions -fno-check-new -fno-common -DQT_CLEAN_NAMESPACE -DQT_NO_ASCII_CAST -DQT_NO_STL -DQT_NO_COMPAT -DQT_NO_TRANSLATION -D_GNU_SOURCE    -o konq_sound.la -rpath /usr/kde/3.5/lib/kde3 -L/usr/kde/3.5/lib -L/usr/qt/3/lib -L/usr/lib    -module -avoid-version -module -no-undefined -Wl,--no-undefined -Wl,--allow-shlib-undefined -R /usr/kde/3.5/lib -R /usr/kde/3.5/lib -R /usr/qt/3/lib -R /usr/lib  konq_sound.lo -lsoundserver_idl -lartskde

/bin/sh ../libtool --silent --mode=compile --tag=CXX i686-pc-linux-gnu-g++ -DHAVE_CONFIG_H -I. -I. -I.. -I/usr/kde/3.5/include/arts -I/usr/kde/3.5/include -I/usr/qt/3/include -I.   -DQT_THREAD_SUPPORT  -D_REENTRANT -D_FILE_OFFSET_BITS=64  -Wno-long-long -Wundef -ansi -D_XOPEN_SOURCE=500 -D_BSD_SOURCE -Wcast-align -Wconversion -Wchar-subscripts -Wall -W -Wpointer-arith -DNDEBUG -DNO_DEBUG -O2 -O2 -march=i686 -fomit-frame-pointer -pipe -Wformat-security -Wmissing-format-attribute -Wno-non-virtual-dtor -fno-exceptions -fno-check-new -fno-common -DQT_CLEAN_NAMESPACE -DQT_NO_ASCII_CAST -DQT_NO_STL -DQT_NO_COMPAT -DQT_NO_TRANSLATION -D_GNU_SOURCE  -c -o konq_undo_skel.lo `test -f 'konq_undo_skel.cc' || echo './'`konq_undo_skel.cc
/bin/sh ../libtool --silent --mode=compile --tag=CXX i686-pc-linux-gnu-g++ -DHAVE_CONFIG_H -I. -I. -I.. -I/usr/kde/3.5/include/arts -I/usr/kde/3.5/include -I/usr/qt/3/include -I.   -DQT_THREAD_SUPPORT  -D_REENTRANT -D_FILE_OFFSET_BITS=64  -Wno-long-long -Wundef -ansi -D_XOPEN_SOURCE=500 -D_BSD_SOURCE -Wcast-align -Wconversion -Wchar-subscripts -Wall -W -Wpointer-arith -DNDEBUG -DNO_DEBUG -O2 -O2 -march=i686 -fomit-frame-pointer -pipe -Wformat-security -Wmissing-format-attribute -Wno-non-virtual-dtor -fno-exceptions -fno-check-new -fno-common -DQT_CLEAN_NAMESPACE -DQT_NO_ASCII_CAST -DQT_NO_STL -DQT_NO_COMPAT -DQT_NO_TRANSLATION -D_GNU_SOURCE  -c -o konq_historycomm_skel.lo `test -f 'konq_historycomm_skel.cc' || echo './'`konq_historycomm_skel.cc
/bin/sh ../libtool --silent --mode=compile --tag=CXX i686-pc-linux-gnu-g++ -DHAVE_CONFIG_H -I. -I. -I.. -I/usr/kde/3.5/include/arts -I/usr/kde/3.5/include -I/usr/qt/3/include -I.   -DQT_THREAD_SUPPORT  -D_REENTRANT -D_FILE_OFFSET_BITS=64  -Wno-long-long -Wundef -ansi -D_XOPEN_SOURCE=500 -D_BSD_SOURCE -Wcast-align -Wconversion -Wchar-subscripts -Wall -W -Wpointer-arith -DNDEBUG -DNO_DEBUG -O2 -O2 -march=i686 -fomit-frame-pointer -pipe -Wformat-security -Wmissing-format-attribute -Wno-non-virtual-dtor -fno-exceptions -fno-check-new -fno-common -DQT_CLEAN_NAMESPACE -DQT_NO_ASCII_CAST -DQT_NO_STL -DQT_NO_COMPAT -DQT_NO_TRANSLATION -D_GNU_SOURCE  -c -o konq_faviconmgr_skel.lo `test -f 'konq_faviconmgr_skel.cc' || echo './'`konq_faviconmgr_skel.cc
/bin/sh ../libtool --silent --mode=link --tag=CXX i686-pc-linux-gnu-g++  -Wno-long-long -Wundef -ansi -D_XOPEN_SOURCE=500 -D_BSD_SOURCE -Wcast-align -Wconversion -Wchar-subscripts -Wall -W -Wpointer-arith -DNDEBUG -DNO_DEBUG -O2 -O2 -march=i686 -fomit-frame-pointer -pipe -Wformat-security -Wmissing-format-attribute -Wno-non-virtual-dtor -fno-exceptions -fno-check-new -fno-common -DQT_CLEAN_NAMESPACE -DQT_NO_ASCII_CAST -DQT_NO_STL -DQT_NO_COMPAT -DQT_NO_TRANSLATION -D_GNU_SOURCE    -o libkonq.la -rpath /usr/kde/3.5/lib -L/usr/kde/3.5/lib -L/usr/qt/3/lib -L/usr/lib    -version-info 6:0:2 -no-undefined -Wl,--no-undefined -Wl,--allow-shlib-undefined konq_popupmenu.lo knewmenu.lo konq_xmlguiclient.lo kfileivi.lo konq_iconviewwidget.lo konq_settings.lo konq_drag.lo konq_operations.lo konq_dirpart.lo konq_propsview.lo konq_events.lo konq_bgnddlg.lo konq_undo.lo konq_historymgr.lo konq_historycomm.lo konq_pixmapprovider.lo kivdirectoryoverlay.lo konq_faviconmgr.lo konq_filetip.lo konq_undo_skel.lo konq_historycomm_skel.lo konq_faviconmgr_skel.lo -lkparts
make[3]: Leaving directory `/var/tmp/portage/kdebase-3.5.1-r1/work/kdebase-3.5.1/libkonq'
make[2]: Leaving directory `/var/tmp/portage/kdebase-3.5.1-r1/work/kdebase-3.5.1/libkonq'
Making all in applnk
make[2]: Entering directory `/var/tmp/portage/kdebase-3.5.1-r1/work/kdebase-3.5.1/applnk'
Making all in compat
make[3]: Entering directory `/var/tmp/portage/kdebase-3.5.1-r1/work/kdebase-3.5.1/applnk/compat'
make[3]: Nothing to be done for `all'.
make[3]: Leaving directory `/var/tmp/portage/kdebase-3.5.1-r1/work/kdebase-3.5.1/applnk/compat'
make[3]: Entering directory `/var/tmp/portage/kdebase-3.5.1-r1/work/kdebase-3.5.1/applnk'
make[3]: Nothing to be done for `all-am'.

make[3]: Leaving directory `/var/tmp/portage/kdebase-3.5.1-r1/work/kdebase-3.5.1/applnk'
make[2]: Leaving directory `/var/tmp/portage/kdebase-3.5.1-r1/work/kdebase-3.5.1/applnk'
Making all in doc
make[2]: Entering directory `/var/tmp/portage/kdebase-3.5.1-r1/work/kdebase-3.5.1/doc'
Making all in .
make[3]: Entering directory `/var/tmp/portage/kdebase-3.5.1-r1/work/kdebase-3.5.1/doc'
make[3]: Nothing to be done for `all-am'.
make[3]: Leaving directory `/var/tmp/portage/kdebase-3.5.1-r1/work/kdebase-3.5.1/doc'
Making all in faq
make[3]: Entering directory `/var/tmp/portage/kdebase-3.5.1-r1/work/kdebase-3.5.1/doc/faq'
/usr/kde/3.5/bin/meinproc --check --cache index.cache.bz2 ./index.docbook
meinproc: WARNING: KLocale: trying to look up "" in catalog. Fix the program
XPath error : Undefined variable
$alphabetical[count(.|key('letter',                                  translate(substring(normalize-space(concat(primary/@sortas, primary[not(@sortas)])), 1, 1),                                            'abcdefghijklmnopqrstuvwxyz','ABCDEFGHIJKLMNOPQRSTUVWXYZ'))[count(ancestor::node()|$scope) = count(ancestor::node())
                and ($role = @role or $type = @type or
                (string-length($role) = 0 and string-length($type) = 0))][1]) = 1]
             ^
compilation error: file /usr/kde/3.5/share/apps/ksgmltools2/docbook/xsl/html/autoidx.xsl line 155 element apply-templates
xsl:apply-templates : could not compile select expression '$alphabetical[count(.|key('letter',                                  translate(substring(normalize-space(concat(primary/@sortas, primary[not(@sortas)])), 1, 1),                                            'abcdefghijklmnopqrstuvwxyz','ABCDEFGHIJKLMNOPQRSTUVWXYZ'))[count(ancestor::node()|$scope) = count(ancestor::node())
                and ($role = @role or $type = @type or
                (string-length($role) = 0 and string-length($type) = 0))][1]) = 1]'
XPath error : Undefined variable
$refs[secondary and count(.|key('secondary', concat($key, " ", normalize-space(concat(secondary/@sortas, secondary[not(@sortas)]))))[count(ancestor::node()|$scope) = count(ancestor::node())
                and ($role = @role or $type = @type or
                (string-length($role) = 0 and string-length($type) = 0))][1]) = 1]
     ^
compilation error: file /usr/kde/3.5/share/apps/ksgmltools2/docbook/xsl/html/autoidx.xsl line 251 element apply-templates
xsl:apply-templates : could not compile select expression '$refs[secondary and count(.|key('secondary', concat($key, " ", normalize-space(concat(secondary/@sortas, secondary[not(@sortas)]))))[count(ancestor::node()|$scope) = count(ancestor::node())
                and ($role = @role or $type = @type or
                (string-length($role) = 0 and string-length($type) = 0))][1]) = 1]'
XPath error : Undefined variable
key('id',$rootid)
                ^
compilation error: file /usr/kde/3.5/share/apps/ksgmltools2/docbook/xsl/html/docbook.xsl line 323 element apply-templates
xsl:apply-templates : could not compile select expression 'key('id',$rootid)'
XPath error : Undefined variable
key('id',$rootid)
                ^
compilation error: file /usr/kde/3.5/share/apps/ksgmltools2/docbook/xsl/html/docbook.xsl line 326 element apply-templates
xsl:apply-templates : could not compile select expression 'key('id',$rootid)'
XPath error : Undefined namespace prefix
compilation error: file /usr/kde/3.5/share/apps/ksgmltools2/docbook/xsl/VERSION line 55 element apply-templates
xsl:apply-templates : could not compile select expression 'fm:Changes'
XPath error : Undefined variable
$years[1]
      ^
compilation error: file /usr/kde/3.5/share/apps/ksgmltools2/docbook/xsl/common/common.xsl line 1522 element apply-templates
xsl:apply-templates : could not compile select expression '$years[1]'
XPath error : Undefined variable
$years[1]
      ^

compilation error: file /usr/kde/3.5/share/apps/ksgmltools2/docbook/xsl/common/common.xsl line 1525 element apply-templates
xsl:apply-templates : could not compile select expression '$years[1]'
XPath error : Undefined variable
compilation error: file /usr/kde/3.5/share/apps/ksgmltools2/docbook/xsl/common/labels.xsl line 452 element apply-templates
xsl:apply-templates : could not compile select expression '$lparent'
XPath error : Undefined variable
compilation error: file /usr/kde/3.5/share/apps/ksgmltools2/docbook/xsl/common/labels.xsl line 496 element apply-templates
xsl:apply-templates : could not compile select expression '$lparent'
XPath error : Undefined variable
compilation error: file /usr/kde/3.5/share/apps/ksgmltools2/docbook/xsl/common/labels.xsl line 573 element apply-templates
xsl:apply-templates : could not compile select expression '$pchap'
XPath error : Undefined variable
compilation error: file /usr/kde/3.5/share/apps/ksgmltools2/docbook/xsl/common/labels.xsl line 606 element apply-templates
xsl:apply-templates : could not compile select expression '$pchap'
XPath error : Undefined variable
compilation error: file /usr/kde/3.5/share/apps/ksgmltools2/docbook/xsl/common/titles.xsl line 131 element apply-templates
xsl:apply-templates : could not compile select expression '$title'
XPath error : Undefined variable
compilation error: file /usr/kde/3.5/share/apps/ksgmltools2/docbook/xsl/common/titles.xsl line 175 element apply-templates
xsl:apply-templates : could not compile select expression '$title'
XPath error : Undefined variable
$refentrytitle[1]
              ^
compilation error: file /usr/kde/3.5/share/apps/ksgmltools2/docbook/xsl/common/titles.xsl line 198 element apply-templates
xsl:apply-templates : could not compile select expression '$refentrytitle[1]'
XPath error : Undefined variable
$refname[1]
        ^
compilation error: file /usr/kde/3.5/share/apps/ksgmltools2/docbook/xsl/common/titles.xsl line 201 element apply-templates
xsl:apply-templates : could not compile select expression '$refname[1]'
XPath error : Undefined variable
compilation error: file /usr/kde/3.5/share/apps/ksgmltools2/docbook/xsl/common/titles.xsl line 240 element apply-templates
xsl:apply-templates : could not compile select expression '$title'
XPath error : Undefined variable
compilation error: file /usr/kde/3.5/share/apps/ksgmltools2/docbook/xsl/common/titles.xsl line 270 element apply-templates
xsl:apply-templates : could not compile select expression '$title'
XPath error : Undefined variable
compilation error: file /usr/kde/3.5/share/apps/ksgmltools2/docbook/xsl/common/titles.xsl line 287 element apply-templates
xsl:apply-templates : could not compile select expression '$title'
XPath error : Undefined variable
compilation error: file /usr/kde/3.5/share/apps/ksgmltools2/docbook/xsl/common/titles.xsl line 324 element apply-templates
xsl:apply-templates : could not compile select expression '$title'
XPath error : Undefined variable
compilation error: file /usr/kde/3.5/share/apps/ksgmltools2/docbook/xsl/common/titles.xsl line 341 element apply-templates
xsl:apply-templates : could not compile select expression '$title'
XPath error : Undefined variable
compilation error: file /usr/kde/3.5/share/apps/ksgmltools2/docbook/xsl/common/titles.xsl line 395 element apply-templates
xsl:apply-templates : could not compile select expression '$title'
XPath error : Undefined variable
compilation error: file /usr/kde/3.5/share/apps/ksgmltools2/docbook/xsl/common/titles.xsl line 481 element apply-templates
xsl:apply-templates : could not compile select expression '$titleabbrev'
XPath error : Undefined variable
compilation error: file /usr/kde/3.5/share/apps/ksgmltools2/docbook/xsl/common/titles.xsl line 505 element apply-templates
xsl:apply-templates : could not compile select expression '$titleabbrev'
XPath error : Undefined variable
compilation error: file /usr/kde/3.5/share/apps/ksgmltools2/docbook/xsl/common/titles.xsl line 540 element apply-templates

xsl:apply-templates : could not compile select expression '$titleabbrev'
XPath error : Undefined variable
compilation error: file /usr/kde/3.5/share/apps/ksgmltools2/docbook/xsl/common/titles.xsl line 642 element apply-templates
xsl:apply-templates : could not compile select expression '$etarget'
XPath error : Undefined variable
compilation error: file /usr/kde/3.5/share/apps/ksgmltools2/docbook/xsl/common/titles.xsl line 676 element apply-templates
xsl:apply-templates : could not compile select expression '$target'
XPath error : Undefined variable
compilation error: file /usr/kde/3.5/share/apps/ksgmltools2/docbook/xsl/common/targets.xsl line 143 element apply-templates
xsl:apply-templates : could not compile select expression '$nd'
XPath error : Undefined variable
compilation error: file /usr/kde/3.5/share/apps/ksgmltools2/docbook/xsl/common/targets.xsl line 173 element apply-templates
xsl:apply-templates : could not compile select expression '$nd'
XPath error : Undefined variable
compilation error: file /usr/kde/3.5/share/apps/ksgmltools2/docbook/xsl/common/olink.xsl line 1058 element apply-templates
xsl:apply-templates : could not compile select expression '$target'
XPath error : Undefined variable
compilation error: file /usr/kde/3.5/share/apps/ksgmltools2/docbook/xsl/html/autotoc.xsl line 70 element apply-templates
xsl:apply-templates : could not compile select expression '$nodes'
XPath error : Undefined variable
compilation error: file /usr/kde/3.5/share/apps/ksgmltools2/docbook/xsl/html/autotoc.xsl line 200 element apply-templates
xsl:apply-templates : could not compile select expression '$nodes'
XPath error : Undefined variable
$refentrytitle[1]
              ^
compilation error: file /usr/kde/3.5/share/apps/ksgmltools2/docbook/xsl/html/autotoc.xsl line 453 element apply-templates
xsl:apply-templates : could not compile select expression '$refentrytitle[1]'
XPath error : Undefined variable
$refname[1]
        ^
compilation error: file /usr/kde/3.5/share/apps/ksgmltools2/docbook/xsl/html/autotoc.xsl line 456 element apply-templates
xsl:apply-templates : could not compile select expression '$refname[1]'
XPath error : Undefined variable
compilation error: file /usr/kde/3.5/share/apps/ksgmltools2/docbook/xsl/html/autotoc.xsl line 516 element apply-templates
xsl:apply-templates : could not compile select expression '$node'
XPath error : Undefined variable
compilation error: file /usr/kde/3.5/share/apps/ksgmltools2/docbook/xsl/html/autotoc.xsl line 563 element apply-templates
xsl:apply-templates : could not compile select expression '$nodes'
XPath error : Undefined variable
compilation error: file /usr/kde/3.5/share/apps/ksgmltools2/docbook/xsl/html/autotoc.xsl line 544 element div
Attribute template class: failed to compile $titles
XPath error : Undefined variable
$alphabetical[count(.|key('letter',                                  translate(substring(normalize-space(concat(primary/@sortas, primary[not(@sortas)])), 1, 1),                                            'abcdefghijklmnopqrstuvwxyz','ABCDEFGHIJKLMNOPQRSTUVWXYZ'))[count(ancestor::node()|$scope) = count(ancestor::node())
                and ($role = @role or $type = @type or
                (string-length($role) = 0 and string-length($type) = 0))][1]) = 1]
             ^
compilation error: file /usr/kde/3.5/share/apps/ksgmltools2/docbook/xsl/html/autoidx.xsl line 155 element apply-templates
xsl:apply-templates : could not compile select expression '$alphabetical[count(.|key('letter',                                  translate(substring(normalize-space(concat(primary/@sortas, primary[not(@sortas)])), 1, 1),                                            'abcdefghijklmnopqrstuvwxyz','ABCDEFGHIJKLMNOPQRSTUVWXYZ'))[count(ancestor::node()|$scope) = count(ancestor::node())
                and ($role = @role or $type = @type or
                (string-length($role) = 0 and string-length($type) = 0))][1]) = 1]'
XPath error : Undefined variable
$refs[secondary and count(.|key('secondary', concat($key, " ", normalize-space(concat(secondary/@sortas, secondary[not(@sortas)]))))[count(ancestor::node()|$scope) = count(ancestor::node())
                and ($role = @role or $type = @type or
                (string-length($role) = 0 and string-length($type) = 0))][1]) = 1]
     ^
compilation error: file /usr/kde/3.5/share/apps/ksgmltools2/docbook/xsl/html/autoidx.xsl line 251 element apply-templates
xsl:apply-templates : could not compile select expression '$refs[secondary and count(.|key('secondary', concat($key, " ", normalize-space(concat(secondary/@sortas, secondary[not(@sortas)]))))[count(ancestor::node()|$scope) = count(ancestor::node())
                and ($role = @role or $type = @type or
                (string-length($role) = 0 and string-length($type) = 0))][1]) = 1]'
XPath error : Undefined variable
$segtitles[$segnum=position()]
          ^
compilation error: file /usr/kde/3.5/share/apps/ksgmltools2/docbook/xsl/html/lists.xsl line 828 element apply-templates
xsl:apply-templates : could not compile select expression '$segtitles[$segnum=position()]'
XPath error : Undefined variable
compilation error: file /usr/kde/3.5/share/apps/ksgmltools2/docbook/xsl/html/lists.xsl line 735 element ol
Attribute template type: failed to compile $numeration
XPath error : Undefined variable
compilation error: file /usr/kde/3.5/share/apps/ksgmltools2/docbook/xsl/html/callout.xsl line 158 element img
Attribute template src: failed to compile $callout.graphics.path
XPath error : Undefined variable
compilation error: file /usr/kde/3.5/share/apps/ksgmltools2/docbook/xsl/html/graphics.xsl line 1062 element a
Attribute template href: failed to compile $href.to
XPath error : Undefined variable
compilation error: file /usr/kde/3.5/share/apps/ksgmltools2/docbook/xsl/html/xref.xsl line 68 element apply-templates
xsl:apply-templates : could not compile select expression '$etarget'
XPath error : Undefined variable
compilation error: file /usr/kde/3.5/share/apps/ksgmltools2/docbook/xsl/html/xref.xsl line 117 element apply-templates
xsl:apply-templates : could not compile select expression '$target'
XPath error : Undefined variable
compilation error: file /usr/kde/3.5/share/apps/ksgmltools2/docbook/xsl/html/xref.xsl line 790 element apply-templates
xsl:apply-templates : could not compile select expression '$etarget'
XPath error : Undefined variable
compilation error: file /usr/kde/3.5/share/apps/ksgmltools2/docbook/xsl/html/xref.xsl line 62 element a
Attribute template href: failed to compile $href
XPath error : Undefined variable
compilation error: file /usr/kde/3.5/share/apps/ksgmltools2/docbook/xsl/html/xref.xsl line 67 element a
Attribute template href: failed to compile $href
XPath error : Undefined variable
compilation error: file /usr/kde/3.5/share/apps/ksgmltools2/docbook/xsl/html/xref.xsl line 96 element a
Attribute template href: failed to compile $href
XPath error : Undefined variable
compilation error: file /usr/kde/3.5/share/apps/ksgmltools2/docbook/xsl/html/xref.xsl line 936 element a
Attribute template href: failed to compile $href
XPath error : Undefined variable
compilation error: file /usr/kde/3.5/share/apps/ksgmltools2/docbook/xsl/html/xref.xsl line 993 element a
Attribute template href: failed to compile $href
XPath error : Undefined variable
compilation error: file /usr/kde/3.5/share/apps/ksgmltools2/docbook/xsl/html/formal.xsl line 56 element apply-templates
xsl:apply-templates : could not compile select expression '$object'
XPath error : Undefined variable
compilation error: file /usr/kde/3.5/share/apps/ksgmltools2/docbook/xsl/html/sections.xsl line 80 element apply-templates
xsl:apply-templates : could not compile select expression '$section'
XPath error : Undefined variable
compilation error: file /usr/kde/3.5/share/apps/ksgmltools2/docbook/xsl/html/footnote.xsl line 60 element apply-templates
xsl:apply-templates : could not compile select expression '$footnote'
XPath error : Undefined variable
compilation error: file /usr/kde/3.5/share/apps/ksgmltools2/docbook/xsl/html/footnote.xsl line 168 element apply-templates
xsl:apply-templates : could not compile select expression '$html-nodes'
XPath error : Undefined variable
compilation error: file /usr/kde/3.5/share/apps/ksgmltools2/docbook/xsl/html/footnote.xsl line 173 element apply-templates
xsl:apply-templates : could not compile select expression '$html-nodes'
XPath error : Undefined variable
compilation error: file /usr/kde/3.5/share/apps/ksgmltools2/docbook/xsl/html/footnote.xsl line 220 element apply-templates
xsl:apply-templates : could not compile select expression '$footnotes'
XPath error : Undefined variable
compilation error: file /usr/kde/3.5/share/apps/ksgmltools2/docbook/xsl/html/footnote.xsl line 30 element a
Attribute template name: failed to compile $name
XPath error : Undefined variable
compilation error: file /usr/kde/3.5/share/apps/ksgmltools2/docbook/xsl/html/footnote.xsl line 30 element a
Attribute template href: failed to compile $href
XPath error : Undefined variable
compilation error: file /usr/kde/3.5/share/apps/ksgmltools2/docbook/xsl/html/footnote.xsl line 39 element a
Attribute template name: failed to compile $name
XPath error : Undefined variable
compilation error: file /usr/kde/3.5/share/apps/ksgmltools2/docbook/xsl/html/footnote.xsl line 39 element a
Attribute template href: failed to compile $href
XPath error : Undefined variable
compilation error: file /usr/kde/3.5/share/apps/ksgmltools2/docbook/xsl/html/footnote.xsl line 59 element a
Attribute template href: failed to compile $href
XPath error : Undefined variable
compilation error: file /usr/kde/3.5/share/apps/ksgmltools2/docbook/xsl/html/footnote.xsl line 123 element a
Attribute template name: failed to compile $name
XPath error : Undefined variable
compilation error: file /usr/kde/3.5/share/apps/ksgmltools2/docbook/xsl/html/footnote.xsl line 123 element a
Attribute template href: failed to compile $href
XPath error : Undefined variable
compilation error: file /usr/kde/3.5/share/apps/ksgmltools2/docbook/xsl/html/footnote.xsl line 151 element a
Attribute template name: failed to compile $name
XPath error : Undefined variable
compilation error: file /usr/kde/3.5/share/apps/ksgmltools2/docbook/xsl/html/footnote.xsl line 151 element a
Attribute template href: failed to compile $href
XPath error : Undefined variable
$refentrytitle[1]
              ^
compilation error: file /usr/kde/3.5/share/apps/ksgmltools2/docbook/xsl/html/refentry.xsl line 59 element apply-templates
xsl:apply-templates : could not compile select expression '$refentrytitle[1]'
XPath error : Undefined variable
$refname[1]
        ^
compilation error: file /usr/kde/3.5/share/apps/ksgmltools2/docbook/xsl/html/refentry.xsl line 62 element apply-templates
xsl:apply-templates : could not compile select expression '$refname[1]'
XPath error : Undefined variable
compilation error: file /usr/kde/3.5/share/apps/ksgmltools2/docbook/xsl/html/admon.xsl line 83 element img
Attribute template alt: failed to compile $alt
XPath error : Undefined variable
compilation error: file /usr/kde/3.5/share/apps/ksgmltools2/docbook/xsl/html/component.xsl line 43 element apply-templates
xsl:apply-templates : could not compile select expression '$node'
XPath error : Undefined variable
$revnumber[1]
          ^
compilation error: file /usr/kde/3.5/share/apps/ksgmltools2/docbook/xsl/html/titlepage.xsl line 685 element apply-templates
xsl:apply-templates : could not compile select expression '$revnumber[1]'
XPath error : Undefined variable
$revdate[1]

        ^
compilation error: file /usr/kde/3.5/share/apps/ksgmltools2/docbook/xsl/html/titlepage.xsl line 689 element apply-templates
xsl:apply-templates : could not compile select expression '$revdate[1]'
XPath error : Undefined variable
$revauthor[1]
          ^
compilation error: file /usr/kde/3.5/share/apps/ksgmltools2/docbook/xsl/html/titlepage.xsl line 694 element apply-templates
xsl:apply-templates : could not compile select expression '$revauthor[1]'
XPath error : Undefined variable
$revremark[1]
          ^
compilation error: file /usr/kde/3.5/share/apps/ksgmltools2/docbook/xsl/html/titlepage.xsl line 706 element apply-templates
xsl:apply-templates : could not compile select expression '$revremark[1]'
XPath error : Undefined variable
compilation error: file /usr/kde/3.5/share/apps/ksgmltools2/docbook/xsl/html/ebnf.xsl line 306 element apply-templates
xsl:apply-templates : could not compile select expression '$target'
XPath error : Undefined variable
compilation error: file /usr/kde/3.5/share/apps/ksgmltools2/docbook/xsl/html/ebnf.xsl line 236 element a
Attribute template href: failed to compile $href
XPath error : Undefined variable
compilation error: file /usr/kde/3.5/share/apps/ksgmltools2/docbook/xsl/html/ebnf.xsl line 303 element a
Attribute template href: failed to compile $href
XPath error : Undefined variable
exsl:node-set($p)
                ^
compilation error: file /usr/kde/3.5/share/apps/ksgmltools2/docbook/xsl/html/html-rtf.xsl line 114 element apply-templates
xsl:apply-templates : could not compile select expression 'exsl:node-set($p)'
XPath error : Undefined variable
compilation error: file /usr/kde/3.5/share/apps/ksgmltools2/docbook/xsl/html/html-rtf.xsl line 185 element apply-templates
xsl:apply-templates : could not compile select expression '$leading'
XPath error : Undefined variable
compilation error: file /usr/kde/3.5/share/apps/ksgmltools2/docbook/xsl/html/html-rtf.xsl line 189 element apply-templates
xsl:apply-templates : could not compile select expression '$block'
XPath error : Undefined variable
compilation error: file /usr/kde/3.5/share/apps/ksgmltools2/docbook/xsl/html/html-rtf.xsl line 208 element apply-templates
xsl:apply-templates : could not compile select expression '$nodes'
XPath error : Undefined variable
exsl:node-set($div)
                  ^
compilation error: file /usr/kde/3.5/share/apps/ksgmltools2/docbook/xsl/html/html-rtf.xsl line 304 element apply-templates
xsl:apply-templates : could not compile select expression 'exsl:node-set($div)'
XPath error : Undefined variable
compilation error: file /usr/kde/3.5/share/apps/ksgmltools2/docbook/xsl/html/docbook.xsl line 137 element base
Attribute template href: failed to compile $html.base
XPath error : Undefined variable
compilation error: file /usr/kde/3.5/share/apps/ksgmltools2/docbook/xsl/html/docbook.xsl line 140 element meta
Attribute template content: failed to compile $VERSION
XPath error : Undefined variable
substring-before($stylesheets, ' ')
                             ^
compilation error: file /usr/kde/3.5/share/apps/ksgmltools2/docbook/xsl/html/docbook.xsl line 197 element link
Attribute template href: failed to compile substring-before($stylesheets, ' ')
XPath error : Undefined variable
compilation error: file /usr/kde/3.5/share/apps/ksgmltools2/docbook/xsl/html/chunk-common.xsl line 749 element apply-templates
xsl:apply-templates : could not compile select expression '$up'
XPath error : Undefined variable
compilation error: file /usr/kde/3.5/share/apps/ksgmltools2/docbook/xsl/html/chunk-common.xsl line 866 element apply-templates
xsl:apply-templates : could not compile select expression '$prev'
XPath error : Undefined variable
compilation error: file /usr/kde/3.5/share/apps/ksgmltools2/docbook/xsl/html/chunk-common.xsl line 907 element apply-templates
xsl:apply-templates : could not compile select expression '$next'
XPath error : Undefined variable
key('id',$rootid)
                ^
compilation error: file /usr/kde/3.5/share/apps/ksgmltools2/docbook/xsl/html/chunk-code.xsl line 512 element apply-templates
xsl:apply-templates : could not compile select expression 'key('id',$rootid)'
XPath error : Undefined variable
key('id',$rootid)
                ^
compilation error: file /usr/kde/3.5/share/apps/ksgmltools2/docbook/xsl/html/chunk-code.xsl line 515 element apply-templates
xsl:apply-templates : could not compile select expression 'key('id',$rootid)'
XPath error : Undefined variable
$footnotes[1]
          ^
compilation error: file /usr/kde/3.5/share/apps/ksgmltools2/docbook/xsl/html/chunk-code.xsl line 954 element apply-templates
xsl:apply-templates : could not compile select expression '$footnotes[1]'
XPath error : Undefined variable
compilation error: file /usr/kde/3.5/share/apps/ksgmltools2/docbook/xsl/html/chunk-code.xsl line 805 element a
Attribute template href: failed to compile $href
XPath error : Undefined variable
compilation error: file /usr/kde/3.5/share/apps/ksgmltools2/customization/kde-navig.xsl line 94 element apply-templates
xsl:apply-templates : could not compile select expression '$up'
XPath error : Undefined variable
compilation error: file /usr/kde/3.5/share/apps/ksgmltools2/customization/kde-navig.xsl line 162 element apply-templates
xsl:apply-templates : could not compile select expression '$prev'
XPath error : Undefined variable
compilation error: file /usr/kde/3.5/share/apps/ksgmltools2/customization/kde-navig.xsl line 167 element apply-templates
xsl:apply-templates : could not compile select expression '$next'
XPath error : Undefined variable
compilation error: file /usr/kde/3.5/share/apps/ksgmltools2/customization/kde-navig.xsl line 47 element img
Attribute template src: failed to compile $kde.common
XPath error : Undefined variable
compilation error: file /usr/kde/3.5/share/apps/ksgmltools2/customization/kde-navig.xsl line 195 element div
Attribute template style: failed to compile $kde.common
unable to parse ./index.docbook
make[3]: *** [index.cache.bz2] Error 1
make[3]: Leaving directory `/var/tmp/portage/kdebase-3.5.1-r1/work/kdebase-3.5.1/doc/faq'
make[2]: *** [all-recursive] Error 1
make[2]: Leaving directory `/var/tmp/portage/kdebase-3.5.1-r1/work/kdebase-3.5.1/doc'
make[1]: *** [all-recursive] Error 1
make[1]: Leaving directory `/var/tmp/portage/kdebase-3.5.1-r1/work/kdebase-3.5.1'
make: *** [all] Error 2

!!! ERROR: kde-base/kdebase-3.5.1-r1 failed.
Call stack:
  ebuild.sh, line 1894:   Called dyn_compile
  ebuild.sh, line 941:   Called src_compile
  kdebase-3.5.1-r1.ebuild, line 108:   Called kde_src_compile
  kde.eclass, line 74:   Called kde_src_compile 'compile'
  kde.eclass, line 187:   Called kde_src_compile 'all' 'myconf' 'configure'

!!! died running emake, kde_src_compile:make
!!! If you need support, post the topmost build error, and the call stack if relevant.



A l'aide !!
_________________
Mon MediaWiki perso : http://pix-mania.dyndns.org
Back to top
View user's profile Send private message
Anthyme
Guru
Guru


Joined: 25 Jun 2004
Posts: 498

PostPosted: Wed Feb 08, 2006 5:00 pm    Post subject: Reply with quote

un ptit revdep-rebuild aide parfois
Back to top
View user's profile Send private message
loopx
Advocate
Advocate


Joined: 01 Apr 2005
Posts: 2787
Location: Belgium / Liège

PostPosted: Wed Feb 08, 2006 5:18 pm    Post subject: Reply with quote

Je l'ai déjà fais, mais je vais le refaire, puis rebooter, puis re-emerger
_________________
Mon MediaWiki perso : http://pix-mania.dyndns.org
Back to top
View user's profile Send private message
Trevoke
Advocate
Advocate


Joined: 04 Sep 2004
Posts: 4099
Location: NY, NY

PostPosted: Wed Feb 08, 2006 5:25 pm    Post subject: Reply with quote

C'est pas la peine de rebooter.

Refais-nous un
# gcc-config -l ?
Essaye
# env-update && source /etc/profile && emerge (ce que tu emerges).
_________________
Votre moment detente
What is the nature of conflict?
Back to top
View user's profile Send private message
TGL
Bodhisattva
Bodhisattva


Joined: 02 Jun 2002
Posts: 1978
Location: Rennes, France

PostPosted: Wed Feb 08, 2006 5:31 pm    Post subject: Reply with quote

Tes nouvelles erreurs, c'est probablement le bug #105297. Il semble qu'il faudrait réessayer après avoir installé une version bien récente de dev-libs/libxslt.

PS : Essaye de penser à chercher un peu sur bugzilla quand tu as des erreurs de compilation. En fait, il est assez rare qu'on soit le premier à en rencontrer une, donc les chances sont grandes de trouver un bug report où l'on peut soit trouver des solutions, soit aider en commentant un peu.
Par exemple ici, j'ai trouvé le bug report rapidement, avec (dans "Advanced Search") :
- Summary (contains all of the words/strings): "kde" (pour cibler un peu)
- A Comment (contains the string): "xpath" (parceque ça m'avait l'air d'être un mot assez caractéristique de tes messages d'erreur)
- Status: tous séléctionnés (y compris FIXED et compagnie, histoire de n'en rater aucun. En l'occurence, ce bug est marqué FIXED, alors qu'il ne l'est pas vraiment puisque tu es tombé dessus toi aussi...)
Back to top
View user's profile Send private message
loopx
Advocate
Advocate


Joined: 01 Apr 2005
Posts: 2787
Location: Belgium / Liège

PostPosted: Wed Feb 08, 2006 5:46 pm    Post subject: Reply with quote

En fait, je viens de remarquer que revdep-rebuild plantais sur le premier emerge, donc je suis entrain d'emerger manuellement les packets qui n'as pas re-emerger, puis je reessaye :)

EDIT: @TGL: j'ai la meme version de kde sur le portable, et le pc n'arrive pas à compiler, donc je ne pense à un bug mais à un problème avec mes mises à jour vu que j'ai changé de gcc et de choost
_________________
Mon MediaWiki perso : http://pix-mania.dyndns.org
Back to top
View user's profile Send private message
TGL
Bodhisattva
Bodhisattva


Joined: 02 Jun 2002
Posts: 1978
Location: Rennes, France

PostPosted: Wed Feb 08, 2006 6:22 pm    Post subject: Reply with quote

loopx wrote:
EDIT: @TGL: j'ai la meme version de kde sur le portable, et le pc n'arrive pas à compiler, donc je ne pense à un bug mais à un problème avec mes mises à jour vu que j'ai changé de gcc et de choost

Bah là ton pb de toolchain il a l'air corrigé, non ? Tu viens quand même de compiler kdebase avec succès... (modulo que la préparation de la doc foire à la fin, ce qui n'a vraisemblablement rien à voir avec gcc et ses amis).
Enfin bref, c'est toi qui vois, mais là étant donné le nombre de gens qui ont rapporté les mêmes erreurs que celles que tu rencontres, je trouve que ça vaut le coup d'essayer les solutions qu'ils suggèrent.
Back to top
View user's profile Send private message
loopx
Advocate
Advocate


Joined: 01 Apr 2005
Posts: 2787
Location: Belgium / Liège

PostPosted: Wed Feb 08, 2006 8:12 pm    Post subject: Reply with quote

Bon, j'affiche un résolu parce que en effet, mon pc étais pas à jour et j'avais la version juste avant la dernière (du packet qui fais foirer tout) et maintenant, ca fonctionne, enfin, ca compile toujours, mais si ca marchais pas, il aurait déjà du s'arreter depuis 1 heure.

Merci pour tout :)
_________________
Mon MediaWiki perso : http://pix-mania.dyndns.org
Back to top
View user's profile Send private message
Display posts from previous:   
Reply to topic    Gentoo Forums Forum Index French All times are GMT
Page 1 of 1

 
Jump to:  
You cannot post new topics in this forum
You cannot reply to topics in this forum
You cannot edit your posts in this forum
You cannot delete your posts in this forum
You cannot vote in polls in this forum