Gentoo Forums
Gentoo Forums
Gentoo Forums
Quick Search: in
OpenOffice.org 2.0.1 released
View unanswered posts
View posts from last 24 hours

Goto page 1, 2  Next  
Reply to topic    Gentoo Forums Forum Index Gentoo Chat
View previous topic :: View next topic  
Author Message
Phaedo
n00b
n00b


Joined: 27 Nov 2005
Posts: 47

PostPosted: Thu Dec 22, 2005 6:44 am    Post subject: OpenOffice.org 2.0.1 released Reply with quote

http://www.openoffice.org/
openoffice-bin is aready in portage.
Back to top
View user's profile Send private message
Sir No
Apprentice
Apprentice


Joined: 01 May 2005
Posts: 159
Location: Poland

PostPosted: Thu Dec 22, 2005 1:34 pm    Post subject: Re: OpenOffice.org 2.0.1 released Reply with quote

Phaedo wrote:
http://www.openoffice.org/
openoffice-bin is aready in portage.


Great! And localizations are included too! :D
I really like what the openoffice-bin maintainers do. :mrgreen:

I'll just have to get the installer plus several localizations manually, and install them manually for some my friends and family which are still bound to the .EXE-style installation format. Busy days in the Win**** computing environment, and right before christmas...

But the Portage shines here! (2.0.1 already merged on my Gentoo without problems)
Keep up the good work!

Respect.
_________________
The geeks | Recommended Packages fOr Desktop & Server | Read BBCode Guide!
Back to top
View user's profile Send private message
jannis
Guru
Guru


Joined: 05 Dec 2004
Posts: 325
Location: Germany / Bavaria / Aschaffenburg

PostPosted: Thu Dec 22, 2005 1:40 pm    Post subject: Reply with quote

ARGH!
I just compiled OOo 2.0-source on my father's PC (667 MHz, 196MB RAM) so he can use his OOo in german just a week ago and now they release a bin with localizations! (Or did I read the post before mine wrong?)
Well, they do a good job >_<
Back to top
View user's profile Send private message
Sir No
Apprentice
Apprentice


Joined: 01 May 2005
Posts: 159
Location: Poland

PostPosted: Thu Dec 22, 2005 2:04 pm    Post subject: Reply with quote

jannis wrote:
ARGH!
I just compiled OOo 2.0-source on my father's PC (667 MHz, 196MB RAM) so he can use his OOo in german just a week ago and now they release a bin with localizations! (Or did I read the post before mine wrong?)
Well, they do a good job >_<

Yeah, just set the LINGUAS variable in make.conf, unmask app-office/openoffice-bin in package.keywords and off you go!

The latter is needed if you want the upgrades delivered as soon as they are available, because the newest openoffice-bin ebuilds contain KEYWORDS="~x86 ~amd64". OTOH openoffice-bin-2.0.0 has KEYWORDS="x86 ~amd64", so it all depends on your needs, experience and willingness to experiment. :)

HTH
_________________
The geeks | Recommended Packages fOr Desktop & Server | Read BBCode Guide!
Back to top
View user's profile Send private message
jannis
Guru
Guru


Joined: 05 Dec 2004
Posts: 325
Location: Germany / Bavaria / Aschaffenburg

PostPosted: Thu Dec 22, 2005 3:16 pm    Post subject: Reply with quote

Yeah I know but I waited very long for the slow PC to finish compiling and now there's a german version without compiling. This is quite annoying.
Back to top
View user's profile Send private message
mikegpitt
Advocate
Advocate


Joined: 22 May 2004
Posts: 3217

PostPosted: Thu Dec 22, 2005 7:48 pm    Post subject: Reply with quote

Just installed the bin... I love how fast the OO stuff becomes stable in portage.

Speaking of stability, I hope this weeds out the crashes I was having with OO-2.0
Back to top
View user's profile Send private message
jhunholz
Apprentice
Apprentice


Joined: 29 Apr 2004
Posts: 154
Location: Raleigh, NC

PostPosted: Thu Dec 22, 2005 8:00 pm    Post subject: Reply with quote

The source ebuild is in portage too! I like building it from source so I can have the Gentoo logo on the splash-screen. :)
_________________
Member of the Gentoo Right Wing Conspiracy
Back to top
View user's profile Send private message
Xake
Guru
Guru


Joined: 11 Feb 2004
Posts: 588
Location: Göteborg, the rainy part of scandinavia

PostPosted: Thu Dec 22, 2005 11:28 pm    Post subject: Reply with quote

Well: openoffice-2.0.1 does not seems to build here with GCC-4.0.2 and sun-jdk-1.5.0.06.
Are going to try some magic and see, but....
Back to top
View user's profile Send private message
jannis
Guru
Guru


Joined: 05 Dec 2004
Posts: 325
Location: Germany / Bavaria / Aschaffenburg

PostPosted: Fri Dec 23, 2005 12:37 am    Post subject: Reply with quote

AFAIK it ain't possible to compile OOo against java-1.5.X. If I'm wrong correct me and please tell me how it works.
Back to top
View user's profile Send private message
DaNIsH
Apprentice
Apprentice


Joined: 01 Jan 2003
Posts: 197
Location: Melbourne, Australia.

PostPosted: Fri Dec 23, 2005 3:08 am    Post subject: Reply with quote

The compilation is bugging out for me.
Code:
/var/tmp/portage/openoffice-2.0.1/work/ooo-build-2.0.1/build/ooa680-m1/sfx2/source/appl/shutdownicon.cxx: In member function `void ShutdownIcon::initSystray()':
/var/tmp/portage/openoffice-2.0.1/work/ooo-build-2.0.1/build/ooa680-m1/sfx2/source/appl/shutdownicon.cxx:202: error: expected primary-expression before "void"
/var/tmp/portage/openoffice-2.0.1/work/ooo-build-2.0.1/build/ooa680-m1/sfx2/source/appl/shutdownicon.cxx:202: error: expected `;' before "void"
/var/tmp/portage/openoffice-2.0.1/work/ooo-build-2.0.1/build/ooa680-m1/sfx2/source/appl/shutdownicon.cxx:215: error: expected primary-expression before '(' token
/var/tmp/portage/openoffice-2.0.1/work/ooo-build-2.0.1/build/ooa680-m1/sfx2/source/appl/shutdownicon.cxx:215: error: expected primary-expression before "aSMgr"
/var/tmp/portage/openoffice-2.0.1/work/ooo-build-2.0.1/build/ooa680-m1/sfx2/source/appl/shutdownicon.cxx:215: error: expected `;' before ':' token
/var/tmp/portage/openoffice-2.0.1/work/ooo-build-2.0.1/build/ooa680-m1/sfx2/source/appl/shutdownicon.cxx:226: error: no matching function for call to `ShutdownIcon::ShutdownIcon()'
./shutdownicon.hxx:93: note: candidates are: virtual ShutdownIcon::~ShutdownIcon()
/var/tmp/portage/openoffice-2.0.1/work/ooo-build-2.0.1/build/ooa680-m1/sfx2/source/appl/shutdownicon.cxx:227: error: expected `;' before '{' token
/var/tmp/portage/openoffice-2.0.1/work/ooo-build-2.0.1/build/ooa680-m1/sfx2/source/appl/shutdownicon.cxx:234: error: a function-definition is not allowed here before '{' token
/var/tmp/portage/openoffice-2.0.1/work/ooo-build-2.0.1/build/ooa680-m1/sfx2/source/appl/shutdownicon.cxx:234: error: expected `,' or `;' before '{' token
/var/tmp/portage/openoffice-2.0.1/work/ooo-build-2.0.1/build/ooa680-m1/sfx2/source/appl/shutdownicon.cxx:262: error: expected primary-expression before "void"
/var/tmp/portage/openoffice-2.0.1/work/ooo-build-2.0.1/build/ooa680-m1/sfx2/source/appl/shutdownicon.cxx:262: error: expected `;' before "void"
/var/tmp/portage/openoffice-2.0.1/work/ooo-build-2.0.1/build/ooa680-m1/sfx2/source/appl/shutdownicon.cxx:397: error: expected primary-expression before "void"
/var/tmp/portage/openoffice-2.0.1/work/ooo-build-2.0.1/build/ooa680-m1/sfx2/source/appl/shutdownicon.cxx:397: error: expected `;' before "void"
/var/tmp/portage/openoffice-2.0.1/work/ooo-build-2.0.1/build/ooa680-m1/sfx2/source/appl/shutdownicon.cxx:439: error: a function-definition is not allowed here before '{' token
/var/tmp/portage/openoffice-2.0.1/work/ooo-build-2.0.1/build/ooa680-m1/sfx2/source/appl/shutdownicon.cxx:439: error: expected `,' or `;' before '{' token
/var/tmp/portage/openoffice-2.0.1/work/ooo-build-2.0.1/build/ooa680-m1/sfx2/source/appl/shutdownicon.cxx:452: error: a function-definition is not allowed here before '{' token
/var/tmp/portage/openoffice-2.0.1/work/ooo-build-2.0.1/build/ooa680-m1/sfx2/source/appl/shutdownicon.cxx:452: error: expected `,' or `;' before '{' token
/var/tmp/portage/openoffice-2.0.1/work/ooo-build-2.0.1/build/ooa680-m1/sfx2/source/appl/shutdownicon.cxx:460: error: expected primary-expression before "void"
/var/tmp/portage/openoffice-2.0.1/work/ooo-build-2.0.1/build/ooa680-m1/sfx2/source/appl/shutdownicon.cxx:460: error: expected `;' before "void"
/var/tmp/portage/openoffice-2.0.1/work/ooo-build-2.0.1/build/ooa680-m1/sfx2/source/appl/shutdownicon.cxx:468: error: expected primary-expression before "void"
/var/tmp/portage/openoffice-2.0.1/work/ooo-build-2.0.1/build/ooa680-m1/sfx2/source/appl/shutdownicon.cxx:468: error: expected `;' before "void"
/var/tmp/portage/openoffice-2.0.1/work/ooo-build-2.0.1/build/ooa680-m1/sfx2/source/appl/shutdownicon.cxx:495: error: expected primary-expression before '*' token
/var/tmp/portage/openoffice-2.0.1/work/ooo-build-2.0.1/build/ooa680-m1/sfx2/source/appl/shutdownicon.cxx:496: error: expected `;' before '{' token
/var/tmp/portage/openoffice-2.0.1/work/ooo-build-2.0.1/build/ooa680-m1/sfx2/source/appl/shutdownicon.cxx:504: error: expected primary-expression before "void"
/var/tmp/portage/openoffice-2.0.1/work/ooo-build-2.0.1/build/ooa680-m1/sfx2/source/appl/shutdownicon.cxx:504: error: expected `;' before "void"
/var/tmp/portage/openoffice-2.0.1/work/ooo-build-2.0.1/build/ooa680-m1/sfx2/source/appl/shutdownicon.cxx:515: error: a function-definition is not allowed here before '{' token
/var/tmp/portage/openoffice-2.0.1/work/ooo-build-2.0.1/build/ooa680-m1/sfx2/source/appl/shutdownicon.cxx:515: error: expected `,' or `;' before '{' token
/var/tmp/portage/openoffice-2.0.1/work/ooo-build-2.0.1/build/ooa680-m1/sfx2/source/appl/shutdownicon.cxx:523: error: a function-definition is not allowed here before '{' token
/var/tmp/portage/openoffice-2.0.1/work/ooo-build-2.0.1/build/ooa680-m1/sfx2/source/appl/shutdownicon.cxx:523: error: expected `,' or `;' before '{' token
/var/tmp/portage/openoffice-2.0.1/work/ooo-build-2.0.1/build/ooa680-m1/sfx2/source/appl/shutdownicon.cxx:535: error: a function-definition is not allowed here before '{' token
/var/tmp/portage/openoffice-2.0.1/work/ooo-build-2.0.1/build/ooa680-m1/sfx2/source/appl/shutdownicon.cxx:535: error: expected `,' or `;' before '{' token
/var/tmp/portage/openoffice-2.0.1/work/ooo-build-2.0.1/build/ooa680-m1/sfx2/source/appl/shutdownicon.cxx:543: error: a function-definition is not allowed here before '{' token
/var/tmp/portage/openoffice-2.0.1/work/ooo-build-2.0.1/build/ooa680-m1/sfx2/source/appl/shutdownicon.cxx:543: error: expected `,' or `;' before '{' token
/var/tmp/portage/openoffice-2.0.1/work/ooo-build-2.0.1/build/ooa680-m1/sfx2/source/appl/shutdownicon.cxx:597: error: expected primary-expression before "void"
/var/tmp/portage/openoffice-2.0.1/work/ooo-build-2.0.1/build/ooa680-m1/sfx2/source/appl/shutdownicon.cxx:597: error: expected `;' before "void"
/var/tmp/portage/openoffice-2.0.1/work/ooo-build-2.0.1/build/ooa680-m1/sfx2/source/appl/shutdownicon.cxx:604: error: expected primary-expression before "void"
/var/tmp/portage/openoffice-2.0.1/work/ooo-build-2.0.1/build/ooa680-m1/sfx2/source/appl/shutdownicon.cxx:604: error: expected `;' before "void"
/var/tmp/portage/openoffice-2.0.1/work/ooo-build-2.0.1/build/ooa680-m1/sfx2/source/appl/shutdownicon.cxx:612: error: expected primary-expression before "bool"
/var/tmp/portage/openoffice-2.0.1/work/ooo-build-2.0.1/build/ooa680-m1/sfx2/source/appl/shutdownicon.cxx:612: error: expected `;' before "bool"
/var/tmp/portage/openoffice-2.0.1/work/ooo-build-2.0.1/build/ooa680-m1/sfx2/source/appl/shutdownicon.cxx:674: error: expected primary-expression
/var/tmp/portage/openoffice-2.0.1/work/ooo-build-2.0.1/build/ooa680-m1/sfx2/source/appl/shutdownicon.cxx:674: error: expected `;'
/var/tmp/portage/openoffice-2.0.1/work/ooo-build-2.0.1/build/ooa680-m1/sfx2/source/appl/shutdownicon.cxx:702: error: expected primary-expression before "bool"
/var/tmp/portage/openoffice-2.0.1/work/ooo-build-2.0.1/build/ooa680-m1/sfx2/source/appl/shutdownicon.cxx:702: error: expected `;' before "bool"
/var/tmp/portage/openoffice-2.0.1/work/ooo-build-2.0.1/build/ooa680-m1/sfx2/source/appl/shutdownicon.cxx:721: error: a function-definition is not allowed here before '{' token
/var/tmp/portage/openoffice-2.0.1/work/ooo-build-2.0.1/build/ooa680-m1/sfx2/source/appl/shutdownicon.cxx:721: error: expected `,' or `;' before '{' token
/var/tmp/portage/openoffice-2.0.1/work/ooo-build-2.0.1/build/ooa680-m1/sfx2/source/appl/shutdownicon.cxx:779: error: expected `}' at end of input
dmake:  Error code 1, while making '../../unxlngi6.pro/slo/shutdownicon.obj'
'---* tg_merge.mk *---'
dmake:  Error code 255, while making 'do_it_exceptions'
'---* tg_merge.mk *---'

ERROR: Error 65280 occurred while making /var/tmp/portage/openoffice-2.0.1/work/ooo-build-2.0.1/build/ooa680-m1/sfx2/source/appl
make: *** [stamp/build] Error 1

!!! ERROR: app-office/openoffice-2.0.1 failed.
!!! Function src_compile, Line 191, Exitcode 2
!!! Build failed
!!! If you need support, post the topmost build error, NOT this status message.

_________________
Adopt an unanswered post today
Back to top
View user's profile Send private message
Phaedo
n00b
n00b


Joined: 27 Nov 2005
Posts: 47

PostPosted: Fri Dec 23, 2005 6:34 am    Post subject: Reply with quote

jhunholz wrote:
...I like building it from source so I can have the Gentoo logo on the splash-screen. :)

How do you do that? :?:
Back to top
View user's profile Send private message
jannis
Guru
Guru


Joined: 05 Dec 2004
Posts: 325
Location: Germany / Bavaria / Aschaffenburg

PostPosted: Fri Dec 23, 2005 7:35 am    Post subject: Reply with quote

If you compile from source you should get a gentoo-splashscreen when you start OOo.
Back to top
View user's profile Send private message
truc
Advocate
Advocate


Joined: 25 Jul 2005
Posts: 3199

PostPosted: Fri Dec 23, 2005 7:39 am    Post subject: Reply with quote

Code:
emerge openoffice
:?:
Back to top
View user's profile Send private message
omp
Retired Dev
Retired Dev


Joined: 10 Sep 2005
Posts: 1018
Location: Glendale, California

PostPosted: Fri Dec 23, 2005 8:17 am    Post subject: Reply with quote

truc wrote:
Code:
emerge openoffice
:?:
yes
_________________
meow.
Back to top
View user's profile Send private message
Xake
Guru
Guru


Joined: 11 Feb 2004
Posts: 588
Location: Göteborg, the rainy part of scandinavia

PostPosted: Fri Dec 23, 2005 8:55 am    Post subject: Reply with quote

jannis wrote:
AFAIK it ain't possible to compile OOo against java-1.5.X. If I'm wrong correct me and please tell me how it works.

ChangeLog wrote:
*openoffice-2.0.1 (22 Dec 2005) 22 Dec 2005; Andreas Proschofsky (suka) +openoffice-2.0.1.ebuild: New upstream release, lot's of bug fixes, most notably this should build with java 1.5 now


But he could be wrong, I think I read somewhere that 1.5 would not be supported until 2.0.2.
Back to top
View user's profile Send private message
chl
n00b
n00b


Joined: 13 May 2003
Posts: 65
Location: Munich

PostPosted: Fri Dec 23, 2005 11:09 am    Post subject: Reply with quote

DaNIsH wrote:
The compilation is bugging out for me.


I have the same problem and no idea how to solve ist.

CHL
_________________
The difficulty in designing something completely foolproof, is not to underestimate the ingenuity of complete fools.
Back to top
View user's profile Send private message
Gergan Penkov
Veteran
Veteran


Joined: 17 Jul 2004
Posts: 1464
Location: das kleinste Kuhdorf Deutschlands :)

PostPosted: Fri Dec 23, 2005 12:37 pm    Post subject: Reply with quote

It breaks on some c-compilation and not on anything java here, it looked like problems with some kernel-headers (and/or stdlib) or sth like this. but i don't investigate the problem further:
Quote:
Making: ../unxlngi6.pro/obj/cppsetup.obj
gcc -Wreturn-type -fmessage-length=0 -c -I. -I. -I../inc -I../inc -I../unx/inc -I../unxlngi6.pro/inc -I. -I/var/tmp/portage/openoffice-2.0.1/work/ooo-build-2.0.1/build/ooa680-m1/solver/680/unxlngi6.pro/inc/dont_use_stl -I/var/tmp/portage/openoffice-2.0.1/work/ooo-build-2.0.1/build/ooa680-m1/solver/680/unxlngi6.pro/inc/external -I/var/tmp/portage/openoffice-2.0.1/work/ooo-build-2.0.1/build/ooa680-m1/solver/680/unxlngi6.pro/inc -I/var/tmp/portage/openoffice-2.0.1/work/ooo-build-2.0.1/build/ooa680-m1/solenv/unxlngi6/inc -I/var/tmp/portage/openoffice-2.0.1/work/ooo-build-2.0.1/build/ooa680-m1/solenv/inc -I/var/tmp/portage/openoffice-2.0.1/work/ooo-build-2.0.1/build/ooa680-m1/res -I/var/tmp/portage/openoffice-2.0.1/work/ooo-build-2.0.1/build/ooa680-m1/solver/680/unxlngi6.pro/inc/dont_use_stl -I/var/tmp/portage/openoffice-2.0.1/work/ooo-build-2.0.1/build/ooa680-m1/solenv/inc/Xp31 -I/usr/include -I/usr/include/linux -I/usr/include/native_threads/include -I/usr/X11R6/include -I. -I../res -I. -Os -fno-strict-aliasing -Wuninitialized -w -pipe -march=athlon-xp -O2 -pipe -fno-strict-aliasing -DLINUX -DUNX -DVCL -DGCC -DC341 -DINTEL -DGXX_INCLUDE_PATH=/usr/lib/gcc/i686-pc-linux-gnu/4.0.2/include/g++-v4 -DCVER=C341 -D_USE_NAMESPACE -DNPTL -DGLIBC=2 -DX86 -D_PTHREADS -D_REENTRANT -DNEW_SOLAR -D_USE_NAMESPACE=1 -DSTLPORT_VERSION=400 -DHAVE_GCC_VISIBILITY_FEATURE -D__DMAKE -DUNIX -DCPPU_ENV=gcc3 -DSUPD=680 -DPRODUCT -DNDEBUG -DPRODUCT_FULL -DOSL_DEBUG_LEVEL=0 -DOPTIMIZE -DEXCEPTIONS_OFF -DCUI -DSOLAR_JAVA -DOOA680 -DNO_X11 -DXP_PC -DHW_THREADS -DINCLUDEDIR=\".\" -DSINGLETHREAD -o ../unxlngi6.pro/obj/cppsetup.o cppsetup.c
In file included from /usr/include/_G_config.h:44,
from /usr/include/libio.h:32,
from /usr/include/stdio.h:72,
from def.h:39,
from cppsetup.c:29:
/usr/include/gconv.h:72: error: syntax error before 'size_t'
/usr/include/gconv.h:88: error: syntax error before 'size_t'
/usr/include/gconv.h:97: error: syntax error before 'size_t'
/usr/include/gconv.h:174: error: syntax error before 'size_t'
/usr/include/gconv.h:177: error: syntax error before '}' token
In file included from /usr/include/libio.h:32,
from /usr/include/stdio.h:72,
from def.h:39,
from cppsetup.c:29:
/usr/include/_G_config.h:47: error: field '__cd' has incomplete type
/usr/include/_G_config.h:50: error: field '__cd' has incomplete type
In file included from /usr/include/stdio.h:72,
from def.h:39,
from cppsetup.c:29:
/usr/include/libio.h:354: error: syntax error before 'size_t'
/usr/include/libio.h:363: error: syntax error before 'size_t'
/usr/include/libio.h:479: error: syntax error before '_IO_sgetn'
/usr/include/libio.h:479: error: syntax error before 'size_t'
In file included from def.h:39,
from cppsetup.c:29:
/usr/include/stdio.h:302: error: syntax error before 'size_t'
/usr/include/stdio.h:309: error: syntax error before 'size_t'
/usr/include/stdio.h:351: error: syntax error before 'size_t'
/usr/include/stdio.h:355: error: syntax error before 'size_t'
/usr/include/stdio.h:603: error: syntax error before 'fread'
/usr/include/stdio.h:603: error: syntax error before 'size_t'
/usr/include/stdio.h:609: error: syntax error before 'fwrite'
/usr/include/stdio.h:609: error: syntax error before 'size_t'
/usr/include/stdio.h:631: error: syntax error before 'fread_unlocked'
/usr/include/stdio.h:631: error: syntax error before 'size_t'
/usr/include/stdio.h:633: error: syntax error before 'fwrite_unlocked'
/usr/include/stdio.h:633: error: syntax error before 'size_t'
In file included from def.h:40,
from cppsetup.c:29:
/usr/include/stdlib.h:140: error: syntax error before '__ctype_get_mb_cur_max'
In file included from /usr/include/sys/types.h:133,
from /usr/include/stdlib.h:433,
from def.h:40,
from cppsetup.c:29:
/usr/include/linux/time.h:15: error: syntax error before 'time_t'
/usr/include/linux/time.h:17: error: syntax error before '}' token
/usr/include/linux/time.h:23: error: syntax error before 'time_t'
/usr/include/linux/time.h:154: error: field 'it_interval' has incomplete type
/usr/include/linux/time.h:155: error: field 'it_value' has incomplete type
/usr/include/linux/time.h:161: error: field 'it_interval' has incomplete type
/usr/include/linux/time.h:162: error: field 'it_value' has incomplete type
In file included from /usr/include/sys/select.h:46,
from /usr/include/sys/types.h:216,
from /usr/include/stdlib.h:433,
from def.h:40,
from cppsetup.c:29:
/usr/include/bits/time.h:70: error: nested redefinition of 'struct timeval'
In file included from def.h:40,
from cppsetup.c:29:
/usr/include/stdlib.h:450: error: syntax error before 'size_t'
/usr/include/stdlib.h:480: error: syntax error before 'size_t'
/usr/include/stdlib.h:584: error: syntax error before '__size'
/usr/include/stdlib.h:586: error: syntax error before '__nmemb'
/usr/include/stdlib.h:595: error: syntax error before 'size_t'
In file included from /usr/include/stdlib.h:606,
from def.h:40,
from cppsetup.c:29:
/usr/include/alloca.h:33: error: syntax error before '__size'
In file included from def.h:40,
from cppsetup.c:29:
/usr/include/stdlib.h:611: error: syntax error before '__size'
/usr/include/stdlib.h:768: error: syntax error before 'size_t'
/usr/include/stdlib.h:773: error: syntax error before 'size_t'
/usr/include/stdlib.h:846: error: syntax error before 'size_t'
/usr/include/stdlib.h:849: error: syntax error before 'size_t'
/usr/include/stdlib.h:853: error: syntax error before 'size_t'
/usr/include/stdlib.h:857: error: syntax error before 'size_t'
/usr/include/stdlib.h:866: error: syntax error before 'size_t'
/usr/include/stdlib.h:869: error: syntax error before '*' token
/usr/include/stdlib.h:873: error: syntax error before 'wchar_t'
/usr/include/stdlib.h:877: error: syntax error before 'mbstowcs'
/usr/include/stdlib.h:877: error: syntax error before '*' token
/usr/include/stdlib.h:880: error: syntax error before 'wcstombs'
/usr/include/stdlib.h:881: error: syntax error before '*' token
In file included from /usr/include/sys/stat.h:105,
from def.h:50,
from cppsetup.c:29:
/usr/include/bits/stat.h:70: error: field 'st_atim' has incomplete type
/usr/include/bits/stat.h:71: error: field 'st_mtim' has incomplete type
/usr/include/bits/stat.h:72: error: field 'st_ctim' has incomplete type
dmake: Error code 1, while making '../unxlngi6.pro/obj/cppsetup.obj'
'---* tg_merge.mk *---'

ERROR: Error 65280 occurred while making /var/tmp/portage/openoffice-2.0.1/work/ooo-build-2.0.1/build/ooa680-m1/soltools/mkdepend
make: *** [stamp/build] Error 1

_________________
"I knew when an angel whispered into my ear,
You gotta get him away, yeah
Hey little bitch!
Be glad you finally walked away or you may have not lived another day."
Godsmack
Back to top
View user's profile Send private message
Mausballklauer
n00b
n00b


Joined: 11 Dec 2005
Posts: 18
Location: Germany

PostPosted: Fri Dec 23, 2005 5:12 pm    Post subject: Reply with quote

DaNIsH wrote:
The compilation is bugging out for me


Same problem here. You're not alone :D

Has anyone resolved this problem so far?
Back to top
View user's profile Send private message
MaBu-Gentoo
n00b
n00b


Joined: 28 Sep 2005
Posts: 22
Location: Slovenia

PostPosted: Fri Dec 23, 2005 5:28 pm    Post subject: Reply with quote

Mausballklauer wrote:
DaNIsH wrote:
The compilation is bugging out for me


Same problem here. You're not alone :D

Has anyone resolved this problem so far?


Same problem here.
Back to top
View user's profile Send private message
Psycho Dad
Apprentice
Apprentice


Joined: 10 Dec 2005
Posts: 168
Location: BW

PostPosted: Fri Dec 23, 2005 6:10 pm    Post subject: Reply with quote

Had the same problem emerging 2.0.1 with this flags:

Code:
+curl +eds -gnome -gtk +java +kde +ldap +mozilla +xml2 +zlib


Looks like this:

http://lists.ximian.com/pipermail/openoffice/2005-December/001391.html

and

http://lists.ximian.com/pipermail/openoffice/2005-December/001392.html

If I understand correctly it should work when gtk-support is enabled, I will test this and will try to compile it overnight with
this flags:

Code:
+curl +eds -gnome +gtk +java +kde +ldap +mozilla +xml2 +zlib


Maybe it helps


Thomas
Back to top
View user's profile Send private message
Q-collective
Advocate
Advocate


Joined: 22 Mar 2004
Posts: 2056

PostPosted: Fri Dec 23, 2005 6:40 pm    Post subject: Reply with quote

I'll wait for 2.0.2 or possibly even 2.1
2.0.0 is working just fine for me, don't have an urge to recompile the thing again.
Back to top
View user's profile Send private message
Psycho Dad
Apprentice
Apprentice


Joined: 10 Dec 2005
Posts: 168
Location: BW

PostPosted: Sat Dec 24, 2005 10:23 am    Post subject: Reply with quote

As I suspected, with gtk-Support enabled Compilation runs without errors and Openoffice 2.0.1 runs fine.
Seems to be a bug in the ebuild though.

Thomas
Back to top
View user's profile Send private message
Gergan Penkov
Veteran
Veteran


Joined: 17 Jul 2004
Posts: 1464
Location: das kleinste Kuhdorf Deutschlands :)

PostPosted: Sat Dec 24, 2005 1:28 pm    Post subject: Reply with quote

My problem was because of axxo-overlay (gentoo-java-experimental), making slight changes to the ebuild got it go, it is now past the critical point:)
_________________
"I knew when an angel whispered into my ear,
You gotta get him away, yeah
Hey little bitch!
Be glad you finally walked away or you may have not lived another day."
Godsmack
Back to top
View user's profile Send private message
MaBu-Gentoo
n00b
n00b


Joined: 28 Sep 2005
Posts: 22
Location: Slovenia

PostPosted: Sat Dec 24, 2005 1:45 pm    Post subject: Reply with quote

Yes with gtk support enabled. Openoffice Compiled OK. But it looks more like MS Office, than OOo. :(
Back to top
View user's profile Send private message
Omega21
l33t
l33t


Joined: 14 Feb 2004
Posts: 788
Location: Canada (brrr. Its cold up here)

PostPosted: Sat Dec 24, 2005 8:01 pm    Post subject: Reply with quote

Im happy with 2.0 for now..
_________________
iMac G4 1GHz :: q6600 //2x 500GB//2GB RAM//8600GT//Gentoo :: MacBook Pro//2.53GHz
Back to top
View user's profile Send private message
Display posts from previous:   
Reply to topic    Gentoo Forums Forum Index Gentoo Chat All times are GMT
Goto page 1, 2  Next
Page 1 of 2

 
Jump to:  
You cannot post new topics in this forum
You cannot reply to topics in this forum
You cannot edit your posts in this forum
You cannot delete your posts in this forum
You cannot vote in polls in this forum