Gentoo Forums
Gentoo Forums
Gentoo Forums
Quick Search: in
emerge davfs2-0.2.4 fail @ compile...
View unanswered posts
View posts from last 24 hours

 
Reply to topic    Gentoo Forums Forum Index Portage & Programming
View previous topic :: View next topic  
Author Message
mathfeel
l33t
l33t


Joined: 03 Aug 2004
Posts: 700

PostPosted: Mon Jul 25, 2005 9:21 pm    Post subject: emerge davfs2-0.2.4 fail @ compile... Reply with quote

Here's the error:

Code:
Now run 'make' to compile DAVFS2

i686-pc-linux-gnu-gcc -DHAVE_CONFIG_H  -I/var/tmp/portage/davfs2-0.2.4/work/davfs2-0.2.4 -I./lib  -I./src  -I/usr/src/linux/include -O3 -march=pentium3 -fomit-frame-pointer -pipe -I/usr/include/neon -DNEON_ZLIB -DNEON_SSL -DSYSCONFDIR=\"/etc/davfs2\" -DSTATEDIR=\"/var/run/mount.davfs\" -c src/davfsd.c -o src/davfsd.o
src/davfsd.c: In function `dav_has_permission':
src/davfsd.c:63: error: structure has no member named `uid'
src/davfsd.c:63: error: structure has no member named `uid'
make: *** [src/davfsd.o] Error 1

!!! ERROR: net-fs/davfs2-0.2.4 failed.
!!! Function src_compile, Line 46, Exitcode 2
!!! emake failed
!!! If you need support, post the topmost build error, NOT this status message.


davfs2-0.2.3-r1 compiles just fine...
Back to top
View user's profile Send private message
Villosoph
n00b
n00b


Joined: 25 Feb 2004
Posts: 6
Location: Luzern, Switerland

PostPosted: Tue Aug 02, 2005 7:05 pm    Post subject: Same here Reply with quote

I have the same Problem here.

Tried to re-emerge neon and then emerge davfs2, no luck
Code:

Now run 'make' to compile DAVFS2

i686-pc-linux-gnu-gcc -DHAVE_CONFIG_H  -I/var/tmp/portage/davfs2-0.2.4/work/davfs2-0.2.4 -I./lib  -I./src  -I/usr/src/linux/include -O2 -march=athlon-xp -pipe -I/usr/include/neon -DNEON_ZLIB -DNEON_SSL -DSYSCONFDIR=\"/etc/davfs2\" -DSTATEDIR=\"/var/run/mount.davfs\" -c src/davfsd.c -o src/davfsd.o
src/davfsd.c: In function `dav_has_permission':
src/davfsd.c:63: error: structure has no member named `uid'
src/davfsd.c:63: error: structure has no member named `uid'
make: *** [src/davfsd.o] Error 1

!!! ERROR: net-fs/davfs2-0.2.4 failed.
!!! Function src_compile, Line 46, Exitcode 2
!!! emake failed
!!! If you need support, post the topmost build error, NOT this status message.


Also tried:
Code:
USE="-ssl" emerge davfs2
[/code]
failed with the same error
_________________
Ahtlox XP 2400, 1GB RAM, Shuttle AK39N Mainboard, 80GB Harddisk, HIS Excalibur Radeon 9200
IBM T41 2373-4GG
IBM X41 Tablet 1869-5CG
Back to top
View user's profile Send private message
Display posts from previous:   
Reply to topic    Gentoo Forums Forum Index Portage & Programming All times are GMT
Page 1 of 1

 
Jump to:  
You cannot post new topics in this forum
You cannot reply to topics in this forum
You cannot edit your posts in this forum
You cannot delete your posts in this forum
You cannot vote in polls in this forum