Gentoo Forums
Gentoo Forums
Gentoo Forums
Quick Search: in
nvidia FX 5200 + ck-sources-2.6.11
View unanswered posts
View posts from last 24 hours
View posts from last 7 days

 
Reply to topic    Gentoo Forums Forum Index Portuguese
View previous topic :: View next topic  
Author Message
mascanho
Veteran
Veteran


Joined: 21 Dec 2004
Posts: 1241
Location: On my Bmx Bike on a Concrete Park Flatlanding ...

PostPosted: Fri Mar 04, 2005 12:15 am    Post subject: nvidia FX 5200 + ck-sources-2.6.11 Reply with quote

ok estou a entar meter a aceleraçao 3d nisto mas n estou a csguir ao emergir nvidia-kernel para posteriormente emergir o nvidia-glx oobtenho isto
Code:

> emerge  nvidia-kernel
Calculating dependencies ...done!
>>> emerge (1 of 1) media-video/nvidia-kernel-1.0.6629-r1 to /
>>> md5 src_uri ;-) NVIDIA-Linux-x86-1.0-6629-pkg1.run
 * Determining the location of the kernel source code
 * Found kernel source directory:
 *     /usr/src/linux
 * Found sources for kernel version:
 *     2.6.11-ck1
 * Checking for MTRR support...                                                            [ ok ]
>>> Unpacking source...
Creating directory NVIDIA-Linux-x86-1.0-6629-pkg1
Verifying archive integrity... OK
Uncompressing NVIDIA Accelerated Graphics Driver for Linux-x86 1.0-6629.........................................................................................................................................................................................................
 * Applying nv-shutup-warnings.patch ...                                                   [ ok ]
 * Applying NVIDIA_kernel-1.0-6629-1155389.patch ...                                       [ ok ]
 * Applying NVIDIA_kernel-1.0-6629-1162524.patch ...                                       [ ok ]
 * Applying NVIDIA_kernel-1.0-6629-1165235.patch ...                                       [ ok ]
 * Applying NVIDIA_kernel-1.0-6629-1171869.patch ...                                       [ ok ]
 * Applying NVIDIA_kernel-1.0-6629-1175225.patch ...                                       [ ok ]
 * Applying NVIDIA_kernel-1.0-6629-1182399.patch ...                                       [ ok ]
 * Applying 2.6 kernel patches
 * Applying conftest_koutput_includes.patch ...                                            [ ok ]
 * Applying nv-disable-preempt-on-smp_processor_id.patch ...                               [ ok ]
 * Applying NVIDIA_kernel-1.0-6629-1161283.patch ...                                       [ ok ]
 * Converting NVIDIA-Linux-x86-1.0-6629-pkg1/usr/src/nv/Makefile.kbuild to use M= instead of SUBDIRS=...                                                                                    [ ok ]
>>> Source unpacked.
 * Preparing nvidia module

NVIDIA: calling KBUILD...
make CC=cc  KBUILD_VERBOSE=1 -C /usr/src/linux M=/var/tmp/portage/nvidia-kernel-1.0.6629-r1/work/NVIDIA-Linux-x86-1.0-6629-pkg1/usr/src/nv modules
make[2]: warning: jobserver unavailable: using -j1.  Add `+' to parent make rule.
mkdir -p /var/tmp/portage/nvidia-kernel-1.0.6629-r1/work/NVIDIA-Linux-x86-1.0-6629-pkg1/usr/src/nv/.tmp_versions
make -f scripts/Makefile.build obj=/var/tmp/portage/nvidia-kernel-1.0.6629-r1/work/NVIDIA-Linux-x86-1.0-6629-pkg1/usr/src/nv
echo \#define NV_COMPILER \"`cc -v 2>&1 | tail -n 1`\" > /var/tmp/portage/nvidia-kernel-1.0.6629-r1/work/NVIDIA-Linux-x86-1.0-6629-pkg1/usr/src/nv/nv_compiler.h
  cc -Wp,-MD,/var/tmp/portage/nvidia-kernel-1.0.6629-r1/work/NVIDIA-Linux-x86-1.0-6629-pkg1/usr/src/nv/.nv.o.d -nostdinc -isystem /usr/lib/gcc-lib/i686-pc-linux-gnu/3.3.5/include -D__KERNEL__ -Iinclude  -Wall -Wstrict-prototypes -Wno-trigraphs -fno-strict-aliasing -fno-common -ffreestanding -O2     -fomit-frame-pointer -pipe -msoft-float -mpreferred-stack-boundary=2  -march=athlon -Iin
clude/asm-i386/mach-default   -I/var/tmp/portage/nvidia-kernel-1.0.6629-r1/work/NVIDIA-Linux-x86-1.0-6629-pkg1/usr/src/nv -Wall -Wimplicit -Wreturn-type -Wswitch -Wformat -Wchar-subscripts -Wparentheses -Wno-multichar  -Werror -O -fno-common -MD   -Wno-cast-qual -Wno-error -D_LOOSE_KERNEL_NAMES -D__KERNEL__ -DMODULE  -DNTRM -D_GNU_SOURCE -D_LOOSE_KERNEL_NAMES -D__KERNEL__ -DMODULE  -DNV_MAJOR_VERSION=1 -DNV_MINOR_VERSION=0 -DNV_PATCHLEVEL=6629  -DNV_UNIX   -DNV_LINUX   -DNV_INT64_OK   -DNVCPU_X86      -UDEBUG -U_DEBUG -DNDEBUG -DNV_REMAP_PFN_RANGE_PRESENT -DNV_CHANGE_PAGE_ATTR_PRESENT -DNV_PCI_DISABLE_DEVICE_PRESENT -DNV_CLASS_SIMPLE_CREATE_PRESENT -DNV_PCI_GET_CLASS_PRESENT  -DMODULE -DKBUILD_BASENAME=nv -DKBUILD_MODNAME=nvidia -c -o /var/tmp/portage/nvidia-kernel-1.0.6629-r1/work/NVIDIA-Linux-x86-1.0-6629-pkg1/usr/src/nv/nv.o /var/tmp/portage/nvidia-kernel-1.0.6629-r1/work/NVIDIA-Linux-x86-1.0-6629-pkg1/usr/src/nv/nv.c
/var/tmp/portage/nvidia-kernel-1.0.6629-r1/work/NVIDIA-Linux-x86-1.0-6629-pkg1/usr/src/nv/nv.c: In function `_get_phys_address':
/var/tmp/portage/nvidia-kernel-1.0.6629-r1/work/NVIDIA-Linux-x86-1.0-6629-pkg1/usr/src/nv/nv.c:2529: warning: passing arg 1 of `pmd_offset' from incompatible pointer type
/var/tmp/portage/nvidia-kernel-1.0.6629-r1/work/NVIDIA-Linux-x86-1.0-6629-pkg1/usr/src/nv/nv.c: In function `nv_agp_init':
/var/tmp/portage/nvidia-kernel-1.0.6629-r1/work/NVIDIA-Linux-x86-1.0-6629-pkg1/usr/src/nv/nv.c:3010: warning: `inter_module_put' is deprecated (declared at include/linux/module.h:578)
  cc -Wp,-MD,/var/tmp/portage/nvidia-kernel-1.0.6629-r1/work/NVIDIA-Linux-x86-1.0-6629-pkg1/usr/src/nv/.nv-vm.o.d -nostdinc -isystem /usr/lib/gcc-lib/i686-pc-linux-gnu/3.3.5/include -D__KERNEL__ -Iinclude  -Wall -Wstrict-prototypes -Wno-trigraphs -fno-strict-aliasing -fno-common -ffreestanding -O2     -fomit-frame-pointer -pipe -msoft-float -mpreferred-stack-boundary=2  -march=athlon -Iinclude/asm-i386/mach-default   -I/var/tmp/portage/nvidia-kernel-1.0.6629-r1/work/NVIDIA-Linux-x86-1.0-6629-pkg1/usr/src/nv -Wall -Wimplicit -Wreturn-type -Wswitch -Wformat -Wchar-subscripts -Wparentheses -Wno-multichar  -Werror -O -fno-common -MD   -Wno-cast-qual -Wno-error -D_LOOSE_KERNEL_NAMES -D__KERNEL__ -DMODULE  -DNTRM -D_GNU_SOURCE -D_LOOSE_KERNEL_NAMES -D__KERNEL__ -DMODULE  -DNV_MAJOR_VERSION=1 -DNV_MINOR_VERSION=0 -DNV_PATCHLEVEL=6629  -DNV_UNIX   -DNV_LINUX   -DNV_INT64_OK   -DNVCPU_X86      -UDEBUG -U_DEBUG -DNDEBUG -DNV_REMAP_PFN_RANGE_PRESENT -DNV_CHANGE_PAGE_ATTR_PRESENT -DNV_PCI_DISABLE_DEVICE_PRESENT -DNV_CLASS_SIMPLE_CREATE_PRESENT -DNV_PCI_GET_CLASS_PRESENT  -DMODULE -DKBUILD_BASENAME=nv_vm -DKBUILD_MODNAME=nvidia -c -o /var/tmp/portage/nvidia-kernel-1.0.6629-r1/work/NVIDIA-Linux-x86-1.0-6629-pkg1/usr/src/nv/nv-vm.o /var/tmp/portage/nvidia-kernel-1.0.6629-r1/work/NVIDIA-Linux-x86-1.0-6629-pkg1/usr/src/nv/nv-vm.c
  cc -Wp,-MD,/var/tmp/portage/nvidia-kernel-1.0.6629-r1/work/NVIDIA-Linux-x86-1.0-6629-pkg1/usr/src/nv/.os-agp.o.d -nostdinc -isystem /usr/lib/gcc-lib/i686-pc-linux-gnu/3.3.5/include -D__KERNEL__ -Iinclude  -Wall -Wstrict-prototypes -Wno-trigraphs -fno-strict-aliasing -fno-common -ffreestanding -O2     -fomit-frame-pointer -pipe -msoft-float -mpreferred-stack-boundary=2  -march=athlon -Iinclude/asm-i386/mach-default   -I/var/tmp/portage/nvidia-kernel-1.0.6629-r1/work/NVIDIA-Linux-x86-1.0-6629-pkg1/usr/src/nv -Wall -Wimplicit -Wreturn-type -Wswitch -Wformat -Wchar-subscripts -Wparentheses -Wno-multichar  -Werror -O -fno-common -MD   -Wno-cast-qual -Wno-error -D_LOOSE_KERNEL_NAMES -D__KERNEL__ -DMODULE  -DNTRM -D_GNU_SOURCE -D_LOOSE_KERNEL_NAMES -D__KERNEL__ -DMODULE  -DNV_MAJOR_VERSION=1 -DNV_MINOR_VERSION=0 -DNV_PATCHLEVEL=6629  -DNV_UNIX   -DNV_LINUX   -DNV_INT64_OK   -DNVCPU_X86      -UDEBUG -U_DEBUG -DNDEBUG -DNV_REMAP_PFN_RANGE_PRESENT -DNV_CHANGE_PAGE_ATTR_PRESENT -DNV_PCI_DISABLE_DEVICE_PRESENT -DNV_CLASS_SIMPLE_CREATE_PRESENT -DNV_PCI_GET_CLASS_PRESENT  -DMODULE -DKBUILD_BASENAME=os_agp -DKBUILD_MODNAME=nvidia -c -o /var/tmp/portage/nvidia-kernel-1.0.6629-r1/work/NVIDIA-Linux-x86-1.0-6629-pkg1/usr/src/nv/os-agp.o /var/tmp/pia-kernel-1.0.6629-r1/work/NVIDIA-Linux-x86-1.0-6629-pkg1/usr/src/nv/os-agp.c
/var/tmp/portage/nvidia-kernel-1.0.6629-r1/work/NVIDIA-Linux-x86-1.0-6629-pkg1/usr/src/nv/os-agp.c:48: error: parse error before '*' token
/var/tmp/portage/nvidia-kernel-1.0.6629-r1/work/NVIDIA-Linux-x86-1.0-6629-pkg1/usr/src/nv/os-agp.c:48: warning: type defaults to `int' in declaration of `drm_agp_p'
/var/tmp/portage/nvidia-kernel-1.0.6629-r1/work/NVIDIA-Linux-x86-1.0-6629-pkg1/usr/src/nv/os-agp.c:48: warning: data definition has no type or storage class
/var/tmp/portage/nvidia-kernel-1.0.6629-r1/work/NVIDIA-Linux-x86-1.0-6629-pkg1/usr/src/nv/os-agp.c: In function `KernInitAGP':
/var/tmp/portage/nvidia-kernel-1.0.6629-r1/work/NVIDIA-Linux-x86-1.0-6629-pkg1/usr/src/nv/os-agp.c:76: warning: assignment discards qualifiers from pointer target type
/var/tmp/portage/nvidia-kernel-1.0.6629-r1/work/NVIDIA-Linux-x86-1.0-6629-pkg1/usr/src/nv/os-agp.c:85: error: request for member `acquire' in something not a structure or union
/var/tmp/portage/nvidia-kernel-1.0.6629-r1/work/NVIDIA-Linux-x86-1.0-6629-pkg1/usr/src/nv/os-agp.c:88: warning: `inter_module_put' is deprecated (declared at include/linux/module.h:578)
/var/tmp/portage/nvidia-kernel-1.0.6629-r1/work/NVIDIA-Linux-x86-1.0-6629-pkg1/usr/src/nv/os-agp.c:113: error: request for member `copy_info' in something not a structure or union
/var/tmp/portage/nvidia-kernel-1.0.6629-r1/work/NVIDIA-Linux-x86-1.0-6629-pkg1/usr/src/nv/os-agp.c:173: error: request for member `enable' in something not a structure or union
/var/tmp/portage/nvidia-kernel-1.0.6629-r1/work/NVIDIA-Linux-x86-1.0-6629-pkg1/usr/src/nv/os-agp.c:185: error: request for member `release' in something not a structure or union
/var/tmp/portage/nvidia-kernel-1.0.6629-r1/work/NVIDIA-Linux-x86-1.0-6629-pkg1/usr/src/nv/os-agp.c:186: warning: `inter_module_put' is deprecated (declared at include/linux/module.h:578)
/var/tmp/portage/nvidia-kernel-1.0.6629-r1/work/NVIDIA-Linux-x86-1.0-6629-pkg1/usr/src/nv/os-agp.c: In function `KernTeardownAGP':
/var/tmp/portage/nvidia-kernel-1.0.6629-r1/work/NVIDIA-Linux-x86-1.0-6629-pkg1/usr/src/nv/os-agp.c:216: error: request for member `release' in something not a structure or union
/var/tmp/portage/nvidia-kernel-1.0.6629-r1/work/NVIDIA-Linux-x86-1.0-6629-pkg1/usr/src/nv/os-agp.c:218: warning: `inter_module_put' is deprecated (declared at include/linux/module.h:578)
/var/tmp/portage/nvidia-kernel-1.0.6629-r1/work/NVIDIA-Linux-x86-1.0-6629-pkg1/usr/src/nv/os-agp.c: In function `KernAllocAGPPages':
/var/tmp/portage/nvidia-kernel-1.0.6629-r1/work/NVIDIA-Linux-x86-1.0-6629-pkg1/usr/src/nv/os-agp.c:265: error: request for member `allocate_memory' in something not a structure or union
/var/tmp/portage/nvidia-kernel-1.0.6629-r1/work/NVIDIA-Linux-x86-1.0-6629-pkg1/usr/src/nv/os-agp.c:273: error: request for member `bind_memory' in something not a structure or union
/var/tmp/portage/nvidia-kernel-1.0.6629-r1/work/NVIDIA-Linux-x86-1.0-6629-pkg1/usr/src/nv/os-agp.c:290: error: request for member `unbind_memory' in something not a structure or union
/var/tmp/portage/nvidia-kernel-1.0.6629-r1/work/NVIDIA-Linux-x86-1.0-6629-pkg1/usr/src/nv/os-agp.c:305: error: request for member `free_memory' in something not a structure or union
/var/tmp/portage/nvidia-kernel-1.0.6629-r1/work/NVIDIA-Linux-x86-1.0-6629-pkg1/usr/src/nv/os-agp.c: In function `KernMapAGPPages':
/var/tmp/portage/nvidia-kernel-1.0.6629-r1/work/NVIDIA-Linux-x86-1.0-6629-pkg1/usr/src/nv/os-agp.c:345: error: request for member `unbind_memory' in something not a structure or union
/var/tmp/portage/nvidia-kernel-1.0.6629-r1/work/NVIDIA-Linux-x86-1.0-6629-pkg1/usr/src/nv/os-agp.c: In function `KernFreeAGPPages':
ortage/nvid
ia-kernel-1.0.6629-r1/work/NVIDIA-Linux-x86-1.0-6629-pkg1/usr/src/nv/os-agp.c
/var/tmp/portage/nvidia-kernel-1.0.6629-r1/work/NVIDIA-Linux-x86-1.0-6629-pkg1/usr/src/nv/os-agp.c:48: error: parse error before '*' token
/var/tmp/portage/nvidia-kernel-1.0.6629-r1/work/NVIDIA-Linux-x86-1.0-6629-pkg1/usr/src/nv/os-agp.c:48: warning: type defaults to `int' in declaration of `drm_agp_p'
/var/tmp/portage/nvidia-kernel-1.0.6629-r1/work/NVIDIA-Linux-x86-1.0-6629-pkg1/usr/src/nv/os-agp.c:48: warning: data definition has no type or storage class
/var/tmp/portage/nvidia-kernel-1.0.6629-r1/work/NVIDIA-Linux-x86-1.0-6629-pkg1/usr/src/nv/os-agp.c: In function `KernInitAGP':
/var/tmp/portage/nvidia-kernel-1.0.6629-r1/work/NVIDIA-Linux-x86-1.0-6629-pkg1/usr/src/nv/os-agp.c:76: warning: assignment discards qualifiers from pointer target type
/var/tmp/portage/nvidia-kernel-1.0.6629-r1/work/NVIDIA-Linux-x86-1.0-6629-pkg1/usr/src/nv/os-agp.c:85: error: request for member `acquire' in something not a structure or union
/var/tmp/portage/nvidia-kernel-1.0.6629-r1/work/NVIDIA-Linux-x86-1.0-6629-pkg1/usr/src/nv/os-agp.c:88: warning: `inter_module_put' is deprecated (declared at include/linux/module.h:578)
/var/tmp/portage/nvidia-kernel-1.0.6629-r1/work/NVIDIA-Linux-x86-1.0-6629-pkg1/usr/src/nv/os-agp.c:113: error: request for member `copy_info' in something not a structure or union
/var/tmp/portage/nvidia-kernel-1.0.6629-r1/work/NVIDIA-Linux-x86-1.0-6629-pkg1/usr/src/nv/os-agp.c:173: error: request for member `enable' in something not a structure or union
/var/tmp/portage/nvidia-kernel-1.0.6629-r1/work/NVIDIA-Linux-x86-1.0-6629-pkg1/usr/src/nv/os-agp.c:185: error: request for member `release' in something not a structure or union
/var/tmp/portage/nvidia-kernel-1.0.6629-r1/work/NVIDIA-Linux-x86-1.0-6629-pkg1/usr/src/nv/os-agp.c:186: warning: `inter_module_put' is deprecated (declared at include/linux/module.h:578)
/var/tmp/portage/nvidia-kernel-1.0.6629-r1/work/NVIDIA-Linux-x86-1.0-6629-pkg1/usr/src/nv/os-agp.c: In function `KernTeardownAGP':
/var/tmp/portage/nvidia-kernel-1.0.6629-r1/work/NVIDIA-Linux-x86-1.0-6629-pkg1/usr/src/nv/os-agp.c:216: error: request for member `release' in something not a structure or union
/var/tmp/portage/nvidia-kernel-1.0.6629-r1/work/NVIDIA-Linux-x86-1.0-6629-pkg1/usr/src/nv/os-agp.c:218: warning: `inter_module_put' is deprecated (declared at include/linux/module.h:578)
/var/tmp/portage/nvidia-kernel-1.0.6629-r1/work/NVIDIA-Linux-x86-1.0-6629-pkg1/usr/src/nv/os-agp.c: In function `KernAllocAGPPages':
/var/tmp/portage/nvidia-kernel-1.0.6629-r1/work/NVIDIA-Linux-x86-1.0-6629-pkg1/usr/src/nv/os-agp.c:265: error: request for member `allocate_memory' in something not a structure or union
/var/tmp/portage/nvidia-kernel-1.0.6629-r1/work/NVIDIA-Linux-x86-1.0-6629-pkg1/usr/src/nv/os-agp.c:273: error: request for member `bind_memory' in something not a structure or union
/var/tmp/portage/nvidia-kernel-1.0.6629-r1/work/NVIDIA-Linux-x86-1.0-6629-pkg1/usr/src/nv/os-agp.c:290: error: request for member `unbind_memory' in something not a structure or union
/var/tmp/portage/nvidia-kernel-1.0.6629-r1/work/NVIDIA-Linux-x86-1.0-6629-pkg1/usr/src/nv/os-agp.c:305: error: request for member `free_memory' in something not a structure or union
/var/tmp/portage/nvidia-kernel-1.0.6629-r1/work/NVIDIA-Linux-x86-1.0-6629-pkg1/usr/src/nv/os-agp.c: In function `KernMapAGPPages':
/var/tmp/portage/nvidia-kernel-1.0.6629-r1/work/NVIDIA-Linux-x86-1.0-6629-pkg1/usr/src/nv/os-agp.c:345: error: request for member `unbind_memory' in something not a structure or union
/var/tmp/portage/nvidia-kernel-1.0.6629-r1/work/NVIDIA-Linux-x86-1.0-6629-pkg1/usr/src/nv/os-agp.c: In function `KernFreeAGPPages':
/var/tmp/portage/nvidia-kernel-1.0.6629-r1/work/NVIDIA-Linux-x86-1.0-6629-pkg1/usr/src/nv/os-agp.c:444: error: request for member `unbind_memory' in something not a structure or union
/var/tmp/portage/nvidia-kernel-1.0.6629-r1/work/NVIDIA-Linux-x86-1.0-6629-pkg1/usr/src/nv/os-agp.c:445: error: request for member `free_memory' in something not a structure or union
make[3]: *** [/var/tmp/portage/nvidia-kernel-1.0.6629-r1/work/NVIDIA-Linux-x86-1.0-6629-pkg1/usr/src/nv/os-agp.o] Error 1
make[2]: *** [_module_/var/tmp/portage/nvidia-kernel-1.0.6629-r1/work/NVIDIA-Linux-x86-1.0-6629-pkg1/usr/src/nv] Error 2
NVIDIA: left KBUILD.
nvidia.ko failed to build!
make[1]: *** [module] Error 1
make: *** [module] Error 2

!!! ERROR: media-video/nvidia-kernel-1.0.6629-r1 failed.
!!! Function linux-mod_src_compile, Line 417, Exitcode 2
!!! Unable to make                                  IGNORE_CC_MISMATCH=yes V=1 SYSSRC=/usr/src/linux SYSOUT=/usr/src/linux clean module.
!!! If you need support, post the topmost build error, NOT this status message.

>


Alguem sabe ao ke se deve ???
_________________
Flatland Life is a Choice !
emerge avatar
Back to top
View user's profile Send private message
Kobal
Guru
Guru


Joined: 12 Feb 2004
Posts: 323
Location: Brasil / Brazil / Brésil / Brasilien / el Brasil

PostPosted: Sun Mar 06, 2005 8:14 pm    Post subject: Reply with quote

Aqui também aconteceu isso, to usando o ck7 2.6.10 ta rodando legal.
Back to top
View user's profile Send private message
RuiP
l33t
l33t


Joined: 15 Jan 2005
Posts: 643

PostPosted: Sun Mar 06, 2005 10:51 pm    Post subject: Reply with quote

No meu caso com qualquer outro kernel que não fosse o gentoo-dev-sources (isto é com o ck- e o -nitro) tive de usar o nvidia-kernel do ~x86 (1.0.6629-r3 há dias e agora o -r4).
Há alguns foruns em inglês sobre este problema, mas ninguém parece sugerir outra alternativa. De qualquer modo o ck-sources ou variantes não são própiamente o main/stable brunch... por isso até é mais coerente :wink:
De qualquer forma não estou a ter qualquer problema até agora, tudo corre ok.
_________________
ESTRAGON: We've lost our rights?
VLADIMIR: (distinctly) We got rid of them.
Back to top
View user's profile Send private message
mascanho
Veteran
Veteran


Joined: 21 Dec 2004
Posts: 1241
Location: On my Bmx Bike on a Concrete Park Flatlanding ...

PostPosted: Mon Mar 07, 2005 8:32 pm    Post subject: Resolved Reply with quote

ok epah deixei o kernel igual pois constatei ke n seria de la o prob esta mesmo nos patches que sao aplicados quando se faz emerge nvidia-kernel nvidia-glx , portanto se fizerem emerge aos drivers mais recentes no portage (nvidia-kernel....-r4) tudo correra na boa

aqui ficou resolvido

tanks pessoal :D
_________________
Flatland Life is a Choice !
emerge avatar
Back to top
View user's profile Send private message
Display posts from previous:   
Reply to topic    Gentoo Forums Forum Index Portuguese All times are GMT
Page 1 of 1

 
Jump to:  
You cannot post new topics in this forum
You cannot reply to topics in this forum
You cannot edit your posts in this forum
You cannot delete your posts in this forum
You cannot vote in polls in this forum