Gentoo Forums
Gentoo Forums
Gentoo Forums
Quick Search: in
Wine amd64 ebuild
View unanswered posts
View posts from last 24 hours

Goto page Previous  1, 2, 3, 4, 5, 6 ... 9, 10, 11  Next  
Reply to topic    Gentoo Forums Forum Index Gentoo on AMD64
View previous topic :: View next topic  
Author Message
geniux
Veteran
Veteran


Joined: 19 Feb 2004
Posts: 1400
Location: /home

PostPosted: Fri Apr 15, 2005 1:50 am    Post subject: Reply with quote

Thanks herbie :D
wine emerged nicely without errors, finally
_________________
AMD Athlon64 X2 4200+ AM2
MSI K9N SLI Platinum, Enermax Liberty 500W
1GB RAM Crucial DDR2 667MHz, MSI nVidia 7600GS 256MB
400GB + 250GB Samsung SATAII HDD
Gentoo - BeyondSources 2.6.19-20
Back to top
View user's profile Send private message
BlauwVoet
n00b
n00b


Joined: 11 Feb 2004
Posts: 30

PostPosted: Sun Apr 17, 2005 7:39 pm    Post subject: Reply with quote

I can't apply that patch on 20050310-r1, and so I can't emerge wine (again those libXext and libX11 things).

now trying with
Code:
EXTRA_ECONF="--x-libraries=/emul/linux/x86/usr/lib" emerge wine

seems to go well
fingers crossed

[edit]
it failed again. This time it stopped with an error on arts. This error was described somewhere I believe. arts is in my system wide USE flags. I disabled it for wine in packages.use, and retried compiling wine... success!
[/edit]


Last edited by BlauwVoet on Sun Apr 17, 2005 9:18 pm; edited 1 time in total
Back to top
View user's profile Send private message
imon fyre
n00b
n00b


Joined: 18 Dec 2003
Posts: 20
Location: sudbury on

PostPosted: Sun Apr 17, 2005 8:44 pm    Post subject: Reply with quote

had wine working, but after trying to update to the -r1 patch, i get the compile crashing out right here

Code:
bin/ld: cannot find -lXext
collect2: ld returned 1 exit status
winegcc: gcc failed.
make[2]: *** [glut32.dll.so] Error 2
make[2]: Leaving directory `/var/tmp/portage/wine-20050310-r1/work/wine-20050310/dlls/glut32'
make[1]: *** [glut32] Error 2
make[1]: Leaving directory `/var/tmp/portage/wine-20050310-r1/work/wine-20050310/dlls'
make: *** [dlls] Error 2
make: *** Waiting for unfinished jobs....


same problem as before?????
_________________
for truth, love and gentoo
Back to top
View user's profile Send private message
drescherjm
Advocate
Advocate


Joined: 05 Jun 2004
Posts: 2780
Location: Pittsburgh, PA, USA

PostPosted: Tue Apr 19, 2005 7:21 pm    Post subject: Reply with quote

BlauwVoet Add the following line to your /etc/portage/package.use file:

Code:
app-emulation/wine -arts

_________________
John

My gentoo overlay
Instructons for overlay
Back to top
View user's profile Send private message
urcindalo
l33t
l33t


Joined: 08 Feb 2005
Posts: 601
Location: Almeria, Spain

PostPosted: Thu Apr 21, 2005 5:31 pm    Post subject: Reply with quote

I still got no luck with the previous 20050310-r1 version nor the new one 20050419.

I would get with 20050310-r1, and currently get with 20050419, the very same error, pertaining to "server":
Code:
gcc -m32 -c -I. -I. -I../include -I../include  -D__WINESRC__  -Wall -pipe -mpreferred-stack-boundary=2 -fno-strict-aliasing -gstabs+ -Wpointer-arith  -march=k8 -O2 -I//usr/include/lcms -o token.o token.c
gcc -m32 -c -I. -I. -I../include -I../include  -D__WINESRC__  -Wall -pipe -mpreferred-stack-boundary=2 -fno-strict-aliasing -gstabs+ -Wpointer-arith  -march=k8 -O2 -I//usr/include/lcms -o trace.o trace.c
gcc -m32 -c -I. -I. -I../include -I../include  -D__WINESRC__  -Wall -pipe -mpreferred-stack-boundary=2 -fno-strict-aliasing -gstabs+ -Wpointer-arith  -march=k8 -O2 -I//usr/include/lcms -o unicode.o unicode.c
gcc -m32 -c -I. -I. -I../include -I../include  -D__WINESRC__  -Wall -pipe -mpreferred-stack-boundary=2 -fno-strict-aliasing -gstabs+ -Wpointer-arith  -march=k8 -O2 -I//usr/include/lcms -o user.o user.c
gcc -m32 -c -I. -I. -I../include -I../include  -D__WINESRC__  -Wall -pipe -mpreferred-stack-boundary=2 -fno-strict-aliasing -gstabs+ -Wpointer-arith  -march=k8 -O2 -I//usr/include/lcms -o window.o window.c
gcc -m32 -o wineserver atom.o change.o class.o clipboard.o console.o context_alpha.o context_i386.o context_powerpc.o context_sparc.o debugger.o event.o fd.o file.o handle.o hook.o mailslot.o main.o mapping.o mutex.o named_pipe.o object.o process.o ptrace.o queue.o region.o registry.o request.o semaphore.o serial.o signal.o snapshot.o sock.o thread.o timer.o token.o trace.o unicode.o user.o window.o  -L../libs/wine -lwine -L../libs/unicode -lwine_unicode -L../libs/port -lwine_port
make[1]: Leaving directory `/var/tmp/portage/wine-20050419/work/wine-20050419/server'

!!! ERROR: app-emulation/wine-20050419 failed.
!!! Function src_compile, Line 106, Exitcode 2
!!! all
!!! If you need support, post the topmost build error, NOT this status message.


Anyone else is having this problem?

This is my info:
Code:
Portage 2.0.51.19 (default-linux/amd64/2005.0, gcc-3.4.3, glibc-2.3.4.20041102-r1, 2.6.11-gentoo-r6 x86_64)
=================================================================
System uname: 2.6.11-gentoo-r6 x86_64 AMD Athlon(tm) 64 Processor 3000+
Gentoo Base System version 1.4.16
Python:              dev-lang/python-2.3.4-r1 [2.3.4 (#1, Mar  9 2005, 15:45:12)]
dev-lang/python:     2.3.4-r1
sys-devel/autoconf:  2.59-r6, 2.13
sys-devel/automake:  1.7.9-r1, 1.8.5-r3, 1.5, 1.4_p6, 1.6.3, 1.9.4
sys-devel/binutils:  2.15.92.0.2-r7
sys-devel/libtool:   1.5.14
virtual/os-headers:  2.6.8.1-r4
ACCEPT_KEYWORDS="amd64"
AUTOCLEAN="yes"
CFLAGS="-march=k8 -O2"
CHOST="x86_64-pc-linux-gnu"
CONFIG_PROTECT="/etc /usr/kde/2/share/config /usr/kde/3/share/config /usr/share/config /var/qmail/control"
CONFIG_PROTECT_MASK="/etc/gconf /etc/env.d"
CXXFLAGS="-march=k8 -O2"
DISTDIR="/usr/portage/distfiles"
FEATURES="autoaddcvs autoconfig ccache distlocks sandbox strict"
GENTOO_MIRRORS="http://distfiles.gentoo.org http://distro.ibiblio.org/pub/Linux/distributions/gentoo"
MAKEOPTS="-j2"
PKGDIR="/usr/portage/packages"
PORTAGE_TMPDIR="/var/tmp"
PORTDIR="/usr/portage"
SYNC="rsync://rsync.gentoo.org/gentoo-portage"
USE="amd64 X Xaw3d a52 aac aalib accessibility acl acpi aim alsa apache2 apm arts audiofile avi bash-completion bcmath berkdb bidi bitmap-fonts bzlib cdparanoia cdr crypt ctype cups curl curlwrappers db2 dba dbase dbm dbx dga dio directfb dv dvb dvd dvdr dvdread encode esd ethereal evo exif fam fastcgi fbcon ffmpeg fftw flac flash flatfilefont-server foomaticdb fortran freetds ftp gd gdbm geoip gif ginac glut gmp gnustep gnutls gphoto2 gpm gstreamer gtk gtk2 gtkhtml guile hyperwave-api iconv icq imagemagick imap imlib inifile innodb interbase iodbc ipv6 jabber jack java javascript jikes jp2 jpeg kde kerberos krb4 ladcca lcms ldap lesstif libcaca libwww lzw lzw-tiff mad maildir mailwrapper matroska mbox mcal mcve memlimit mhash mikmod milter mime mmap mng motif mozilla mp3 mpeg mpi msession msn msql mysql mysqli nas ncurses neXt netcdf nis nls nptl oci8 ogg oggvorbis openal opengl oracle oracle7 oscar oss ovrimos pam pcntl pcre pdflib perl php pie plotutils png portaudio posix postgres ppds prelude python qdbmqt quicktime readline recode ruby samba sapdb sasl scanner sdl sharedext simplexml skey slang sndfile snmp soap sockets socks5 source sox speex spell spl ssl svg sysfs sysvipc szip tcltk tcpd tetex theora tidy tiff tokenizer truetype truetype-fonts type1-fonts unicode usb userlocales v4l vcd vhosts vorbis wddx wmf wxwindows xface xine xml xml2 xmlrpc xmms xpm xprint xrandr xsl xv xvid yahoo yaz zeo zlib"
Unset:  ASFLAGS, CBUILD, CTARGET, LANG, LC_ALL, LDFLAGS, LINGUAS, PORTDIR_OVERLAY
Back to top
View user's profile Send private message
Lucky B
Apprentice
Apprentice


Joined: 01 Apr 2005
Posts: 235
Location: Florida

PostPosted: Thu Apr 21, 2005 5:53 pm    Post subject: Reply with quote

try

Code:

MAKEOPTS="-j1" emerge wine


and posting the actual error =)
_________________
We are Dyslexic of Borg. Fusistance is retile. Your ass will be laminated.
Back to top
View user's profile Send private message
urcindalo
l33t
l33t


Joined: 08 Feb 2005
Posts: 601
Location: Almeria, Spain

PostPosted: Thu Apr 21, 2005 6:46 pm    Post subject: Reply with quote

OK. I tried that and got this:
Code:
make[2]: Leaving directory `/var/tmp/portage/wine-20050419/work/wine-20050419/dlls/uuid'
rm -f libuuid.a && ln -s uuid/libuuid.a libuuid.a
make[2]: Entering directory `/var/tmp/portage/wine-20050419/work/wine-20050419/dlls/glut32'
gcc -m32 -c -I. -I. -I../../include -I../../include  -D__WINESRC__ -DWINE_NO_DEBUG_MSGS -DWINE_NO_TRACE_MSGS  -D_REENTRANT -fPIC -Wall -pipe -mpreferred-stack-boundary=2 -fno-strict-aliasing -gstabs+ -Wpointer-arith  -march=k8 -O2 -I//usr/include/lcms -o glut.o glut.c
../../tools/winebuild/winebuild -D__WINESRC__ -DWINE_NO_DEBUG_MSGS -DWINE_NO_TRACE_MSGS  -o glut32.dll.dbg.c --debug -C. glut.c
gcc -m32 -c -I. -I. -I../../include -I../../include  -D__WINESRC__ -DWINE_NO_DEBUG_MSGS -DWINE_NO_TRACE_MSGS  -D_REENTRANT -fPIC -Wall -pipe -mpreferred-stack-boundary=2 -fno-strict-aliasing -gstabs+ -Wpointer-arith  -march=k8 -O2 -I//usr/include/lcms -o glut32.dll.dbg.o glut32.dll.dbg.c
../../tools/winegcc/winegcc -B../../tools/winebuild -shared ./glut32.spec    glut.o  glut32.dll.dbg.o   -o glut32.dll.so -L../../dlls  -lkernel32 -L../../libs/wine -lwine -L/usr/lib64  -lXext -lX11   -lglut -lXmu -lXi -L../../libs/port -lwine_port
/usr/lib/gcc/x86_64-pc-linux-gnu/3.4.3/../../../../x86_64-pc-linux-gnu/bin/ld: skipping incompatible /usr/lib64/libXext.so when searching for -lXext
/usr/lib/gcc/x86_64-pc-linux-gnu/3.4.3/../../../../x86_64-pc-linux-gnu/bin/ld: skipping incompatible /usr/lib64/libXext.a when searching for -lXext
/usr/lib/gcc/x86_64-pc-linux-gnu/3.4.3/../../../../x86_64-pc-linux-gnu/bin/ld: skipping incompatible /usr/lib/gcc/x86_64-pc-linux-gnu/3.4.3/../../../libXext.so when searching for -lXext
/usr/lib/gcc/x86_64-pc-linux-gnu/3.4.3/../../../../x86_64-pc-linux-gnu/bin/ld: skipping incompatible /usr/lib/gcc/x86_64-pc-linux-gnu/3.4.3/../../../libXext.a when searching for -lXext
/usr/lib/gcc/x86_64-pc-linux-gnu/3.4.3/../../../../x86_64-pc-linux-gnu/bin/ld: skipping incompatible /usr/lib/libXext.so when searching for -lXext
/usr/lib/gcc/x86_64-pc-linux-gnu/3.4.3/../../../../x86_64-pc-linux-gnu/bin/ld: skipping incompatible /usr/lib/libXext.a when searching for -lXext
/usr/lib/gcc/x86_64-pc-linux-gnu/3.4.3/../../../../x86_64-pc-linux-gnu/bin/ld: cannot find -lXext
collect2: ld devolvió el estado de salida 1
winegcc: gcc failed.
make[2]: *** [glut32.dll.so] Error 2
make[2]: Leaving directory `/var/tmp/portage/wine-20050419/work/wine-20050419/dlls/glut32'
make[1]: *** [glut32] Error 2
make[1]: Leaving directory `/var/tmp/portage/wine-20050419/work/wine-20050419/dlls'
make: *** [dlls] Error 2

!!! ERROR: app-emulation/wine-20050419 failed.
!!! Function src_compile, Line 106, Exitcode 2
!!! all
!!! If you need support, post the topmost build error, NOT this status message.
Back to top
View user's profile Send private message
Lucky B
Apprentice
Apprentice


Joined: 01 Apr 2005
Posts: 235
Location: Florida

PostPosted: Thu Apr 21, 2005 6:58 pm    Post subject: Reply with quote

now try
Code:

EXTRA_ECONF="--x-libraries=/emul/linux/x86/usr/lib" MAKEOPTS="-j1" emerge wine


(MAKEOPTS="-j1" forces make to do a single process/thread so that errors happen right when it exits. so you don't have to copy/paste a ton of useless stuff.)
_________________
We are Dyslexic of Borg. Fusistance is retile. Your ass will be laminated.
Back to top
View user's profile Send private message
urcindalo
l33t
l33t


Joined: 08 Feb 2005
Posts: 601
Location: Almeria, Spain

PostPosted: Fri Apr 22, 2005 6:52 am    Post subject: Reply with quote

This time the failure is:
Code:
make[2]: Leaving directory `/var/tmp/portage/wine-20050419/work/wine-20050419/dlls/uuid'
rm -f libuuid.a && ln -s uuid/libuuid.a libuuid.a
make[2]: Entering directory `/var/tmp/portage/wine-20050419/work/wine-20050419/dlls/glu32'
gcc -m32 -c -I. -I. -I../../include -I../../include  -D__WINESRC__ -DWINE_NO_DEBUG_MSGS -DWINE_NO_TRACE_MSGS  -D_REENTRANT -fPIC -Wall -pipe -mpreferred-stack-boundary=2 -fno-strict-aliasing -gstabs+ -Wpointer-arith  -march=k8 -O2 -I//usr/include/lcms -o glu.o glu.c
../../tools/winebuild/winebuild -D__WINESRC__ -DWINE_NO_DEBUG_MSGS -DWINE_NO_TRACE_MSGS  -o glu32.dll.dbg.c --debug -C. glu.c
gcc -m32 -c -I. -I. -I../../include -I../../include  -D__WINESRC__ -DWINE_NO_DEBUG_MSGS -DWINE_NO_TRACE_MSGS  -D_REENTRANT -fPIC -Wall -pipe -mpreferred-stack-boundary=2 -fno-strict-aliasing -gstabs+ -Wpointer-arith  -march=k8 -O2 -I//usr/include/lcms -o glu32.dll.dbg.o glu32.dll.dbg.c
../../tools/winegcc/winegcc -B../../tools/winebuild -shared ./glu32.spec    glu.o  glu32.dll.dbg.o   -o glu32.dll.so -L../../dlls  -lkernel32 -lntdll -L../../libs/wine -lwine -L/emul/linux/x86/usr/lib  -lXext -lX11  -lGL -lGLU -L../../libs/port -lwine_port
make[2]: Leaving directory `/var/tmp/portage/wine-20050419/work/wine-20050419/dlls/glu32'
rm -f glu32.dll.so && ln -s glu32/glu32.dll.so glu32.dll.so
make[2]: Entering directory `/var/tmp/portage/wine-20050419/work/wine-20050419/dlls/glut32'
gcc -m32 -c -I. -I. -I../../include -I../../include  -D__WINESRC__ -DWINE_NO_DEBUG_MSGS -DWINE_NO_TRACE_MSGS  -D_REENTRANT -fPIC -Wall -pipe -mpreferred-stack-boundary=2 -fno-strict-aliasing -gstabs+ -Wpointer-arith  -march=k8 -O2 -I//usr/include/lcms -o glut.o glut.c
../../tools/winebuild/winebuild -D__WINESRC__ -DWINE_NO_DEBUG_MSGS -DWINE_NO_TRACE_MSGS  -o glut32.dll.dbg.c --debug -C. glut.c
gcc -m32 -c -I. -I. -I../../include -I../../include  -D__WINESRC__ -DWINE_NO_DEBUG_MSGS -DWINE_NO_TRACE_MSGS  -D_REENTRANT -fPIC -Wall -pipe -mpreferred-stack-boundary=2 -fno-strict-aliasing -gstabs+ -Wpointer-arith  -march=k8 -O2 -I//usr/include/lcms -o glut32.dll.dbg.o glut32.dll.dbg.c
../../tools/winegcc/winegcc -B../../tools/winebuild -shared ./glut32.spec    glut.o  glut32.dll.dbg.o   -o glut32.dll.so -L../../dlls  -lkernel32 -L../../libs/wine -lwine -L/emul/linux/x86/usr/lib  -lXext -lX11  -lGL -lGLU -lglut -lXmu -lXi -L../../libs/port -lwine_port
/usr/lib/gcc/x86_64-pc-linux-gnu/3.4.3/../../../../x86_64-pc-linux-gnu/bin/ld: skipping incompatible /usr/lib/gcc/x86_64-pc-linux-gnu/3.4.3/../../../libglut.so when searching for -lglut
/usr/lib/gcc/x86_64-pc-linux-gnu/3.4.3/../../../../x86_64-pc-linux-gnu/bin/ld: skipping incompatible /usr/lib/libglut.so when searching for -lglut
/usr/lib/gcc/x86_64-pc-linux-gnu/3.4.3/../../../../x86_64-pc-linux-gnu/bin/ld: cannot find -lglut
collect2: ld devolvió el estado de salida 1
winegcc: gcc failed.
make[2]: *** [glut32.dll.so] Error 2
make[2]: Leaving directory `/var/tmp/portage/wine-20050419/work/wine-20050419/dlls/glut32'
make[1]: *** [glut32] Error 2
make[1]: Leaving directory `/var/tmp/portage/wine-20050419/work/wine-20050419/dlls'
make: *** [dlls] Error 2

!!! ERROR: app-emulation/wine-20050419 failed.
!!! Function src_compile, Line 106, Exitcode 2
!!! all
!!! If you need support, post the topmost build error, NOT this status message.
Back to top
View user's profile Send private message
jsharrad
n00b
n00b


Joined: 20 Apr 2005
Posts: 10

PostPosted: Fri Apr 22, 2005 7:53 am    Post subject: emerge wine fails Reply with quote

Hmm, I get this error when trying to emerge wine:
Code:
x86_64-pc-linux-gnu-gcc -c -I. -I. -I../../include -I../../include  -D__WINESRC__ -D_REENTRANT -fPIC -Wall -pipe -fno-strict-aliasing -gstabs+ -Wpointer-arith  -march=athlon64 -O2 -pipe -D__i386__ -o gettid.o gettid.c
x86_64-pc-linux-gnu-gcc -c -I. -I. -I../../include -I../../include  -D__WINESRC__ -D_REENTRANT -fPIC -Wall -pipe -fno-strict-aliasing -gstabs+ -Wpointer-arith  -march=athlon64 -O2 -pipe -D__i386__ -o interlocked.o interlocked.c
{standard input}: Assembler messages:
{standard input}:232: Error: `12(%esp)' is not a valid 64 bit base/index expression
{standard input}:233: Error: `8(%esp)' is not a valid 64 bit base/index expression
{standard input}:234: Error: `4(%esp)' is not a valid 64 bit base/index expression
{standard input}:235: Error: `(%edx)' is not a valid 64 bit base/index expression
{standard input}:243: Error: `12(%esp)' is not a valid 64 bit base/index expression
{standard input}:244: Error: `8(%esp)' is not a valid 64 bit base/index expression
{standard input}:245: Error: `4(%esp)' is not a valid 64 bit base/index expression
{standard input}:246: Error: `(%edx)' is not a valid 64 bit base/index expression
{standard input}:254: Error: `8(%esp)' is not a valid 64 bit base/index expression
{standard input}:255: Error: `4(%esp)' is not a valid 64 bit base/index expression
{standard input}:256: Error: `(%edx)' is not a valid 64 bit base/index expression
{standard input}:264: Error: `8(%esp)' is not a valid 64 bit base/index expression
{standard input}:265: Error: `4(%esp)' is not a valid 64 bit base/index expression
{standard input}:266: Error: `(%edx)' is not a valid 64 bit base/index expression
{standard input}:274: Error: `8(%esp)' is not a valid 64 bit base/index expression
{standard input}:275: Error: `4(%esp)' is not a valid 64 bit base/index expression
{standard input}:276: Error: `(%edx)' is not a valid 64 bit base/index expression
make[2]: *** [interlocked.o] Error 1
make[2]: Leaving directory `/var/tmp/portage/wine-20050310-r1/work/wine-20050310/libs/port'
make[1]: *** [port] Error 2
make[1]: Leaving directory `/var/tmp/portage/wine-20050310-r1/work/wine-20050310/libs'
make: *** [libs] Error 2

!!! ERROR: app-emulation/wine-20050310-r1 failed.
!!! Function src_compile, Line 107, Exitcode 2
!!! depend
!!! If you need support, post the topmost build error, NOT this status message.

what could I be doing wrong?
Back to top
View user's profile Send private message
urcindalo
l33t
l33t


Joined: 08 Feb 2005
Posts: 601
Location: Almeria, Spain

PostPosted: Tue Apr 26, 2005 1:32 pm    Post subject: Reply with quote

I cat't emerge wine-20050419, yet.

I removed any modification in package.use regarding wine, and it keeps failing the same way it did a few days ago:
Code:
make[2]: Entering directory `/var/tmp/portage/wine-20050419/work/wine-20050419/dlls/glu32'
x86_64-pc-linux-gnu-gcc -c -I. -I. -I../../include -I../../include  -D__WINESRC__ -DWINE_NO_DEBUG_MSGS -DWINE_NO_TRACE_MSGS  -D_REENTRANT -fPIC -Wall -pipe -mpreferred-stack-boundary=2 -fno-strict-aliasing -gstabs+ -Wpointer-arith  -march=k8 -O2 -I//usr/include/lcms -o glu.o glu.c
x86_64-pc-linux-gnu-gcc -c -I. -I. -I../include -I../include  -D__WINESRC__  -Wall -pipe -mpreferred-stack-boundary=2 -fno-strict-aliasing -gstabs+ -Wpointer-arith  -march=k8 -O2 -I//usr/include/lcms -o request.o request.c
../../tools/winebuild/winebuild -D__WINESRC__ -DWINE_NO_DEBUG_MSGS -DWINE_NO_TRACE_MSGS  -o glu32.dll.dbg.c --debug -C. glu.c
x86_64-pc-linux-gnu-gcc -c -I. -I. -I../../include -I../../include  -D__WINESRC__ -DWINE_NO_DEBUG_MSGS -DWINE_NO_TRACE_MSGS  -D_REENTRANT -fPIC -Wall -pipe -mpreferred-stack-boundary=2 -fno-strict-aliasing -gstabs+ -Wpointer-arith  -march=k8 -O2 -I//usr/include/lcms -o glu32.dll.dbg.o glu32.dll.dbg.c
../../tools/winegcc/winegcc -B../../tools/winebuild -shared ./glu32.spec    glu.o  glu32.dll.dbg.o   -o glu32.dll.so -L../../dlls  -lkernel32 -lntdll -L../../libs/wine -lwine -L/usr/lib64  -lXext -lX11  -lGL -lGLU -L../../libs/port -lwine_port
/usr/lib/gcc/x86_64-pc-linux-gnu/3.4.3/../../../../x86_64-pc-linux-gnu/bin/ld: skipping incompatible /usr/lib64/libGL.so when searching for -lGL
/usr/lib/gcc/x86_64-pc-linux-gnu/3.4.3/../../../../x86_64-pc-linux-gnu/bin/ld: skipping incompatible /usr/lib64/libm.so when searching for -lm
/usr/lib/gcc/x86_64-pc-linux-gnu/3.4.3/../../../../x86_64-pc-linux-gnu/bin/ld: skipping incompatible /usr/lib64/libm.a when searching for -lm
/usr/lib/gcc/x86_64-pc-linux-gnu/3.4.3/../../../../x86_64-pc-linux-gnu/bin/ld: skipping incompatible /usr/lib64/libc.so when searching for -lc
/usr/lib/gcc/x86_64-pc-linux-gnu/3.4.3/../../../../x86_64-pc-linux-gnu/bin/ld: skipping incompatible /usr/lib64/libc.a when searching for -lc
/usr/lib/gcc/x86_64-pc-linux-gnu/3.4.3/../../../../x86_64-pc-linux-gnu/bin/ld: skipping incompatible /usr/lib64/libc.so when searching for -lc
/usr/lib/gcc/x86_64-pc-linux-gnu/3.4.3/../../../../x86_64-pc-linux-gnu/bin/ld: skipping incompatible /usr/lib64/libc.a when searching for -lc
make[2]: Leaving directory `/var/tmp/portage/wine-20050419/work/wine-20050419/dlls/glu32'
make[2]: Entering directory `/var/tmp/portage/wine-20050419/work/wine-20050419/dlls/glut32'
x86_64-pc-linux-gnu-gcc -c -I. -I. -I../../include -I../../include  -D__WINESRC__ -DWINE_NO_DEBUG_MSGS -DWINE_NO_TRACE_MSGS  -D_REENTRANT -fPIC -Wall -pipe -mpreferred-stack-boundary=2 -fno-strict-aliasing -gstabs+ -Wpointer-arith  -march=k8 -O2 -I//usr/include/lcms -o glut.o glut.c
x86_64-pc-linux-gnu-gcc -c -I. -I. -I../include -I../include  -D__WINESRC__  -Wall -pipe -mpreferred-stack-boundary=2 -fno-strict-aliasing -gstabs+ -Wpointer-arith  -march=k8 -O2 -I//usr/include/lcms -o semaphore.o semaphore.c
../../tools/winebuild/winebuild -D__WINESRC__ -DWINE_NO_DEBUG_MSGS -DWINE_NO_TRACE_MSGS  -o glut32.dll.dbg.c --debug -C. glut.c
x86_64-pc-linux-gnu-gcc -c -I. -I. -I../../include -I../../include  -D__WINESRC__ -DWINE_NO_DEBUG_MSGS -DWINE_NO_TRACE_MSGS  -D_REENTRANT -fPIC -Wall -pipe -mpreferred-stack-boundary=2 -fno-strict-aliasing -gstabs+ -Wpointer-arith  -march=k8 -O2 -I//usr/include/lcms -o glut32.dll.dbg.o glut32.dll.dbg.c
../../tools/winegcc/winegcc -B../../tools/winebuild -shared ./glut32.spec    glut.o  glut32.dll.dbg.o   -o glut32.dll.so -L../../dlls  -lkernel32 -L../../libs/wine -lwine -L/usr/lib64  -lXext -lX11  -lGL -lGLU -lglut -lXmu -lXi-L../../libs/port -lwine_port
/usr/lib/gcc/x86_64-pc-linux-gnu/3.4.3/../../../../x86_64-pc-linux-gnu/bin/ld: skipping incompatible /usr/lib64/libGL.so when searching for -lGL
/usr/lib/gcc/x86_64-pc-linux-gnu/3.4.3/../../../../x86_64-pc-linux-gnu/bin/ld: skipping incompatible /usr/lib64/libglut.so when searching for -lglut
/usr/lib/gcc/x86_64-pc-linux-gnu/3.4.3/../../../../x86_64-pc-linux-gnu/bin/ld: skipping incompatible /usr/lib/gcc/x86_64-pc-linux-gnu/3.4.3/../../../libglut.so when searching for -lglut
/usr/lib/gcc/x86_64-pc-linux-gnu/3.4.3/../../../../x86_64-pc-linux-gnu/bin/ld: skipping incompatible /usr/lib/libglut.so when searching for -lglut
/usr/lib/gcc/x86_64-pc-linux-gnu/3.4.3/../../../../x86_64-pc-linux-gnu/bin/ld: cannot find -lglut
collect2: ld returned 1 exit status
winegcc: x86_64-pc-linux-gnu-gcc failed.
make[2]: *** [glut32.dll.so] Error 2
make[2]: Leaving directory `/var/tmp/portage/wine-20050419/work/wine-20050419/dlls/glut32'
make[1]: *** [glut32] Error 2
make[1]: Leaving directory `/var/tmp/portage/wine-20050419/work/wine-20050419/dlls'
make: *** [dlls] Error 2
x86_64-pc-linux-gnu-gcc -c -I. -I. -I../include -I../include  -D__WINESRC__  -Wall -pipe -mpreferred-stack-boundary=2 -fno-strict-aliasing -gstabs+ -Wpointer-arith  -march=k8 -O2 -I//usr/include/lcms -o serial.o serial.c
make: *** Waiting for unfinished jobs....
x86_64-pc-linux-gnu-gcc -c -I. -I. -I../include -I../include  -D__WINESRC__  -Wall -pipe -mpreferred-stack-boundary=2 -fno-strict-aliasing -gstabs+ -Wpointer-arith  -march=k8 -O2 -I//usr/include/lcms -o signal.o signal.c
x86_64-pc-linux-gnu-gcc -c -I. -I. -I../include -I../include  -D__WINESRC__  -Wall -pipe -mpreferred-stack-boundary=2 -fno-strict-aliasing -gstabs+ -Wpointer-arith  -march=k8 -O2 -I//usr/include/lcms -o snapshot.o snapshot.c
x86_64-pc-linux-gnu-gcc -c -I. -I. -I../include -I../include  -D__WINESRC__  -Wall -pipe -mpreferred-stack-boundary=2 -fno-strict-aliasing -gstabs+ -Wpointer-arith  -march=k8 -O2 -I//usr/include/lcms -o sock.o sock.c
x86_64-pc-linux-gnu-gcc -c -I. -I. -I../include -I../include  -D__WINESRC__  -Wall -pipe -mpreferred-stack-boundary=2 -fno-strict-aliasing -gstabs+ -Wpointer-arith  -march=k8 -O2 -I//usr/include/lcms -o thread.o thread.c
x86_64-pc-linux-gnu-gcc -c -I. -I. -I../include -I../include  -D__WINESRC__  -Wall -pipe -mpreferred-stack-boundary=2 -fno-strict-aliasing -gstabs+ -Wpointer-arith  -march=k8 -O2 -I//usr/include/lcms -o timer.o timer.c
x86_64-pc-linux-gnu-gcc -c -I. -I. -I../include -I../include  -D__WINESRC__  -Wall -pipe -mpreferred-stack-boundary=2 -fno-strict-aliasing -gstabs+ -Wpointer-arith  -march=k8 -O2 -I//usr/include/lcms -o token.o token.c
x86_64-pc-linux-gnu-gcc -c -I. -I. -I../include -I../include  -D__WINESRC__  -Wall -pipe -mpreferred-stack-boundary=2 -fno-strict-aliasing -gstabs+ -Wpointer-arith  -march=k8 -O2 -I//usr/include/lcms -o trace.o trace.c
x86_64-pc-linux-gnu-gcc -c -I. -I. -I../include -I../include  -D__WINESRC__  -Wall -pipe -mpreferred-stack-boundary=2 -fno-strict-aliasing -gstabs+ -Wpointer-arith  -march=k8 -O2 -I//usr/include/lcms -o unicode.o unicode.c
x86_64-pc-linux-gnu-gcc -c -I. -I. -I../include -I../include  -D__WINESRC__  -Wall -pipe -mpreferred-stack-boundary=2 -fno-strict-aliasing -gstabs+ -Wpointer-arith  -march=k8 -O2 -I//usr/include/lcms -o user.o user.c
x86_64-pc-linux-gnu-gcc -c -I. -I. -I../include -I../include  -D__WINESRC__  -Wall -pipe -mpreferred-stack-boundary=2 -fno-strict-aliasing -gstabs+ -Wpointer-arith  -march=k8 -O2 -I//usr/include/lcms -o window.o window.c
x86_64-pc-linux-gnu-gcc -o wineserver atom.o change.o class.o clipboard.o console.o context_alpha.o context_i386.o context_powerpc.o context_sparc.o debugger.o event.o fd.o file.o handle.o hook.o mailslot.o main.o mapping.o mutex.o named_pipe.o object.o process.o ptrace.o queue.o region.o registry.o request.o semaphore.o serial.o signal.o snapshot.o sock.o thread.o timer.o token.o trace.o unicode.o user.o window.o  -L../libs/wine -lwine -L../libs/unicode -lwine_unicode -L../libs/port -lwine_port
make[1]: Leaving directory `/var/tmp/portage/wine-20050419/work/wine-20050419/server'

!!! ERROR: app-emulation/wine-20050419 failed.
!!! Function src_compile, Line 107, Exitcode 2
!!! all
!!! If you need support, post the topmost build error, NOT this status message.


I tried to look for glut32.dll.so in my system, but it seems not to be present:
Code:
sudo equery belongs glut32.dll.so
[ Searching for file(s) glut32.dll.so in *... ]


Is the lack of glut32.dll.so responsible for the wine emerging failure?
Back to top
View user's profile Send private message
kinkos
Apprentice
Apprentice


Joined: 07 Feb 2005
Posts: 235
Location: Hoboken, NJ

PostPosted: Sat Apr 30, 2005 9:23 pm    Post subject: Reply with quote

I am getting assemblor errors like jsharrad, except much different:
Code:

../../include/winnls.h:744: warning: `__stdcall__' attribute ignored
../../include/winnls.h:745: warning: `__stdcall__' attribute ignored
../../include/winnls.h:746: warning: `__stdcall__' attribute ignored
../../include/winnls.h:747: warning: `__stdcall__' attribute ignored
../../include/winnls.h:749: warning: `__stdcall__' attribute ignored
../../include/winnls.h:750: warning: `__stdcall__' attribute ignored
../../include/winnls.h:751: warning: `__stdcall__' attribute ignored
../../include/winnls.h:753: warning: `__stdcall__' attribute ignored
../../include/winnls.h:754: warning: `__stdcall__' attribute ignored
../../include/winnls.h:756: warning: `__stdcall__' attribute ignored
../../include/winnls.h:757: warning: `__stdcall__' attribute ignored
../../include/winnls.h:758: warning: `__stdcall__' attribute ignored
{standard input}: Assembler messages:
{standard input}:2082: Error: Incorrect register `%rbx' used with `l' suffix
make[2]: *** [debug.o] Error 1
make[2]: Leaving directory `/var/tmp/portage/wine-20050419/work/wine-20050419/libs/wine'
make[1]: *** [wine] Error 2
make[1]: Leaving directory `/var/tmp/portage/wine-20050419/work/wine-20050419/libs'
make: *** [libs] Error 2

about a million of the attribute ignored stuff, ending with the last bit.

Code:

$ emerge info
Portage 2.0.51.20-r5 (default-linux/amd64/2004.3, gcc-3.4.3-20050110, glibc-2.3.5-r0, 2.6.11-ck4 x86_64)
=================================================================
System uname: 2.6.11-ck4 x86_64 AMD Athlon(tm) 64 Processor 3200+
Gentoo Base System version 1.6.11
dev-lang/python:     2.3.5
sys-apps/sandbox:    1.2.3
sys-devel/autoconf:  2.13, 2.59-r6
sys-devel/automake:  1.4_p6, 1.5, 1.6.3, 1.7.9-r1, 1.8.5-r3, 1.9.5
sys-devel/binutils:  2.15.92.0.2-r8
sys-devel/libtool:   1.5.16
virtual/os-headers:  2.6.11
ACCEPT_KEYWORDS="amd64 ~amd64"
AUTOCLEAN="yes"
CBUILD="x86_64-pc-linux-gnu"
CFLAGS="-march=k8 -O2 -funroll-loops -fpeel-loops -ftracer -fomit-frame-pointer -momit-leaf-frame-pointer -pipe"
CHOST="x86_64-pc-linux-gnu"
CONFIG_PROTECT="/etc /usr/kde/2/share/config /usr/kde/3.4/env /usr/kde/3.4/share/config /usr/kde/3.4/shutdown /usr/kde/3/share/config /usr/lib/X11/xkb /usr/share/config /var/qmail/control"
CONFIG_PROTECT_MASK="/etc/gconf /etc/terminfo /etc/env.d"
CXXFLAGS="-march=k8 -O2 -funroll-loops -fpeel-loops -ftracer -fomit-frame-pointer -momit-leaf-frame-pointer -pipe"
DISTDIR="/usr/portage/distfiles"
FEATURES="autoconfig distlocks strict"
GENTOO_MIRRORS="http://distfiles.gentoo.org http://distro.ibiblio.org/pub/Linux/distributions/gentoo"
MAKEOPTS="-j2"
PKGDIR="/usr/portage/packages"
PORTAGE_TMPDIR="/var/tmp"
PORTDIR="/usr/portage"
SYNC="rsync://rsync.gentoo.org/gentoo-portage"
USE="amd64 X a52 aac aalib acpi aim alsa apache2 apm avi bash-completion berkdb bitmap-fonts bzlib calendar cdparanoia cdr color crypt dga directfb dvd dvdr dvdread emul-linux-x86 encode esd fam fbcon ffmpeg flac font-server fortran ftp gd gdbm ggi gif glut gpm gtk gtk2 guile imlib ipv6 ithreads jack java javascript jp2 jpeg libcaca live lzw lzw-tiff mad motif mp3 mpeg multilib ncurses nls nptl nvidia offensive ogg oggvorbis openal opengl oss perl png python qt quicktime readline real samba sdl spell ssl svg tcltk tcpd theora threads tiff truetype truetype-fonts type1-fonts usb userlocales videos vorbis wmf xine xml xml2 xmms xpm xrandr xv xvid zlib"
Unset:  ASFLAGS, CTARGET, LANG, LC_ALL, LDFLAGS, LINGUAS, PORTDIR_OVERLAY

_________________
Open Source, Open Mind
Back to top
View user's profile Send private message
drescherjm
Advocate
Advocate


Joined: 05 Jun 2004
Posts: 2780
Location: Pittsburgh, PA, USA

PostPosted: Sat Apr 30, 2005 9:41 pm    Post subject: Reply with quote

I get the same errors with wine-20050419 as jsharrad so I decided to put it in my /etc/portage/package.mask so when I do an emerge -u world it does not try to upgrade to the broken version of wine.
_________________
John

My gentoo overlay
Instructons for overlay
Back to top
View user's profile Send private message
kinkos
Apprentice
Apprentice


Joined: 07 Feb 2005
Posts: 235
Location: Hoboken, NJ

PostPosted: Sat Apr 30, 2005 10:20 pm    Post subject: Reply with quote

Uhm, jsharrad is using wine-20050310-r1, not wine-20050419 like you and i. maybe jsharrad can emerge sync and try again?
_________________
Open Source, Open Mind
Back to top
View user's profile Send private message
drescherjm
Advocate
Advocate


Joined: 05 Jun 2004
Posts: 2780
Location: Pittsburgh, PA, USA

PostPosted: Sat Apr 30, 2005 10:36 pm    Post subject: Reply with quote

Quote:
Uhm, jsharrad is using wine-20050310-r1, not wine-20050419 like you and i.


:oops: I missed the version...

Actually, wine-20050310-r1 compiled and ran fine after adding use -arts. wine-20050419 had the same exact error as jsharrad had with wine-20050310-r1. This makes me think the problem is probably with some new headers / lib that we are both using and that I did not have installed when I installed wine-20050310-r1.
_________________
John

My gentoo overlay
Instructons for overlay
Back to top
View user's profile Send private message
localghost
Apprentice
Apprentice


Joined: 28 Oct 2004
Posts: 185
Location: Sint-Niklaas, Belgium

PostPosted: Mon May 02, 2005 10:38 am    Post subject: [SOLVED] Reply with quote

I'm doing a stage 3 x86 install. No more AMD64 problems for me. Incident closed.
_________________
411 /0µr 84$3 4r3 8310n9 70 µ$.
Back to top
View user's profile Send private message
kinkos
Apprentice
Apprentice


Joined: 07 Feb 2005
Posts: 235
Location: Hoboken, NJ

PostPosted: Mon May 02, 2005 4:49 pm    Post subject: Reply with quote

...

I literally cannot find the words to express my dissapointment at your decision.
_________________
Open Source, Open Mind
Back to top
View user's profile Send private message
hvengel
Guru
Guru


Joined: 19 Sep 2004
Posts: 515

PostPosted: Tue May 03, 2005 12:23 am    Post subject: Reply with quote

I emerged wine today and it is mostly working. But it is giving me error messages about not finding lcms. Since one of the reasons that installed this is to run Photoshop and I want color management to be working. So I installed lcms from an rpm and re-emerged wine with use="lcms". But I am still getting error messages about wine not being able to find lcms. How to I get this to work?
Back to top
View user's profile Send private message
localghost
Apprentice
Apprentice


Joined: 28 Oct 2004
Posts: 185
Location: Sint-Niklaas, Belgium

PostPosted: Tue May 03, 2005 10:31 am    Post subject: Reply with quote

kinkos wrote:
...

I literally cannot find the words to express my dissapointment at your decision.


R U talking 2 me?
Gentoo is all about choice, and I choose x86.

I'm not interested in being in the front line, a stable system is good enough for me. When all, and I repeat all software is ported to AMD64, I'll reserve some space on a spare partition to try it out. But not today, not yet. It's just too difficult and my IQ is below 137. :oops:

By the way, I see you live in Hoboken. Would that be Hoboken, near Antwerp, where my father in law was born and raised and a proverbial bowshot from where I am now, or Hoboken near New York, a few more bowshots away?
_________________
411 /0µr 84$3 4r3 8310n9 70 µ$.
Back to top
View user's profile Send private message
kinkos
Apprentice
Apprentice


Joined: 07 Feb 2005
Posts: 235
Location: Hoboken, NJ

PostPosted: Tue May 03, 2005 2:43 pm    Post subject: Reply with quote

Sorry, I guess i don't like to see things underused. It's like when someone buys a Ferrari and never drives over the speed limit, and never takes a turn more sharply than absolutely necessary. These things are built for performance :)

I don't know where Antwerp is, but this is the Hoboken a cannon shot from NYC. And when i mean a cannon shot, i mean my school has a cannon pointed across the river at NYC :D

Edit: dear lord, since when do i spell "cannon" "cannot" ?
_________________
Open Source, Open Mind
Back to top
View user's profile Send private message
hvengel
Guru
Guru


Joined: 19 Sep 2004
Posts: 515

PostPosted: Tue May 03, 2005 10:29 pm    Post subject: Reply with quote

I have found that my wine apps to not see my printer. I am using CUPS and gimp-print for my epson 1280 printer. This is working correctly for native apps but when I am running wine apps they can not find the printer. I have looked at the documentation on the wine web site and it says that if you have a CUPS printer wine will automaticaly configure it. This does not appear to be true in all cases. Could this be because this printer is a raster printer rather than a postscript printer? What do I have to do to configure this?
Back to top
View user's profile Send private message
Riddick
Tux's lil' helper
Tux's lil' helper


Joined: 22 Apr 2005
Posts: 102
Location: Rome or Bristol

PostPosted: Wed May 04, 2005 8:30 pm    Post subject: Reply with quote

emerged without problems, thanks a lot
Back to top
View user's profile Send private message
chebe
Tux's lil' helper
Tux's lil' helper


Joined: 02 Mar 2004
Posts: 101
Location: New Caledonia

PostPosted: Fri May 06, 2005 1:16 am    Post subject: Reply with quote

It's working !!

using
Code:
EXTRA_ECONF="--x-libraries=/emul/linux/x86/usr/lib" MAKEOPTS="-j1" emerge wine

it gives :
Code:
app-emulation/wine-20050419  +X +alsa -arts +cups -debug -doc +gif -glut -jack +jpeg -lcms -nas +ncurses +opengl +oss


Thanks all for making this possible !

Linux chr 2.6.11-gentoo-r7 #1 Mon May 2 11:12:58 NCT 2005 x86_64 AMD Athlon(tm) 64 Processor 3500+ AuthenticAMD GNU/Linux
_________________
Unix is user friendly - it's just selective about who its friends are !
Back to top
View user's profile Send private message
kinkos
Apprentice
Apprentice


Joined: 07 Feb 2005
Posts: 235
Location: Hoboken, NJ

PostPosted: Fri May 06, 2005 3:54 am    Post subject: Reply with quote

Code:

# EXTRA_ECONF="--x-libraries=/emul/linux/x86/usr/lib" MAKEOPTS="-j1" emerge wine

Code:

../../include/winnls.h:750: warning: `__stdcall__' attribute ignored
../../include/winnls.h:751: warning: `__stdcall__' attribute ignored
../../include/winnls.h:753: warning: `__stdcall__' attribute ignored
../../include/winnls.h:754: warning: `__stdcall__' attribute ignored
../../include/winnls.h:756: warning: `__stdcall__' attribute ignored
../../include/winnls.h:757: warning: `__stdcall__' attribute ignored
../../include/winnls.h:758: warning: `__stdcall__' attribute ignored
{standard input}: Assembler messages:
{standard input}:2082: Error: Incorrect register `%rbx' used with `l' suffix
make[2]: *** [debug.o] Error 1
make[2]: Leaving directory `/var/tmp/portage/wine-20050419/work/wine-20050419/libs/wine'
make[1]: *** [wine] Error 2
make[1]: Leaving directory `/var/tmp/portage/wine-20050419/work/wine-20050419/libs'
make: *** [libs] Error 2

!!! ERROR: app-emulation/wine-20050419 failed.
!!! Function src_compile, Line 106, Exitcode 2
!!! depend
!!! If you need support, post the topmost build error, NOT this status message.


could someone who HAS gotten it to work successfuly post their:
Code:

# emerge -pv wine

and
Code:

# emerge info


Its gotta be something with different versions, and if we can get enough people to post their (working wine, versions of) emerge info and emerge -pv wine, we might be able to narrow down a setup that will ALWAYS work, instead of this haphazard working...

Also, will there be a wine-bin? :D
_________________
Open Source, Open Mind
Back to top
View user's profile Send private message
hvengel
Guru
Guru


Joined: 19 Sep 2004
Posts: 515

PostPosted: Fri May 06, 2005 4:30 am    Post subject: Reply with quote

I posted about two days ago asking about printing. I am not able to print from any app I am running with wine. Can anyone else running wine on amd64 print from any app. I have even tried the simplest possible cases like printing from notepad. It is a total no go. If this is working for others than I will assume that I have some type of configuration problem. But if no one has this working then I have to conclude that there is a problem with the ebuild. So is anyone able to print using wine?
Back to top
View user's profile Send private message
Display posts from previous:   
Reply to topic    Gentoo Forums Forum Index Gentoo on AMD64 All times are GMT
Goto page Previous  1, 2, 3, 4, 5, 6 ... 9, 10, 11  Next
Page 5 of 11

 
Jump to:  
You cannot post new topics in this forum
You cannot reply to topics in this forum
You cannot edit your posts in this forum
You cannot delete your posts in this forum
You cannot vote in polls in this forum