Gentoo Forums
Gentoo Forums
Gentoo Forums
Quick Search: in
[SOLVED] Emerging of dev-qt/qtwebkit-5.5.1-r1::gentoo fails
View unanswered posts
View posts from last 24 hours

 
Reply to topic    Gentoo Forums Forum Index Portage & Programming
View previous topic :: View next topic  
Author Message
jesterchen
n00b
n00b


Joined: 21 Jan 2012
Posts: 33

PostPosted: Sat Feb 20, 2016 10:20 pm    Post subject: [SOLVED] Emerging of dev-qt/qtwebkit-5.5.1-r1::gentoo fails Reply with quote

Hi there,

I have had some issues with my portage lately, one of the keyproblems is qtwebkit - which fails to emerge. I tried masking qt 5.5., but it did not help. I have had emerged qt-webkit-5.5.1 (not r1), accidentally removed it - and now I can't get it back.
Other threads proposing to lower MAKEOPTS -jN did not help. Any hints, I am totally stuck. :(

emerge --info '=dev-qt/qtwebkit-5.5.1-r1::gentoo'
Quote:
Portage 2.2.27 (python 3.4.3-final-0, default/linux/amd64/13.0, gcc-5.3.0, glibc-2.22-r2, 4.0.0-gentoo x86_64)
=================================================================
System Settings
=================================================================
System uname: Linux-4.0.0-gentoo-x86_64-Intel-R-_Core-TM-_i7-4500U_CPU_@_1.80GHz-with-gentoo-2.2
KiB Mem: 16050880 total, 6594292 free
KiB Swap: 0 total, 0 free
Timestamp of repository gentoo: Sat, 20 Feb 2016 18:30:01 +0000
sh bash 4.3_p42-r2
ld GNU ld (Gentoo 2.25.1 p1.1) 2.25.1
app-shells/bash: 4.3_p42-r2::gentoo
dev-java/java-config: 2.2.0-r2::gentoo
dev-lang/perl: 5.22.1::gentoo
dev-lang/python: 2.7.11-r2::gentoo, 3.4.3-r7::gentoo, 3.5.1-r2::gentoo
dev-util/cmake: 3.4.3::gentoo
dev-util/pkgconfig: 0.29::gentoo
sys-apps/baselayout: 2.2::gentoo
sys-apps/openrc: 0.20.5::gentoo
sys-apps/sandbox: 2.10-r1::gentoo
sys-devel/autoconf: 2.13::gentoo, 2.69-r1::gentoo
sys-devel/automake: 1.11.6-r2::gentoo, 1.13.4-r1::gentoo, 1.14.1-r1::gentoo, 1.15-r2::gentoo
sys-devel/binutils: 2.25.1-r1::gentoo
sys-devel/gcc: 5.3.0::gentoo
sys-devel/gcc-config: 1.8-r1::gentoo
sys-devel/libtool: 2.4.6-r2::gentoo
sys-devel/make: 4.1-r1::gentoo
sys-kernel/linux-headers: 4.4::gentoo (virtual/os-headers)
sys-libs/glibc: 2.22-r2::gentoo
Repositories:

gentoo
location: /usr/portage
sync-type: rsync
sync-uri: rsync://rsync.gentoo.org/gentoo-portage
priority: -1000

gamerlay
location: /var/lib/layman/gamerlay
masters: gentoo
priority: 50

jorgicio
location: /var/lib/layman/jorgicio
masters: gentoo
priority: 50

sunrise
location: /var/lib/layman/sunrise
masters: gentoo
priority: 50

ultrabug
location: /var/lib/layman/ultrabug
masters: gentoo
priority: 50

x11
location: /var/lib/layman/x11
masters: gentoo
priority: 50

ACCEPT_KEYWORDS="amd64 ~amd64 ~x86"
ACCEPT_LICENSE="* -@EULA"
CBUILD="x86_64-pc-linux-gnu"
CFLAGS="-O2 -pipe -march=native"
CHOST="x86_64-pc-linux-gnu"
CONFIG_PROTECT="/etc /usr/share/config /usr/share/gnupg/qualified.txt /var/lib/hsqldb"
CONFIG_PROTECT_MASK="/etc/ca-certificates.conf /etc/dconf /etc/env.d /etc/fonts/fonts.conf /etc/gconf /etc/gentoo-release /etc/revdep-rebuild /etc/sandbox.d /etc/terminfo /etc/texmf/language.dat.d /etc/texmf/language.def.d /etc/texmf/updmap.d /etc/texmf/web2c"
CXXFLAGS="-O2 -pipe -march=native"
DISTDIR="/usr/portage/distfiles"
EMERGE_DEFAULT_OPTS="--quiet-build --keep-going"
FCFLAGS="-O2 -pipe"
FEATURES="assume-digests binpkg-logs config-protect-if-modified distlocks ebuild-locks fixlafiles merge-sync news parallel-fetch preserve-libs protect-owned sandbox sfperms splitdebug strict unknown-features-warn unmerge-logs unmerge-orphans userfetch userpriv usersandbox usersync xattr"
FFLAGS="-O2 -pipe"
GENTOO_MIRRORS="ftp://ftp.uni-erlangen.de/pub/mirrors/gentoo"
LANG="en_US.utf8"`emerge --info '=dev-qt/qtwebkit-5.5.1-r1::gentoo'
LDFLAGS="-Wl,-O1 -Wl,--as-needed"
MAKEOPTS="-j5"
PKGDIR="/usr/portage/packages"
PORTAGE_CONFIGROOT="/"
PORTAGE_RSYNC_OPTS="--recursive --links --safe-links --perms --times --omit-dir-times --compress --force --whole-file --delete --stats --human-readable --timeout=180 --exclude=/distfiles --exclude=/local --exclude=/packages --exclude=/.git"
PORTAGE_TMPDIR="/var/tmp"
USE="X a52 aac aalib acl acpi alsa amd64 apm berkdb bzip2 cdb cdda cddb cdparanoia cdr cli cracklib crypt css cups curl cxx dbus dri dvd dvdr encode exif fbcon ffmpeg flac fortran ftp gdbm gif gimp gpm gzip iconv imap ipv6 jabber jpeg jpeg2k lame lm_sensors lzma lzo maildir matroska mbox mikmod mime mmx mmxext modplug modules mp3 mp4 mpeg mplayer mtp multilib ncurses nls nptl offensive ogg openmp pam pcre pcsc-lite pdf perl png python readline seccomp session sound speex sse sse2 sse3 ssl ssse3 svg syslog tcpd threads tidy tiff timidity truetype udev unicode vorbis wifi x264 xattr xcomposite xosd xscreensaver xvid zlib zsh-completion" ABI_X86="64" ALSA_CARDS="ali5451 als4000 atiixp atiixp-modem bt87x ca0106 cmipci emu10k1x ens1370 ens1371 es1938 es1968 fm801 hda-intel intel8x0 intel8x0m maestro3 trident usb-audio via82xx via82xx-modem ymfpci" APACHE2_MODULES="authn_core authz_core socache_shmcb unixd actions alias auth_basic authn_alias authn_anon authn_dbm authn_default authn_file authz_dbm authz_default authz_groupfile authz_host authz_owner authz_user autoindex cache cgi cgid dav dav_fs dav_lock deflate dir disk_cache env expires ext_filter file_cache filter headers include info log_config logio mem_cache mime mime_magic negotiation rewrite setenvif speling status unique_id userdir usertrack vhost_alias" CALLIGRA_FEATURES="kexi words flow plan sheets stage tables krita karbon braindump author" CAMERAS="ptp2" COLLECTD_PLUGINS="df interface irq load memory rrdtool swap syslog" CPU_FLAGS_X86="mmx mmxext sse sse2" ELIBC="glibc" GPSD_PROTOCOLS="ashtech aivdm earthmate evermore fv18 garmin garmintxt gpsclock itrax mtk3301 nmea ntrip navcom oceanserver oldstyle oncore rtcm104v2 rtcm104v3 sirf superstar2 timing tsip tripmate tnt ublox ubx" INPUT_DEVICES="evdev synaptics void" KERNEL="linux" LCD_DEVICES="bayrad cfontz cfontz633 glk hd44780 lb216 lcdm001 mtxorb ncurses text" LIBREOFFICE_EXTENSIONS="presenter-console presenter-minimizer" LINGUAS="en" OFFICE_IMPLEMENTATION="libreoffice" PHP_TARGETS="php5-5" PYTHON_SINGLE_TARGET="python2_7" PYTHON_TARGETS="python2_7 python3_4" RUBY_TARGETS="ruby20 ruby21 ruby22 ruby23" USERLAND="GNU" VIDEO_CARDS="intel i965 fbdev" XTABLES_ADDONS="quota2 psd pknock lscan length2 ipv4options ipset ipp2p iface geoip fuzzy condition tee tarpit sysrq steal rawnat logmark ipmark dhcpmac delude chaos account"
USE_PYTHON="2.7 3.5"
Unset: CC, CPPFLAGS, CTARGET, CXX, INSTALL_MASK, LC_ALL, PORTAGE_BUNZIP2_COMMAND, PORTAGE_COMPRESS, PORTAGE_COMPRESS_FLAGS, PORTAGE_RSYNC_EXTRA_OPTS


emerge -pqv '=dev-qt/qtwebkit-5.5.1-r1::gentoo'
Quote:
[ebuild NS ] dev-qt/qtwebkit-5.5.1-r1 [4.8.7] USE="jit -debug -geolocation -gstreamer -gstreamer010 -multimedia -opengl -orientation -printsupport -qml {-test} -webchannel -webp"



The complete build log is located at https://extern.jesterweb.de/qtwebkit-5.5.1-r1-build.log - the end is pasted here:
Quote:
make[1]: Leaving directory '/var/tmp/portage/dev-qt/qtwebkit-5.5.1-r1/work/qtwebkit-opensource-src-5.5.1/Source/WebKit'
cd Source/ && ( test -e Makefile.QtWebKit || /usr/lib64/qt5/bin/qmake /var/tmp/portage/dev-qt/qtwebkit-5.5.1-r1/work/qtwebkit-opensource-src-5.5.1/Source/QtWebKit.pro CONFIG+=release CONFIG-=debug 'QMAKE_AR=x86_64-pc-linux-gnu-ar cqs' QMAKE_CC=x86_64-pc-linux-gnu-gcc QMAKE_LINK_C=x86_64-pc-linux-gnu-gcc QMAKE_LINK_C_SHLIB=x86_64-pc-linux-gnu-gcc QMAKE_CXX=x86_64-pc-linux-gnu-g++ QMAKE_LINK=x86_64-pc-linux-gnu-g++ QMAKE_LINK_SHLIB=x86_64-pc-linux-gnu-g++ QMAKE_OBJCOPY=x86_64-pc-linux-gnu-objcopy QMAKE_RANLIB= QMAKE_STRIP=x86_64-pc-linux-gnu-strip 'QMAKE_CFLAGS=-O2 -pipe -march=native' QMAKE_CFLAGS_RELEASE= QMAKE_CFLAGS_DEBUG= 'QMAKE_CXXFLAGS=-O2 -pipe -march=native' QMAKE_CXXFLAGS_RELEASE= QMAKE_CXXFLAGS_DEBUG= 'QMAKE_LFLAGS=-Wl,-O1 -Wl,--as-needed' QMAKE_LFLAGS_RELEASE= QMAKE_LFLAGS_DEBUG= -o Makefile.QtWebKit ) && make -f Makefile.QtWebKit
make[1]: Entering directory '/var/tmp/portage/dev-qt/qtwebkit-5.5.1-r1/work/qtwebkit-opensource-src-5.5.1/Source'
( test -e Makefile.api || /usr/lib64/qt5/bin/qmake /var/tmp/portage/dev-qt/qtwebkit-5.5.1-r1/work/qtwebkit-opensource-src-5.5.1/Source/api.pri CONFIG+=release CONFIG-=debug 'QMAKE_AR=x86_64-pc-linux-gnu-ar cqs' QMAKE_CC=x86_64-pc-linux-gnu-gcc QMAKE_LINK_C=x86_64-pc-linux-gnu-gcc QMAKE_LINK_C_SHLIB=x86_64-pc-linux-gnu-gcc QMAKE_CXX=x86_64-pc-linux-gnu-g++ QMAKE_LINK=x86_64-pc-linux-gnu-g++ QMAKE_LINK_SHLIB=x86_64-pc-linux-gnu-g++ QMAKE_OBJCOPY=x86_64-pc-linux-gnu-objcopy QMAKE_RANLIB= QMAKE_STRIP=x86_64-pc-linux-gnu-strip 'QMAKE_CFLAGS=-O2 -pipe -march=native' QMAKE_CFLAGS_RELEASE= QMAKE_CFLAGS_DEBUG= 'QMAKE_CXXFLAGS=-O2 -pipe -march=native' QMAKE_CXXFLAGS_RELEASE= QMAKE_CXXFLAGS_DEBUG= 'QMAKE_LFLAGS=-Wl,-O1 -Wl,--as-needed' QMAKE_LFLAGS_RELEASE= QMAKE_LFLAGS_DEBUG= -o Makefile.api ) && make -f Makefile.api
make[2]: Entering directory '/var/tmp/portage/dev-qt/qtwebkit-5.5.1-r1/work/qtwebkit-opensource-src-5.5.1/Source'
rm -f libQt5WebKit.so.5.5.1 libQt5WebKit.so libQt5WebKit.so.5 libQt5WebKit.so.5.5
x86_64-pc-linux-gnu-g++ -Wl,-O1 -Wl,--as-needed -Wl,--gc-sections -Wl,--no-undefined -Wl,--no-undefined -fdebug-types-section -fuse-ld=gold -Wl,--enable-new-dtags -shared -Wl,-Bsymbolic-functions -Wl,-soname,libQt5WebKit.so.5 -o libQt5WebKit.so.5.5.1 -lQt5Gui -lQt5Core -lpthread -lQt5Network -lQt5Core -lpthread -lQt5Core -lpthread -lpthread -Wl,-whole-archive -lWebKit1 -Wl,-no-whole-archive -L/var/tmp/portage/dev-qt/qtwebkit-5.5.1-r1/work/qtwebkit-opensource-src-5.5.1/Source/WebKit/ -Wl,-whole-archive -lWebCore -Wl,-no-whole-archive -L/var/tmp/portage/dev-qt/qtwebkit-5.5.1-r1/work/qtwebkit-opensource-src-5.5.1/Source/WebCore/ -lz -lXrender -lleveldb -lmemenv -ljpeg -lpng -Wl,-whole-archive -lJavaScriptCore -Wl,-no-whole-archive -L/var/tmp/portage/dev-qt/qtwebkit-5.5.1-r1/work/qtwebkit-opensource-src-5.5.1/Source/JavaScriptCore/ -Wl,-whole-archive -lWTF -Wl,-no-whole-archive -L/var/tmp/portage/dev-qt/qtwebkit-5.5.1-r1/work/qtwebkit-opensource-src-5.5.1/Source/WTF/ -lXext -lX11 -lm -lX11 -lxslt -lxml2 -lz -lm -ldl -lm -lxml2 -lxml2 -lsqlite3 -licui18n -licuuc -licudata -lQt5Sql -lQt5Core -lpthread -lQt5Gui -lQt5Core -lpthread -lQt5Network -lQt5Core -lpthread -lQt5Core -lpthread -lGL
/var/tmp/portage/dev-qt/qtwebkit-5.5.1-r1/work/qtwebkit-opensource-src-5.5.1/Source/WebCore//libWebCore.a(/var/tmp/portage/dev-qt/qtwebkit-5.5.1-r1/work/qtwebkit-opensource-src-5.5.1/Source/WebCore//.obj/platform/leveldb/LevelDBDatabase.o):LevelDBDatabase.cpp:function WebCore::openDB(leveldb::Comparator*, leveldb::Env*, WTF::String const&, leveldb::DB**) [clone .constprop.34]: error: undefined reference to 'leveldb::DB::Open(leveldb::Options const&, std::__cxx11::basic_string<char, std::char_traits<char>, std::allocator<char> > const&, leveldb::DB**)'
/var/tmp/portage/dev-qt/qtwebkit-5.5.1-r1/work/qtwebkit-opensource-src-5.5.1/Source/WebCore//libWebCore.a(/var/tmp/portage/dev-qt/qtwebkit-5.5.1-r1/work/qtwebkit-opensource-src-5.5.1/Source/WebCore//.obj/platform/leveldb/LevelDBDatabase.o):LevelDBDatabase.cpp:function WebCore::LevelDBDatabase::destroy(WTF::String const&): error: undefined reference to 'leveldb::DestroyDB(std::__cxx11::basic_string<char, std::char_traits<char>, std::allocator<char> > const&, leveldb::Options const&)'
collect2: error: ld returned 1 exit status
Makefile.api:109: recipe for target '../lib/libQt5WebKit.so.5.5.1' failed
make[2]: *** [../lib/libQt5WebKit.so.5.5.1] Error 1
make[2]: Leaving directory '/var/tmp/portage/dev-qt/qtwebkit-5.5.1-r1/work/qtwebkit-opensource-src-5.5.1/Source'
Makefile.QtWebKit:41: recipe for target 'sub-api-pri-make_first-ordered' failed
make[1]: *** [sub-api-pri-make_first-ordered] Error 2
make[1]: Leaving directory '/var/tmp/portage/dev-qt/qtwebkit-5.5.1-r1/work/qtwebkit-opensource-src-5.5.1/Source'
Makefile:219: recipe for target 'sub-Source-QtWebKit-pro-make_first-ordered' failed
make: *** [sub-Source-QtWebKit-pro-make_first-ordered] Error 2
* ERROR: dev-qt/qtwebkit-5.5.1-r1::gentoo failed (compile phase):
* emake failed
*
* If you need support, post the output of `emerge --info '=dev-qt/qtwebkit-5.5.1-r1::gentoo'`,
* the complete build log and the output of `emerge -pqv '=dev-qt/qtwebkit-5.5.1-r1::gentoo'`.
* The complete build log is located at '/var/tmp/portage/dev-qt/qtwebkit-5.5.1-r1/temp/build.log'.
* The ebuild environment file is located at '/var/tmp/portage/dev-qt/qtwebkit-5.5.1-r1/temp/environment'.
* Working directory: '/var/tmp/portage/dev-qt/qtwebkit-5.5.1-r1/work/qtwebkit-opensource-src-5.5.1'
* S: '/var/tmp/portage/dev-qt/qtwebkit-5.5.1-r1/work/qtwebkit-opensource-src-5.5.1'


The environment is located at https://extern.jesterweb.de/qtwebkit-5.5.1-r1-environment .


Last edited by jesterchen on Sun Feb 21, 2016 10:08 am; edited 2 times in total
Back to top
View user's profile Send private message
asturm
Developer
Developer


Joined: 05 Apr 2007
Posts: 6147
Location: Austria

PostPosted: Sat Feb 20, 2016 10:30 pm    Post subject: Reply with quote

So you switched to GCC 5.3.0. Did you also read the news item that is related to it? Could it be that your trouble with portage started around that time?

EDIT: Unfortunately, your links don't work.
_________________
backend.cpp:92:2: warning: #warning TODO - this error message is about as useful as a cooling unit in the arctic
Back to top
View user's profile Send private message
jesterchen
n00b
n00b


Joined: 21 Jan 2012
Posts: 33

PostPosted: Sat Feb 20, 2016 11:05 pm    Post subject: Reply with quote

D'Oh!
News items. Mea maxima culpa.
I will return, if I finished the tasks from the news item. Thanks.
(The links are working now, the automatic link recognition added the . to the link.)

Thank you.
Back to top
View user's profile Send private message
jesterchen
n00b
n00b


Joined: 21 Jan 2012
Posts: 33

PostPosted: Sun Feb 21, 2016 10:08 am    Post subject: Reply with quote

Reading the news item (which I somehow managed to forget since 2014) and doing the `revdep-rebuild --library 'libstdc++.so.6' -- --exclude gcc` helped after upgrading to gcc5. 225 packets rebuilt without any error, including qtwebkit.
So thanks again.
Back to top
View user's profile Send private message
pygoscelis
Guru
Guru


Joined: 07 Jun 2003
Posts: 367

PostPosted: Sun Mar 20, 2016 1:11 am    Post subject: Reply with quote

I've got the same problem., but `revdep-rebuild --library 'libstdc++.so.6' -- --exclude gcc` returns nothing. What gives?
_________________
!זה הכי, אחי Gentoo
Back to top
View user's profile Send private message
dol-sen
Developer
Developer


Joined: 30 Jun 2002
Posts: 2803
Location: Richmond, BC, Canada

PostPosted: Wed Apr 20, 2016 3:11 am    Post subject: Reply with quote

I just did an emerge -e @system, followed by an emerge -e @world which fixed several pkgs failing recently, but qtwebkit fails the same, and revdep-rebuild does not find any such broken links or anything to rebuild.
_________________
Brian
Porthole, the Portage GUI frontend irc@freenode: #gentoo-guis, #porthole, Blog
layman, gentoolkit, CoreBuilder, esearch...
Back to top
View user's profile Send private message
Santiago_de_Mayo
n00b
n00b


Joined: 10 Oct 2003
Posts: 24

PostPosted: Mon May 30, 2016 8:20 pm    Post subject: Reply with quote

Seems that for some this issue wasn't resolved by the above revdep-rebuild command which results in no found packages.

The upgrade guide says you should use the following command if you are running less then gentoolkit 0.3.1:

Code:
revdep-rebuild --library 'libstdc\+\+\.so\.6' -- --exclude gcc


Just in case anyone still has this issue, is as lazy as I am, and doesn't read documentation :-)
Back to top
View user's profile Send private message
robinmarlow
Apprentice
Apprentice


Joined: 10 Mar 2004
Posts: 167

PostPosted: Thu Jan 04, 2018 2:51 pm    Post subject: Reply with quote

resurrecting an old thread in case someone has the same problem - I had this same problem for qtwebkit-5.9.1 & found I had to recompile dev-libs/leveldb.
Hope this helps someone.
Back to top
View user's profile Send private message
asturm
Developer
Developer


Joined: 05 Apr 2007
Posts: 6147
Location: Austria

PostPosted: Thu Jan 04, 2018 2:58 pm    Post subject: Reply with quote

Yes, leveldb, but it is only a symptom of (still) the same issue from above: Not all broken packages rebuilt after switch to >=GCC-5.
_________________
backend.cpp:92:2: warning: #warning TODO - this error message is about as useful as a cooling unit in the arctic
Back to top
View user's profile Send private message
jody
Guru
Guru


Joined: 16 Oct 2007
Posts: 499
Location: Switzerland

PostPosted: Thu Jan 18, 2018 11:20 am    Post subject: Reply with quote

Hi
I'm not sure if it's the same problem
When i emerge qtwebkit it fails:
Code:

...
make[2]: Entering directory '/var/tmp/portage/dev-qt/qtwebkit-5.7.1/work/qtwebkit-opensource-src-5.7.1/Source/JavaScriptCore'
ruby /var/tmp/portage/dev-qt/qtwebkit-5.7.1/work/qtwebkit-opensource-src-5.7.1/Source/JavaScriptCore/offlineasm/generate_offset_extractor.rb llint/LowLevelInterpreter.asm LLIntDesiredOffsets.h
/usr/lib64/ruby/2.0.0/rubygems.rb:15:in `require': cannot load such file -- rubygems/compatibility (LoadError)
   from /usr/lib64/ruby/2.0.0/rubygems.rb:15:in `<top (required)>'
   from <internal:gem_prelude>:1:in `require'
   from <internal:gem_prelude>:1:in `<compiled>'
make[2]: *** [Makefile.LLIntOffsetsExtractor:357: LLIntDesiredOffsets.h] Error 1
make[2]: Leaving directory '/var/tmp/portage/dev-qt/qtwebkit-5.7.1/work/qtwebkit-opensource-src-5.7.1/Source/JavaScriptCore'
make[1]: *** [Makefile.JavaScriptCore:42: sub-LLIntOffsetsExtractor-pro-make_first-ordered] Error 2
make[1]: Leaving directory '/var/tmp/portage/dev-qt/qtwebkit-5.7.1/work/qtwebkit-opensource-src-5.7.1/Source/JavaScriptCore'
make: *** [Makefile:93: sub-Source-JavaScriptCore-JavaScriptCore-pro-make_first-ordered] Error 2
 * ERROR: dev-qt/qtwebkit-5.7.1::gentoo failed (compile phase):
 *   emake failed
 *
 * If you need support, post the output of `emerge --info '=dev-qt/qtwebkit-5.7.1::gentoo'`,
 * the complete build log and the output of `emerge -pqv '=dev-qt/qtwebkit-5.7.1::gentoo'`.
 * The complete build log is located at '/var/tmp/portage/dev-qt/qtwebkit-5.7.1/temp/build.log'.
 * The ebuild environment file is located at '/var/tmp/portage/dev-qt/qtwebkit-5.7.1/temp/environment'.
 * Working directory: '/var/tmp/portage/dev-qt/qtwebkit-5.7.1/work/qtwebkit-opensource-src-5.7.1'
 * S: '/var/tmp/portage/dev-qt/qtwebkit-5.7.1/work/qtwebkit-opensource-src-5.7.1'

>>> Failed to emerge dev-qt/qtwebkit-5.7.1, Log file:

>>>  '/var/tmp/portage/dev-qt/qtwebkit-5.7.1/temp/build.log'
I have re-emerged ruby, rubygems and leveldb but it has not helped.
I am using gcc 6.4.0-r1.
Any idea how i could fix this?
Back to top
View user's profile Send private message
asturm
Developer
Developer


Joined: 05 Apr 2007
Posts: 6147
Location: Austria

PostPosted: Thu Jan 18, 2018 11:25 am    Post subject: Reply with quote

Code:
/usr/lib64/ruby/2.0.0


Horrendously outdated version of ruby.
_________________
backend.cpp:92:2: warning: #warning TODO - this error message is about as useful as a cooling unit in the arctic
Back to top
View user's profile Send private message
jody
Guru
Guru


Joined: 16 Oct 2007
Posts: 499
Location: Switzerland

PostPosted: Thu Jan 18, 2018 4:24 pm    Post subject: Reply with quote

Thanks for the hint!
I was not aware of the various ruby slots.

So after having done
Code:
sudo eselect ruby set ruby22

the emerging of qtwebkit completed without an error.

Thanks
Back to top
View user's profile Send private message
Display posts from previous:   
Reply to topic    Gentoo Forums Forum Index Portage & Programming All times are GMT
Page 1 of 1

 
Jump to:  
You cannot post new topics in this forum
You cannot reply to topics in this forum
You cannot edit your posts in this forum
You cannot delete your posts in this forum
You cannot vote in polls in this forum