Gentoo Forums
Gentoo Forums
Gentoo Forums
Quick Search: in
mozilla-firefox-0.9-r1 ...(Fixed=
View unanswered posts
View posts from last 24 hours
View posts from last 7 days

 
Reply to topic    Gentoo Forums Forum Index Portuguese
View previous topic :: View next topic  
Author Message
Mythos
l33t
l33t


Joined: 02 May 2004
Posts: 953
Location: Portugal

PostPosted: Sun Jun 20, 2004 2:34 am    Post subject: mozilla-firefox-0.9-r1 ...(Fixed= Reply with quote

Por acaso já houve alguém com problemas a compilar o firefox novo ? E que a mim chega a um ponto que a compilação é terminada . Não consegue compilar o firefox todo.

Consegui compilar o thunderbird-0.7, sem qualquer tipo de problema, o irefox não compila, só dá para meter o bin ;( , que por sua vez é um bocado mais lento do que a source ...
_________________
Best Regards,
Sérgio Henrique
Linux dune 3.0.6-gentoo #1 SMP Thu Oct 27 16:47:29 WEST 2011 x86_64 Intel(R) Core(TM)2 Duo CPU T7500 @ 2.20GHz GenuineIntel GNU/Linux


Last edited by Mythos on Sat Jul 24, 2004 1:57 pm; edited 1 time in total
Back to top
View user's profile Send private message
Clansman
Tux's lil' helper
Tux's lil' helper


Joined: 10 Jan 2004
Posts: 140

PostPosted: Sun Jun 20, 2004 10:42 am    Post subject: Reply with quote

ainda n testei, tenho utilizado o bin, mas dá-me um bocado que já testo isso.

[]
Back to top
View user's profile Send private message
Clansman
Tux's lil' helper
Tux's lil' helper


Joined: 10 Jan 2004
Posts: 140

PostPosted: Sun Jun 20, 2004 11:38 am    Post subject: Reply with quote

o firefox compila fine. estou a compilar o thunderbird.
Back to top
View user's profile Send private message
Mythos
l33t
l33t


Joined: 02 May 2004
Posts: 953
Location: Portugal

PostPosted: Sun Jun 20, 2004 1:46 pm    Post subject: Reply with quote

eu simplesmente não o consigo compilar, quando está quase a chegar ao fim, a compilação é terminada e sem mensagem de erro ...

enfim ...

mas pronto meti o prelink e o firefox-0.9-bin está mais rápido :)
_________________
Best Regards,
Sérgio Henrique
Linux dune 3.0.6-gentoo #1 SMP Thu Oct 27 16:47:29 WEST 2011 x86_64 Intel(R) Core(TM)2 Duo CPU T7500 @ 2.20GHz GenuineIntel GNU/Linux
Back to top
View user's profile Send private message
r3pek
Retired Dev
Retired Dev


Joined: 17 Sep 2003
Posts: 568
Location: Lisbon - Portugal

PostPosted: Sun Jun 20, 2004 1:47 pm    Post subject: Reply with quote

fiz o emerge ontem.... correu-me tudo bem. maravilha até :)
Back to top
View user's profile Send private message
Mythos
l33t
l33t


Joined: 02 May 2004
Posts: 953
Location: Portugal

PostPosted: Thu Jul 15, 2004 12:33 am    Post subject: Reply with quote

bom nem com a versao 0.9.2

fiz uma ebuild da 0.9.2 do firefox e compilei :

g++ -I/usr/X11R6/include -frtti -fno-handle-exceptions -Wconversion -Wpointer-arith -Wcast-align -Woverloaded-virtual -Wsynth -Wno-ctor-dtor-privacy -Wno-non-virtual-dtor -Wno-long-long -pipe -march=athlon-xp -m3dnow -mmmx -msse -Wno-return-type -w -Wno-return-type -w -Wno-return-type -w -s -fforce-addr -fshort-wchar -pthread -pipe -DNDEBUG -DTRIMMED -ffunction-sections -O2 -fPIC -shared -Wl,-h -Wl,libnkgnomevfs.so -o libnkgnomevfs.so nsGnomeVFSProtocolHandler.o -L../../dist/bin -lxpcom -L../../dist/bin -L/var/tmp/portage/mozilla-firefox-0.9.2/work/mozilla/dist/lib -lplds4 -lplc4 -lnspr4 -lpthread -ldl -pthread -Wl,--export-dynamic -lgnomevfs-2 -lbonobo-activation -lORBit-2 -lgobject-2.0 -lm -lgmodule-2.0 -ldl -lgthread-2.0 -lglib-2.0 -Wl,--version-script -Wl,../../build/unix/gnu-ld-scripts/components-version-script -Wl,-Bsymbolic -ldl -lm
chmod +x libnkgnomevfs.so
strip libnkgnomevfs.so
/var/tmp/portage/mozilla-firefox-0.9.2/work/mozilla/config/nsinstall -R -m 755 libnkgnomevfs.so ../../dist/lib/components
../../dist/bin/elf-dynstr-gc ../../dist/lib/components/libnkgnomevfs.so
Couldn't GC any strings, exiting.
/var/tmp/portage/mozilla-firefox-0.9.2/work/mozilla/config/nsinstall -R -m 755 libnkgnomevfs.so ../../dist/bin/components
../../dist/bin/elf-dynstr-gc ../../dist/bin/components/libnkgnomevfs.so
Couldn't GC any strings, exiting.
gmake[3]: Leaving directory `/var/tmp/portage/mozilla-firefox-0.9.2/work/mozilla/extensions/gnomevfs'
gmake[3]: Entering directory `/var/tmp/portage/mozilla-firefox-0.9.2/work/mozilla/extensions/negotiateauth'
nsHttpGssapiAuth.cpp
g++ -o nsHttpGssapiAuth.o -c -DOSTYPE=\"Linux2.6\" -DOSARCH=\"Linux\" -DHAVE_DEPENDENT_LIBS -I/usr/include/heimdal -I../../dist/include/xpcom -I../../dist/include/string -I../../dist/include/necko -I../../dist/include/pref -I../../dist/include/negotiateauth -I../../dist/include -I/var/tmp/portage/mozilla-firefox-0.9.2/work/mozilla/dist/include/nspr -I. -I/usr/X11R6/include -fPIC -I/usr/X11R6/include -frtti -fno-handle-exceptions -Wconversion -Wpointer-arith -Wcast-align -Woverloaded-virtual -Wsynth -Wno-ctor-dtor-privacy -Wno-non-virtual-dtor -Wno-long-long -pipe -march=athlon-xp -m3dnow -mmmx -msse -Wno-return-type -w -Wno-return-type -w -Wno-return-type -w -s -fforce-addr -fshort-wchar -pthread -pipe -DNDEBUG -DTRIMMED -ffunction-sections -O2 -I/usr/X11R6/include -DMOZILLA_CLIENT -include ../../mozilla-config.h -Wp,-MD,.deps/nsHttpGssapiAuth.pp nsHttpGssapiAuth.cpp
nsHttpGssapiAuthModule.cpp
g++ -o nsHttpGssapiAuthModule.o -c -DOSTYPE=\"Linux2.6\" -DOSARCH=\"Linux\" -DHAVE_DEPENDENT_LIBS -I/usr/include/heimdal -I../../dist/include/xpcom -I../../dist/include/string -I../../dist/include/necko -I../../dist/include/pref -I../../dist/include/negotiateauth -I../../dist/include -I/var/tmp/portage/mozilla-firefox-0.9.2/work/mozilla/dist/include/nspr -I. -I/usr/X11R6/include -fPIC -I/usr/X11R6/include -frtti -fno-handle-exceptions -Wconversion -Wpointer-arith -Wcast-align -Woverloaded-virtual -Wsynth -Wno-ctor-dtor-privacy -Wno-non-virtual-dtor -Wno-long-long -pipe -march=athlon-xp -m3dnow -mmmx -msse -Wno-return-type -w -Wno-return-type -w -Wno-return-type -w -s -fforce-addr -fshort-wchar -pthread -pipe -DNDEBUG -DTRIMMED -ffunction-sections -O2 -I/usr/X11R6/include -DMOZILLA_CLIENT -include ../../mozilla-config.h -Wp,-MD,.deps/nsHttpGssapiAuthModule.pp nsHttpGssapiAuthModule.cpp
nsHttpGssapiAuth.cpp:161: error: parse error before `)' token
nsHttpGssapiAuth.cpp:163: error: ISO C++ forbids defining types within return
type
nsHttpGssapiAuth.cpp:163: error: syntax error before `;' token
nsHttpGssapiAuth.cpp: In constructor `
nsGssapiContinuationState::nsGssapiContinuationState()':
nsHttpGssapiAuth.cpp:170: error: `OM_uint32' undeclared (first use this
function)
nsHttpGssapiAuth.cpp:170: error: (Each undeclared identifier is reported only
once for each function it appears in.)
nsHttpGssapiAuth.cpp:170: error: parse error before `,' token
nsHttpGssapiAuth.cpp:171: error: `gss_OID_set' undeclared (first use this
function)
nsHttpGssapiAuth.cpp:172: error: `gss_OID' undeclared (first use this function)
nsHttpGssapiAuth.cpp:174: error: ISO C++ forbids declaration of `gss_OID_desc'
with no type
nsHttpGssapiAuth.cpp:174: error: parse error before `=' token
nsHttpGssapiAuth.cpp: At global scope:
nsHttpGssapiAuth.cpp:176: error: syntax error before `=' token
nsHttpGssapiAuth.cpp:179: error: ISO C++ forbids declaration of `mCtx' with no
type
nsHttpGssapiAuth.cpp:179: error: `GSS_C_NO_CONTEXT' was not declared in this
scope
nsHttpGssapiAuth.cpp:180: error: ISO C++ forbids declaration of `mech_oid' with
no type
nsHttpGssapiAuth.cpp:180: error: `gss_krb5_mech_oid_desc' was not declared in
this scope
nsHttpGssapiAuth.cpp:194: error: ISO C++ forbids declaration of `majstat' with
no type
nsHttpGssapiAuth.cpp:194: error: `minstat' was not declared in this scope
nsHttpGssapiAuth.cpp:194: error: `mech_set' was not declared in this scope
nsHttpGssapiAuth.cpp:194: error: `gss_indicate_mechs' was not declared in this
scope
nsHttpGssapiAuth.cpp:195: error: parse error before `if'
nsHttpGssapiAuth.cpp:198: error: `mech_set' was not declared in this scope
nsHttpGssapiAuth.cpp:198: error: parse error before `;' token
nsHttpGssapiAuth.cpp:198: error: syntax error before `++' token
nsHttpGssapiAuth.cpp:204: error: ISO C++ forbids declaration of `mech_oid' with
no type
nsHttpGssapiAuth.cpp:204: error: redefinition of `int mech_oid'
nsHttpGssapiAuth.cpp:180: error: `int mech_oid' previously defined here
nsHttpGssapiAuth.cpp:204: error: `gss_spnego_mech_oid_desc' was not declared in
this scope
nsHttpGssapiAuth.cpp:205: error: parse error before `break'
nsHttpGssapiAuth.cpp:208: error: `minstat' was not declared in this scope
nsHttpGssapiAuth.cpp:208: error: `mech_set' was not declared in this scope
nsHttpGssapiAuth.cpp:208: error: ISO C++ forbids declaration of `
gss_release_oid_set' with no type
nsHttpGssapiAuth.cpp:208: error: initializer list being treated as compound
expression
nsHttpGssapiAuth.cpp:209: error: parse error before `}' token
nsHttpGssapiAuth.cpp: In member function `void
nsGssapiContinuationState::Reset()':
nsHttpGssapiAuth.cpp:214: error: `GSS_C_NO_CONTEXT' undeclared (first use this
function)
nsHttpGssapiAuth.cpp:215: error: `OM_uint32' undeclared (first use this
function)
nsHttpGssapiAuth.cpp:215: error: parse error before `;' token
nsHttpGssapiAuth.cpp:216: error: `minor_status' undeclared (first use this
function)
nsHttpGssapiAuth.cpp:216: error: `GSS_C_NO_BUFFER' undeclared (first use this
function)
nsHttpGssapiAuth.cpp:216: error: `gss_delete_sec_context' undeclared (first use
this function)
nsHttpGssapiAuth.cpp: In member function `virtual nsresult
nsHttpGssapiAuth::GenerateCredentials(nsIHttpChannel*, const char*, int,
const PRUnichar*, const PRUnichar*, const PRUnichar*, nsISupports**,
nsISupports**, char**)':
nsHttpGssapiAuth.cpp:313: error: `OM_uint32' undeclared (first use this
function)
nsHttpGssapiAuth.cpp:313: error: parse error before `,' token
nsHttpGssapiAuth.cpp:315: error: `gss_buffer_desc' undeclared (first use this
function)
nsHttpGssapiAuth.cpp:317: error: `gss_buffer_t' undeclared (first use this
function)
nsHttpGssapiAuth.cpp:318: error: `gss_name_t' undeclared (first use this
function)
nsHttpGssapiAuth.cpp:340: error: `req_flags' undeclared (first use this
function)
nsHttpGssapiAuth.cpp:340: error: `GSS_C_DELEG_FLAG' undeclared (first use this
function)
nsHttpGssapiAuth.cpp:361: error: `input_token' undeclared (first use this
function)
nsHttpGssapiAuth.cpp:364: error: `major_status' undeclared (first use this
function)
nsHttpGssapiAuth.cpp:369: error: `gss_nt_service_name' undeclared (first use
this function)
nsHttpGssapiAuth.cpp:371: error: `server' undeclared (first use this function)
nsHttpGssapiAuth.cpp:371: error: `gss_import_name' undeclared (first use this
function)
nsHttpGssapiAuth.cpp:374: error: `GSS_ERROR' undeclared (first use this
function)
nsHttpGssapiAuth.cpp:407: error: `in_token_ptr' undeclared (first use this
function)
nsHttpGssapiAuth.cpp:419: error: `GSS_C_NO_CREDENTIAL' undeclared (first use
this function)
nsHttpGssapiAuth.cpp:420: error: 'class nsGssapiContinuationState' has no
member named 'mCtx'
nsHttpGssapiAuth.cpp:422: error: `GetOID' undeclared (first use this function)
nsHttpGssapiAuth.cpp:424: error: `GSS_C_INDEFINITE' undeclared (first use this
function)
nsHttpGssapiAuth.cpp:425: error: `GSS_C_NO_CHANNEL_BINDINGS' undeclared (first
use this function)
nsHttpGssapiAuth.cpp:428: error: `output_token' undeclared (first use this
function)
nsHttpGssapiAuth.cpp:430: error: `gss_init_sec_context' undeclared (first use
this function)
nsHttpGssapiAuth.cpp:434: error: `gss_release_name' undeclared (first use this
function)
nsHttpGssapiAuth.cpp:437: error: `gss_release_buffer' undeclared (first use
this function)
nsHttpGssapiAuth.cpp:440: error: `GSS_S_COMPLETE' undeclared (first use this
function)
nsHttpGssapiAuth.cpp:446: error: `GSS_S_CONTINUE_NEEDED' undeclared (first use
this function)
{standard input}: Assembler messages:
{standard input}:33: Error: symbol `mech_oid' is already defined
gmake[3]: *** [nsHttpGssapiAuth.o] Error 1
gmake[3]: Leaving directory `/var/tmp/portage/mozilla-firefox-0.9.2/work/mozilla/extensions/negotiateauth'
gmake[2]: *** [libs] Error 2
gmake[2]: Leaving directory `/var/tmp/portage/mozilla-firefox-0.9.2/work/mozilla/extensions'
gmake[1]: *** [tier_94] Error 2
gmake[1]: Leaving directory `/var/tmp/portage/mozilla-firefox-0.9.2/work/mozilla'
make: *** [default] Error 2

!!! ERROR: net-www/mozilla-firefox-0.9.2 failed.
!!! Function src_compile, Line 201, Exitcode 2
!!! (no error message)


sempre o mesmo erro, das versões 0.9 para cima é sempre isto.

por acaso não há nehuma forma de limpar tudo o que é mozilla do sistema ?

Com as versoes 0.8 compilo sem problemas !!!
;(
_________________
Best Regards,
Sérgio Henrique
Linux dune 3.0.6-gentoo #1 SMP Thu Oct 27 16:47:29 WEST 2011 x86_64 Intel(R) Core(TM)2 Duo CPU T7500 @ 2.20GHz GenuineIntel GNU/Linux
Back to top
View user's profile Send private message
codemaker
Guru
Guru


Joined: 03 Jun 2004
Posts: 398
Location: Lisboa, Portugal

PostPosted: Thu Jul 15, 2004 1:45 am    Post subject: Reply with quote

Não faço a mínima ideia do que fazer quando um emerge falha e tenho alguns que não consigo pôr a funcionar. Queria ver se agora nas férias conseguia ler umas coisas sobre isso. :?
Back to top
View user's profile Send private message
Mythos
l33t
l33t


Joined: 02 May 2004
Posts: 953
Location: Portugal

PostPosted: Thu Jul 15, 2004 2:07 am    Post subject: Reply with quote

Esta porcaria está me a dor a volta à cabeça !!! Amanhã faço a ultima tentativa ponha a compilar por dcc na outra máquia só !
_________________
Best Regards,
Sérgio Henrique
Linux dune 3.0.6-gentoo #1 SMP Thu Oct 27 16:47:29 WEST 2011 x86_64 Intel(R) Core(TM)2 Duo CPU T7500 @ 2.20GHz GenuineIntel GNU/Linux
Back to top
View user's profile Send private message
fernandotcl
Veteran
Veteran


Joined: 20 Nov 2003
Posts: 1396
Location: Sao Paulo, Brazil

PostPosted: Thu Jul 15, 2004 4:10 am    Post subject: Reply with quote

Você pode fazer um pacote na máquina que compila e instalar na outra, em último caso.
Back to top
View user's profile Send private message
Mythos
l33t
l33t


Joined: 02 May 2004
Posts: 953
Location: Portugal

PostPosted: Fri Jul 16, 2004 2:52 pm    Post subject: Isto está quase ... Reply with quote

gmake[3]: Entering directory `/var/tmp/portage/mozilla-firefox-0.9.1/work/mozilla/extensions/negotiateauth'

bom ontem editei o ebuild e pus disable extention. E consegui passar mais à frente o problema é que depois ele termina a compilação por falta de um pacote.

Portanto o meu erro está nas extentions. O problema é que se meto disable ele vai bsucar pacotes da extentions e termina ...

extensions/negotiateauth como é que desactivo isto ?
--enable-extensions=default,-negotiateauth, -irc,-venkman,-content-packs,-help"

ou adiciona no ebuild

--disable-extentions=negotiateauth ?

ou será que isto necessita do ipv6 ????

já tentei com use -ipv6 ipv4 e não deu ...
_________________
Best Regards,
Sérgio Henrique
Linux dune 3.0.6-gentoo #1 SMP Thu Oct 27 16:47:29 WEST 2011 x86_64 Intel(R) Core(TM)2 Duo CPU T7500 @ 2.20GHz GenuineIntel GNU/Linux
Back to top
View user's profile Send private message
fernandotcl
Veteran
Veteran


Joined: 20 Nov 2003
Posts: 1396
Location: Sao Paulo, Brazil

PostPosted: Fri Jul 16, 2004 4:06 pm    Post subject: Reply with quote

Você precisa ver se essa opção é suportada. Pode ir no /usr/portage/distfiles e copiar o pacote do Firefox pra sua home. Depois, extraia o arquivo e rode "./configure --help | grep -i extensions" pra ver as opções relativas à extensões. Se tiver --disable-extensions, basta retirar a linha do --enable-extensions=... e colocar --disable-extensions no lugar. Se não tiver essa, você pode tentar colocar --enable-extensions=, ou seja, tirar tudo depois do "=", mas isso pode não funcionar. O próprio configure pode te dar umas dicas.

Em todo caso, você ainda tem a possibilidade de compilar numa máquina um pacote pra essa.


EDIT: Eu vi a resolução do seu problema com o Mono, a outra máquina não está também com hardened-sources?
Back to top
View user's profile Send private message
Mythos
l33t
l33t


Joined: 02 May 2004
Posts: 953
Location: Portugal

PostPosted: Fri Jul 16, 2004 5:43 pm    Post subject: Reply with quote

Nope esta máquina está com o gento-dev-sources-2.6.7-r9, tentei o truque mas não deu ;( para o firefox ...

eu fiz o --disable-extentions e deu resultado só que depois um bocado mais à frente dá um erro de pacote não encontrado, existe algo no extention que é utilizado mais tarde ...

deve haver uma reutilização qualquer de parte de código, mas nisso não sou muito bom para ver, mas estou perto, com o disable passou o erro primário até dar a falta de um pacote!
_________________
Best Regards,
Sérgio Henrique
Linux dune 3.0.6-gentoo #1 SMP Thu Oct 27 16:47:29 WEST 2011 x86_64 Intel(R) Core(TM)2 Duo CPU T7500 @ 2.20GHz GenuineIntel GNU/Linux
Back to top
View user's profile Send private message
Mythos
l33t
l33t


Joined: 02 May 2004
Posts: 953
Location: Portugal

PostPosted: Sat Jul 24, 2004 1:56 pm    Post subject: Reply with quote

Fixed, tive que formatar o disco, instalei o firefox ~x86 de raiz e tudo funcionou bem :) tenho a certeza que o problrma se devia aos antigos extentions da versão 0.8
_________________
Best Regards,
Sérgio Henrique
Linux dune 3.0.6-gentoo #1 SMP Thu Oct 27 16:47:29 WEST 2011 x86_64 Intel(R) Core(TM)2 Duo CPU T7500 @ 2.20GHz GenuineIntel GNU/Linux
Back to top
View user's profile Send private message
Display posts from previous:   
Reply to topic    Gentoo Forums Forum Index Portuguese All times are GMT
Page 1 of 1

 
Jump to:  
You cannot post new topics in this forum
You cannot reply to topics in this forum
You cannot edit your posts in this forum
You cannot delete your posts in this forum
You cannot vote in polls in this forum