Gentoo Forums
Gentoo Forums
Gentoo Forums
Quick Search: in
2.6.6_rc3-love4 aka "Reboot Time"
View unanswered posts
View posts from last 24 hours

Goto page 1, 2, 3, 4  Next  
Reply to topic    Gentoo Forums Forum Index Unsupported Software
View previous topic :: View next topic  
Author Message
steel300
Veteran
Veteran


Joined: 10 Jul 2003
Posts: 1155

PostPosted: Wed May 05, 2004 7:11 pm    Post subject: 2.6.6_rc3-love4 aka "Reboot Time" Reply with quote

Hey all, I'm back for this release. We'll see if I still have the skill to do it. I got win4lin and supermoiunt back in. Bootsplash should be working. So should everyone's nvidia drivers.

Code:

Patch Name:                     Description:
2.6.6-rc3-mm2                   Latest mm
BadRAM-2.6.5.2                  BadRam Workaround
Kernel-Win4Lin3-2.6.5           Win4Lin Core
acerhk                          Acer HotKeys
acpi-dsdt-initrd-patch          Custom DSDT Table
acx100-0.2.0pre7-linux2.6.2     ACX100 Drivers
bd-claim                        EVMS Deal
bootsplash-3.1.4-2.6.6-rc3      Bootsplash Support
config-nr-tty-devices           User Configrable tty
config_hz                       Internal Timer Frequency
force-config_regparm-to-y       Stupid Nvidia
iteraid_1.44.patch              GigaRaid Support
layer7-kernelpatch-nf-0.4.0     Layer 7 Packet Classifier
linux-2.6.4-Walken              Walken Boot Logo
lirc-2.6.4-20040318             LIRC Support
love_ppm.patch                  Love Boot Logo
lufs-0.9.7-2.6.0-test9          LUFS Support
make-4k-stacks-permanent        Stupid Nvidia
menuconfig-NAME-v1.0            Do Something with NAME
mki-adapter26_1_3_4             Win4Lin Drivers
move-__this_module-to-modpost   Stupid Nvidia
orinoco-0.13e-patch             Monitor Mode
packet-2.6.5.patch              UDF Packet Writing
patch-2.4.x-vesafb-rrc          VESAFB Hack
patch-2.6.4-amd76x_pm           AMD Power NOW!
patch-2.6.6-rc3                 Latest PrePatch
populate-rootfs-later           Stupid Bootsplash
sii-3512-update                 Siimage updates
squashfs1.3r3-patch             Squashfs
supermount-2.0.4-2.6.5-love1    Supermount
v30e                            Nick's Scheduler
via-v4l-1.4a-drm                EPIA DRM
viafb_02                        EPIA FB
vm-rollup                       Nick's VM Work
[quote]

http://www.public.iastate.edu/~jpcox[/quote]

_________________
Rationality is the recognition of the fact that nothing can alter the truth and nothing can take precedence over that act of perceiving it.
Back to top
View user's profile Send private message
nonotme
Guru
Guru


Joined: 29 Sep 2003
Posts: 356
Location: on.ca

PostPosted: Wed May 05, 2004 7:15 pm    Post subject: Reply with quote

i'll give it a spin this evening...
_________________
Please append [Solved] to your thread if appropriate, it helps everyone.
Back to top
View user's profile Send private message
eldiablo
Tux's lil' helper
Tux's lil' helper


Joined: 20 Sep 2003
Posts: 136
Location: Halsa(Where keiko lived his last days), Norway

PostPosted: Wed May 05, 2004 7:23 pm    Post subject: Reply with quote

I hope the problem with the framebuffer is fixed here.
So i can use my console again =)
_________________
Always running the most experimental
Back to top
View user's profile Send private message
MadEgg
l33t
l33t


Joined: 06 Jun 2002
Posts: 678
Location: Netherlands

PostPosted: Wed May 05, 2004 7:28 pm    Post subject: Reply with quote

Compiling it right away...
_________________
Pentium 4 Prescott 3,2 GHz
Asus P4P800 SE, i865PE chipset
1024 MB PC3200 RAM
AOpen Aeolus GeForce 6800 Ultra 256 MB DDR2
Creative Audigy2 ZS
gentoo-sources-2.6.20-r7
nVidia-drivers version 9755
Back to top
View user's profile Send private message
kevmille
Guru
Guru


Joined: 26 Jul 2003
Posts: 311
Location: Ho Chi Minh City (Saigon), Vietnam

PostPosted: Wed May 05, 2004 7:33 pm    Post subject: Reply with quote

This error just popped up while I was emerging:

Code:
bash-2.05b# emerge love-sources-2.6.6_rc3-r4.ebuild
Calculating dependencies ...done!
>>> emerge (1 of 1) sys-kernel/love-sources-2.6.6_rc3-r4 to /
>>> md5 src_uri ;-) patch-2.6.6-rc3.bz2
>>> md5 src_uri ;-) linux-2.6.5.tar.bz2
>>> md5 src_uri ;-) 2.6.6-rc3-mm2.bz2
>>> md5 src_uri ;-) 2.6.6-rc3-love4.bz2
>>> Preparing to unpack...
>>> Unpacking source...
>>> Unpacking linux-2.6.5.tar.bz2 to /var/tmp/portage/love-sources-2.6.6_rc3-r4                                        /work
 * Applying patch-2.6.6-rc3.patch...                                     [ ok ]
 * Applying 2.6.6-rc3-mm2.patch...
patch: pch.c:614: intuit_diff_type: Assertion `i0 != NONE' failed.
patch: pch.c:614: intuit_diff_type: Assertion `i0 != NONE' failed.       [ !! ]

 * Please attach /var/tmp/portage/love-sources-2.6.6_rc3-r4/temp/2.6.6-rc3-mm2.                                        err to any bug you may post.

!!! ERROR: sys-kernel/love-sources-2.6.6_rc3-r4 failed.
!!! Function unipatch, Line 485, Exitcode 0
!!! Unable to dry-run patch.

_________________
My Company: Hakata Consulting
Back to top
View user's profile Send private message
_Adik_
Apprentice
Apprentice


Joined: 09 Jan 2004
Posts: 205
Location: Katowice, Poland

PostPosted: Wed May 05, 2004 7:36 pm    Post subject: Reply with quote

downloading it now...
tnx steel300, you are great :)

EDIT:" I dont see dxr3 in changelog, is it still there?
_________________
No linux, no fun...


Last edited by _Adik_ on Wed May 05, 2004 7:42 pm; edited 1 time in total
Back to top
View user's profile Send private message
steel300
Veteran
Veteran


Joined: 10 Jul 2003
Posts: 1155

PostPosted: Wed May 05, 2004 7:42 pm    Post subject: Reply with quote

kevmille wrote:
This error just popped up while I was emerging:

Code:
bash-2.05b# emerge love-sources-2.6.6_rc3-r4.ebuild
Calculating dependencies ...done!
>>> emerge (1 of 1) sys-kernel/love-sources-2.6.6_rc3-r4 to /
>>> md5 src_uri ;-) patch-2.6.6-rc3.bz2
>>> md5 src_uri ;-) linux-2.6.5.tar.bz2
>>> md5 src_uri ;-) 2.6.6-rc3-mm2.bz2
>>> md5 src_uri ;-) 2.6.6-rc3-love4.bz2
>>> Preparing to unpack...
>>> Unpacking source...
>>> Unpacking linux-2.6.5.tar.bz2 to /var/tmp/portage/love-sources-2.6.6_rc3-r4                                        /work
 * Applying patch-2.6.6-rc3.patch...                                     [ ok ]
 * Applying 2.6.6-rc3-mm2.patch...
patch: pch.c:614: intuit_diff_type: Assertion `i0 != NONE' failed.
patch: pch.c:614: intuit_diff_type: Assertion `i0 != NONE' failed.       [ !! ]

 * Please attach /var/tmp/portage/love-sources-2.6.6_rc3-r4/temp/2.6.6-rc3-mm2.                                        err to any bug you may post.

!!! ERROR: sys-kernel/love-sources-2.6.6_rc3-r4 failed.
!!! Function unipatch, Line 485, Exitcode 0
!!! Unable to dry-run patch.


Boot into a gentoo livecd, then chroot over and emerge it again.
_________________
Rationality is the recognition of the fact that nothing can alter the truth and nothing can take precedence over that act of perceiving it.
Back to top
View user's profile Send private message
MadEgg
l33t
l33t


Joined: 06 Jun 2002
Posts: 678
Location: Netherlands

PostPosted: Wed May 05, 2004 8:10 pm    Post subject: Reply with quote

Bootsplash still doesn't work for me but I'm starting to doubt myself, I'll review all my files and settings tomorrow and see if I can get it to work after all. Maybe I screwed something up.

Should have a working bootsplash-entry in GRUB left tho, something like 2.6.3-love4. Let you know later how it goes.
_________________
Pentium 4 Prescott 3,2 GHz
Asus P4P800 SE, i865PE chipset
1024 MB PC3200 RAM
AOpen Aeolus GeForce 6800 Ultra 256 MB DDR2
Creative Audigy2 ZS
gentoo-sources-2.6.20-r7
nVidia-drivers version 9755
Back to top
View user's profile Send private message
t_2199
Tux's lil' helper
Tux's lil' helper


Joined: 20 Mar 2004
Posts: 146

PostPosted: Wed May 05, 2004 9:27 pm    Post subject: Reply with quote

Why is supermount back in ?

I just thought submount is the future!
Back to top
View user's profile Send private message
PrakashP
Veteran
Veteran


Joined: 27 Oct 2003
Posts: 1246
Location: C.C.A.A., Germania

PostPosted: Wed May 05, 2004 9:27 pm    Post subject: Reply with quote

Ahhh, finally a kernel, which I needed not to touch. :) Booted up nicely, let's see whether it survives the night...
Back to top
View user's profile Send private message
pixie
Guru
Guru


Joined: 29 Dec 2002
Posts: 305

PostPosted: Wed May 05, 2004 9:39 pm    Post subject: Reply with quote

got an odd bootsplash issue here.

It only gives me an 80x24 text area in one corner of my 1024x768 screen....

I've tried recompiling bootsplash and making a new initrd but still the same prob. In non-bootsplash framebuffer I get to use the whole screen though.
Back to top
View user's profile Send private message
pixie
Guru
Guru


Joined: 29 Dec 2002
Posts: 305

PostPosted: Wed May 05, 2004 9:40 pm    Post subject: Reply with quote

Oh, and I also have the hfsplus module problem back again. Something about PageActive.

Thats not much of an issue as I don't use my iPod or LaCie firewire drive on the PC very often though.
Back to top
View user's profile Send private message
Evil Dark Archon
Guru
Guru


Joined: 21 Dec 2002
Posts: 562
Location: Santa Rosa, CA

PostPosted: Wed May 05, 2004 10:37 pm    Post subject: Reply with quote

i get the same thing and it give a warning about an implicit decleration of PageActive, and it affects both hfs and hfsplus, and only in love3 and love4 (the only to love versions that i've used recently)
_________________
This post has been over explained for newb-informing purposes.

Registered Linux user 347334
Abit AV8-3rd eye, AMD Athlon64 3500+ 90nm, ATI Radeon x850 pro
Back to top
View user's profile Send private message
Jayz
n00b
n00b


Joined: 07 Mar 2004
Posts: 29
Location: canada

PostPosted: Wed May 05, 2004 11:31 pm    Post subject: Reply with quote

got an error when compiling fs/nls

Code:

fs/nls/nls_cp949.c:6235:36: warning: null character(s) ignored
fs/nls/nls_cp949.c:6235: error: syntax error before "BF"
fs/nls/nls_cp949.c:6242: warning: excess elements in array initializer
fs/nls/nls_cp949.c:6242: warning: (near initialization for `u2c_5C')
fs/nls/nls_cp949.c:6242: warning: excess elements in array initializer
fs/nls/nls_cp949.c:6242: warning: (near initialization for `u2c_5C')
fs/nls/nls_cp949.c:6242: warning: excess elements in array initializer
fs/nls/nls_cp949.c:6242: warning: (near initialization for `u2c_5C')
fs/nls/nls_cp949.c:6242: warning: excess elements in array initializer
fs/nls/nls_cp949.c:6242: warning: (near initialization for `u2c_5C')
fs/nls/nls_cp949.c:6243: warning: excess elements in array initializer
fs/nls/nls_cp949.c:6243: warning: (near initialization for `u2c_5C')
fs/nls/nls_cp949.c:6243: warning: excess elements in array initializer
fs/nls/nls_cp949.c:6243: warning: (near initialization for `u2c_5C')
fs/nls/nls_cp949.c:6243: warning: excess elements in array initializer
fs/nls/nls_cp949.c:6243: warning: (near initialization for `u2c_5C')
fs/nls/nls_cp949.c:6243: warning: excess elements in array initializer
fs/nls/nls_cp949.c:6243: warning: (near initialization for `u2c_5C')
fs/nls/nls_cp949.c:6243: warning: excess elements in array initializer
fs/nls/nls_cp949.c:6243: warning: (near initialization for `u2c_5C')
fs/nls/nls_cp949.c:6243: warning: excess elements in array initializer
fs/nls/nls_cp949.c:6243: warning: (near initialization for `u2c_5C')
fs/nls/nls_cp949.c:6243: warning: excess elements in array initializer
fs/nls/nls_cp949.c:6243: warning: (near initialization for `u2c_5C')
fs/nls/nls_cp949.c:6243: warning: excess elements in array initializer
fs/nls/nls_cp949.c:6243: warning: (near initialization for `u2c_5C')
fs/nls/nls_cp949.c:6244: warning: excess elements in array initializer
fs/nls/nls_cp949.c:6244: warning: (near initialization for `u2c_5C')
fs/nls/nls_cp949.c:6244: warning: excess elements in array initializer
fs/nls/nls_cp949.c:6244: warning: (near initialization for `u2c_5C')
fs/nls/nls_cp949.c:6244: warning: excess elements in array initializer
fs/nls/nls_cp949.c:6244: warning: (near initialization for `u2c_5C')
fs/nls/nls_cp949.c:6244: warning: excess elements in array initializer
fs/nls/nls_cp949.c:6244: warning: (near initialization for `u2c_5C')
fs/nls/nls_cp949.c:6244: warning: excess elements in array initializer
fs/nls/nls_cp949.c:6244: warning: (near initialization for `u2c_5C')
fs/nls/nls_cp949.c:6244: warning: excess elements in array initializer
fs/nls/nls_cp949.c:6244: warning: (near initialization for `u2c_5C')
fs/nls/nls_cp949.c:6244: warning: excess elements in array initializer
fs/nls/nls_cp949.c:6244: warning: (near initialization for `u2c_5C')
fs/nls/nls_cp949.c:6244: warning: excess elements in array initializer
fs/nls/nls_cp949.c:6244: warning: (near initialization for `u2c_5C')
fs/nls/nls_cp949.c:6245: warning: excess elements in array initializer
fs/nls/nls_cp949.c:6245: warning: (near initialization for `u2c_5C')
fs/nls/nls_cp949.c:6245: warning: excess elements in array initializer
fs/nls/nls_cp949.c:6245: warning: (near initialization for `u2c_5C')
fs/nls/nls_cp949.c:6245: warning: excess elements in array initializer
fs/nls/nls_cp949.c:6245: warning: (near initialization for `u2c_5C')
fs/nls/nls_cp949.c:6245: warning: excess elements in array initializer
fs/nls/nls_cp949.c:6245: warning: (near initialization for `u2c_5C')
fs/nls/nls_cp949.c:6245: warning: excess elements in array initializer
fs/nls/nls_cp949.c:6245: warning: (near initialization for `u2c_5C')
fs/nls/nls_cp949.c:6245: warning: excess elements in array initializer
fs/nls/nls_cp949.c:6245: warning: (near initialization for `u2c_5C')
fs/nls/nls_cp949.c:6245: warning: excess elements in array initializer
fs/nls/nls_cp949.c:6245: warning: (near initialization for `u2c_5C')
fs/nls/nls_cp949.c:6245: warning: excess elements in array initializer
fs/nls/nls_cp949.c:6245: warning: (near initialization for `u2c_5C')
fs/nls/nls_cp949.c:6246: warning: excess elements in array initializer
fs/nls/nls_cp949.c:6246: warning: (near initialization for `u2c_5C')
fs/nls/nls_cp949.c:6246: warning: excess elements in array initializer
fs/nls/nls_cp949.c:6246: warning: (near initialization for `u2c_5C')
fs/nls/nls_cp949.c:6246: warning: excess elements in array initializer
fs/nls/nls_cp949.c:6246: warning: (near initialization for `u2c_5C')
fs/nls/nls_cp949.c:6246: warning: excess elements in array initializer
fs/nls/nls_cp949.c:6246: warning: (near initialization for `u2c_5C')
fs/nls/nls_cp949.c:6246: warning: excess elements in array initializer
fs/nls/nls_cp949.c:6246: warning: (near initialization for `u2c_5C')
fs/nls/nls_cp949.c:6246: warning: excess elements in array initializer
fs/nls/nls_cp949.c:6246: warning: (near initialization for `u2c_5C')
fs/nls/nls_cp949.c:6246: warning: excess elements in array initializer
fs/nls/nls_cp949.c:6246: warning: (near initialization for `u2c_5C')
fs/nls/nls_cp949.c:6246: warning: excess elements in array initializer
fs/nls/nls_cp949.c:6246: warning: (near initialization for `u2c_5C')
fs/nls/nls_cp949.c:6247: warning: excess elements in array initializer
fs/nls/nls_cp949.c:6247: warning: (near initialization for `u2c_5C')
fs/nls/nls_cp949.c:6247: warning: excess elements in array initializer
fs/nls/nls_cp949.c:6247: warning: (near initialization for `u2c_5C')
fs/nls/nls_cp949.c:6247: warning: excess elements in array initializer
fs/nls/nls_cp949.c:6247: warning: (near initialization for `u2c_5C')
fs/nls/nls_cp949.c:6247: warning: excess elements in array initializer
fs/nls/nls_cp949.c:6247: warning: (near initialization for `u2c_5C')
fs/nls/nls_cp949.c:6247: warning: excess elements in array initializer
fs/nls/nls_cp949.c:6247: warning: (near initialization for `u2c_5C')
fs/nls/nls_cp949.c:6247: warning: excess elements in array initializer
fs/nls/nls_cp949.c:6247: warning: (near initialization for `u2c_5C')
fs/nls/nls_cp949.c:6247: warning: excess elements in array initializer
fs/nls/nls_cp949.c:6247: warning: (near initialization for `u2c_5C')
fs/nls/nls_cp949.c:6247: warning: excess elements in array initializer
fs/nls/nls_cp949.c:6247: warning: (near initialization for `u2c_5C')
fs/nls/nls_cp949.c:6248: warning: excess elements in array initializer
fs/nls/nls_cp949.c:6248: warning: (near initialization for `u2c_5C')
fs/nls/nls_cp949.c:6248: warning: excess elements in array initializer
fs/nls/nls_cp949.c:6248: warning: (near initialization for `u2c_5C')
fs/nls/nls_cp949.c:6248: warning: excess elements in array initializer
fs/nls/nls_cp949.c:6248: warning: (near initialization for `u2c_5C')
fs/nls/nls_cp949.c:6248: warning: excess elements in array initializer
fs/nls/nls_cp949.c:6248: warning: (near initialization for `u2c_5C')
fs/nls/nls_cp949.c:6248: warning: excess elements in array initializer
fs/nls/nls_cp949.c:6248: warning: (near initialization for `u2c_5C')
fs/nls/nls_cp949.c:6248: warning: excess elements in array initializer
fs/nls/nls_cp949.c:6248: warning: (near initialization for `u2c_5C')
fs/nls/nls_cp949.c:6248: warning: excess elements in array initializer
fs/nls/nls_cp949.c:6248: warning: (near initialization for `u2c_5C')
fs/nls/nls_cp949.c:6248: warning: excess elements in array initializer
fs/nls/nls_cp949.c:6248: warning: (near initialization for `u2c_5C')
fs/nls/nls_cp949.c:6249: warning: excess elements in array initializer
fs/nls/nls_cp949.c:6249: warning: (near initialization for `u2c_5C')
fs/nls/nls_cp949.c:6249: warning: excess elements in array initializer
fs/nls/nls_cp949.c:6249: warning: (near initialization for `u2c_5C')
fs/nls/nls_cp949.c:6249: warning: excess elements in array initializer
fs/nls/nls_cp949.c:6249: warning: (near initialization for `u2c_5C')
fs/nls/nls_cp949.c:6249: warning: excess elements in array initializer
fs/nls/nls_cp949.c:6249: warning: (near initialization for `u2c_5C')
fs/nls/nls_cp949.c:6249: warning: excess elements in array initializer
fs/nls/nls_cp949.c:6249: warning: (near initialization for `u2c_5C')
fs/nls/nls_cp949.c:6249: warning: excess elements in array initializer
fs/nls/nls_cp949.c:6249: warning: (near initialization for `u2c_5C')
fs/nls/nls_cp949.c:6249: warning: excess elements in array initializer
fs/nls/nls_cp949.c:6249: warning: (near initialization for `u2c_5C')
fs/nls/nls_cp949.c:6249: warning: excess elements in array initializer
fs/nls/nls_cp949.c:6249: warning: (near initialization for `u2c_5C')
fs/nls/nls_cp949.c:6250: warning: excess elements in array initializer
fs/nls/nls_cp949.c:6250: warning: (near initialization for `u2c_5C')
fs/nls/nls_cp949.c:6250: warning: excess elements in array initializer
fs/nls/nls_cp949.c:6250: warning: (near initialization for `u2c_5C')
fs/nls/nls_cp949.c:6250: warning: excess elements in array initializer
fs/nls/nls_cp949.c:6250: warning: (near initialization for `u2c_5C')
fs/nls/nls_cp949.c:6250: warning: excess elements in array initializer
fs/nls/nls_cp949.c:6250: warning: (near initialization for `u2c_5C')
fs/nls/nls_cp949.c:6250: warning: excess elements in array initializer
fs/nls/nls_cp949.c:6250: warning: (near initialization for `u2c_5C')
fs/nls/nls_cp949.c:6250: warning: excess elements in array initializer
fs/nls/nls_cp949.c:6250: warning: (near initialization for `u2c_5C')
fs/nls/nls_cp949.c:6250: warning: excess elements in array initializer
fs/nls/nls_cp949.c:6250: warning: (near initialization for `u2c_5C')
fs/nls/nls_cp949.c:6250: warning: excess elements in array initializer
fs/nls/nls_cp949.c:6250: warning: (near initialization for `u2c_5C')
fs/nls/nls_cp949.c:6251: warning: excess elements in array initializer
fs/nls/nls_cp949.c:6251: warning: (near initialization for `u2c_5C')
fs/nls/nls_cp949.c:6251: warning: excess elements in array initializer
fs/nls/nls_cp949.c:6251: warning: (near initialization for `u2c_5C')
fs/nls/nls_cp949.c:6251: warning: excess elements in array initializer
fs/nls/nls_cp949.c:6251: warning: (near initialization for `u2c_5C')
fs/nls/nls_cp949.c:6251: warning: excess elements in array initializer
fs/nls/nls_cp949.c:6251: warning: (near initialization for `u2c_5C')
fs/nls/nls_cp949.c:6251: warning: excess elements in array initializer
fs/nls/nls_cp949.c:6251: warning: (near initialization for `u2c_5C')
fs/nls/nls_cp949.c:6251: warning: excess elements in array initializer
fs/nls/nls_cp949.c:6251: warning: (near initialization for `u2c_5C')
fs/nls/nls_cp949.c:6251: warning: excess elements in array initializer
fs/nls/nls_cp949.c:6251: warning: (near initialization for `u2c_5C')
fs/nls/nls_cp949.c:6251: warning: excess elements in array initializer
fs/nls/nls_cp949.c:6251: warning: (near initialization for `u2c_5C')
fs/nls/nls_cp949.c:13709: error: `u2c_5D' undeclared here (not in a function)
fs/nls/nls_cp949.c:13709: error: initializer element is not constant
fs/nls/nls_cp949.c:13709: error: (near initialization for `page_uni2charset[93]')
make[2]: *** [fs/nls/nls_cp949.o] Error 1
make[1]: *** [fs/nls] Error 2
make: *** [fs] Error 2


any idea?

edit: I check the source code and found that line 6235 is kinda messed up like this
Code:

        0x00, 0x00, 0x00, 0x00, 0x0^@^@^@^@^@^@^@^@^@^@^@^@^@^@ etc....


edit: I've grab the nls_cp949.c from linux-2.6.5.tar.gz and overwrite it to the messed up source code and it works fine! Now I'm in love4~

Code:

Linux jay 2.6.6-rc3-love4 #1 Wed May 5 20:03:19 GMT 2004 i686 Intel(R) Celeron(R) CPU 1.70GHz GenuineIntel GNU/Linux


Last edited by Jayz on Thu May 06, 2004 2:00 am; edited 1 time in total
Back to top
View user's profile Send private message
Rainmaker
Veteran
Veteran


Joined: 12 Feb 2004
Posts: 1650
Location: /home/NL/ehv/

PostPosted: Wed May 05, 2004 11:46 pm    Post subject: Reply with quote

when will reiser4 be back? Or are we waiting for it to hit the mainstream?

Patchset looks great.
_________________
If you can't dazzle them with brilliance, baffle them with bullshit.
Back to top
View user's profile Send private message
yngwin
Developer
Developer


Joined: 19 Dec 2002
Posts: 4394
Location: Suzhou, China

PostPosted: Wed May 05, 2004 11:51 pm    Post subject: Reply with quote

Rainmaker wrote:
when will reiser4 be back? Or are we waiting for it to hit the mainstream?

Reiser4 will be back when it hits -mm. In the meantime there is lokean-sources.
_________________
"Those who deny freedom to others deserve it not for themselves." - Abraham Lincoln
Free Culture | Defective by Design | EFF
Back to top
View user's profile Send private message
aaearon
n00b
n00b


Joined: 22 Apr 2004
Posts: 4

PostPosted: Thu May 06, 2004 12:26 am    Post subject: Reply with quote

Having the same problem with this version as the last with compiling lirc_atiusb.o module.

Code:
mythtv linux # make
make[1]: `arch/i386/kernel/asm-offsets.s' is up to date.
  CHK     include/linux/compile.h
  CC [M]  drivers/char/lirc/lirc_atiusb.o
drivers/char/lirc/lirc_atiusb.c: In function `usb_remote_probe':
drivers/char/lirc/lirc_atiusb.c:374: error: structure has no member named `act_altsetting'
make[3]: *** [drivers/char/lirc/lirc_atiusb.o] Error 1
make[2]: *** [drivers/char/lirc] Error 2
make[1]: *** [drivers/char] Error 2
make: *** [drivers] Error 2
Back to top
View user's profile Send private message
Gentree
Watchman
Watchman


Joined: 01 Jul 2003
Posts: 5227
Location: France, Old Europe

PostPosted: Thu May 06, 2004 12:28 am    Post subject: Reply with quote

Hey , I'm getting good at this!

My personal challenge is to modifiy all my aliases for configuring , building, copying the new kernel and then updating grub before emerge love-sources finishes.

Me vs AthlonXP at 2.2Gigs and I won. Hey!

Seems like I change my kernel more often than my keks these days.

Anyway straight in update no probs here.:D Good to have you back Steel. Another nice patch set.


Now, are there any guides for setting up nvidia (GeForce4 Ti 4200) + love + xorg?

I just bought the card and would like to set it up without spending the next 3 nights trawling the forums. Have got far yet.

Any useful links appreciated.8)
Back to top
View user's profile Send private message
kevmille
Guru
Guru


Joined: 26 Jul 2003
Posts: 311
Location: Ho Chi Minh City (Saigon), Vietnam

PostPosted: Thu May 06, 2004 12:39 am    Post subject: Reply with quote

steel300 wrote:
kevmille wrote:
This error just popped up while I was emerging:

Code:
bash-2.05b# emerge love-sources-2.6.6_rc3-r4.ebuild
Calculating dependencies ...done!
>>> emerge (1 of 1) sys-kernel/love-sources-2.6.6_rc3-r4 to /
>>> md5 src_uri ;-) patch-2.6.6-rc3.bz2
>>> md5 src_uri ;-) linux-2.6.5.tar.bz2
>>> md5 src_uri ;-) 2.6.6-rc3-mm2.bz2
>>> md5 src_uri ;-) 2.6.6-rc3-love4.bz2
>>> Preparing to unpack...
>>> Unpacking source...
>>> Unpacking linux-2.6.5.tar.bz2 to /var/tmp/portage/love-sources-2.6.6_rc3-r4                                        /work
 * Applying patch-2.6.6-rc3.patch...                                     [ ok ]
 * Applying 2.6.6-rc3-mm2.patch...
patch: pch.c:614: intuit_diff_type: Assertion `i0 != NONE' failed.
patch: pch.c:614: intuit_diff_type: Assertion `i0 != NONE' failed.       [ !! ]

 * Please attach /var/tmp/portage/love-sources-2.6.6_rc3-r4/temp/2.6.6-rc3-mm2.                                        err to any bug you may post.

!!! ERROR: sys-kernel/love-sources-2.6.6_rc3-r4 failed.
!!! Function unipatch, Line 485, Exitcode 0
!!! Unable to dry-run patch.


Boot into a gentoo livecd, then chroot over and emerge it again.


This was weird, all I did was re-emerge the same ebuild and it worked properly. I am compiling right now.
_________________
My Company: Hakata Consulting
Back to top
View user's profile Send private message
pixie
Guru
Guru


Joined: 29 Dec 2002
Posts: 305

PostPosted: Thu May 06, 2004 12:41 am    Post subject: Reply with quote

Random unexplained compile errors can be a sign of bad memory. Probably worth a check.
Back to top
View user's profile Send private message
Gentree
Watchman
Watchman


Joined: 01 Jul 2003
Posts: 5227
Location: France, Old Europe

PostPosted: Thu May 06, 2004 12:47 am    Post subject: Reply with quote

If thats the case I recommend memtest86 followed by burnBX from the cpuburn suite.

This one always picked up the errors first when I was pushing my overclocking.

I was seeing this sort of error on big compilations like kde.

HTH.
Back to top
View user's profile Send private message
blatch
n00b
n00b


Joined: 15 Oct 2002
Posts: 59
Location: bloomington, in

PostPosted: Thu May 06, 2004 1:13 am    Post subject: Reply with quote

emerging now. thanks!
_________________
blatch.net
Back to top
View user's profile Send private message
kevmille
Guru
Guru


Joined: 26 Jul 2003
Posts: 311
Location: Ho Chi Minh City (Saigon), Vietnam

PostPosted: Thu May 06, 2004 1:15 am    Post subject: Reply with quote

Works like charm including bootsplash:

Code:
bash-2.05b# uname -a
Linux romulan 2.6.6-rc3-love4 #1 SMP Wed May 5 17:58:38 PDT 2004 i686 Intel(R) Pentium(R) III Mobile CPU      1000MHz GenuineIntel GNU/Linux

_________________
My Company: Hakata Consulting
Back to top
View user's profile Send private message
nephros
Advocate
Advocate


Joined: 07 Feb 2003
Posts: 2135
Location: Graz, Austria (Europe - no kangaroos.)

PostPosted: Thu May 06, 2004 2:14 am    Post subject: Reply with quote

Good patch, the name sucks though.
_Every_ love release means reboot time!
_________________
Please put [SOLVED] in your topic if you are a moron.
Back to top
View user's profile Send private message
zerojay
Veteran
Veteran


Joined: 09 Aug 2003
Posts: 1033

PostPosted: Thu May 06, 2004 5:35 am    Post subject: Reply with quote

nephros wrote:
Good patch, the name sucks though.
_Every_ love release means reboot time!


*ahem*
kexec anyone?
Back to top
View user's profile Send private message
Display posts from previous:   
Reply to topic    Gentoo Forums Forum Index Unsupported Software All times are GMT
Goto page 1, 2, 3, 4  Next
Page 1 of 4

 
Jump to:  
You cannot post new topics in this forum
You cannot reply to topics in this forum
You cannot edit your posts in this forum
You cannot delete your posts in this forum
You cannot vote in polls in this forum