Gentoo Forums
Gentoo Forums
Gentoo Forums
Quick Search: in
www-client/firefox-60.2.0 failed on x86 [SOLVED]
View unanswered posts
View posts from last 24 hours

 
Reply to topic    Gentoo Forums Forum Index Desktop Environments
View previous topic :: View next topic  
Author Message
Caiman
n00b
n00b


Joined: 01 Jul 2007
Posts: 64

PostPosted: Fri Sep 21, 2018 10:04 am    Post subject: www-client/firefox-60.2.0 failed on x86 [SOLVED] Reply with quote

Code:
* Messages for package www-client/firefox-60.2.0:

 * ERROR: www-client/firefox-60.2.0::gentoo failed (compile phase):
 *   (no error message)
 *
 * Call stack:
 *     ebuild.sh, line 124:  Called src_compile
 *   environment, line 5074:  Called die
 * The specific snippet of code:
 *       MOZ_MAKE_FLAGS="${MAKEOPTS}" SHELL="${SHELL:-${EPREFIX}/bin/bash}" MOZ_NOSPAM=1 ./mach build --verbose || die
 *
 * If you need support, post the output of `emerge --info '=www-client/firefox-60.2.0::gentoo'`,
 * the complete build log and the output of `emerge -pqv '=www-client/firefox-60.2.0::gentoo'`.
 * The complete build log is located at '/var/tmp/portage/www-client/firefox-60.2.0/temp/build.log'.
 * The ebuild environment file is located at '/var/tmp/portage/www-client/firefox-60.2.0/temp/environment'.
 * Working directory: '/var/tmp/portage/www-client/firefox-60.2.0/work/firefox-60.2.0'
 * S: '/var/tmp/portage/www-client/firefox-60.2.0/work/firefox-60.2.0'

120:26.83    Compiling error-chain v0.11.0
121:31.71 error: linking with `/var/tmp/portage/www-client/firefox-60.2.0/work/firefox-60.2.0/build/cargo-linker` failed: exit code: 1
121:31.73   = note: /usr/lib/gcc/i686-pc-linux-gnu/7.3.0/../../../../i686-pc-linux-gnu/bin/ld: internal error /var/tmp/portage/sys-devel/binutils-2.30-r2/work/binutils-2.30/ld/ldlang.c 6635
121:31.74           collect2: error: ld returned 1 exit status
121:31.76 error: aborting due to previous error
121:32.06 error: Could not compile `cose`.
122:26.95 error: build failed
 *   (no error message)


[Moderator edit: added [code] tags to preserve output layout. -Hu]


Last edited by Caiman on Sun Oct 28, 2018 10:22 am; edited 1 time in total
Back to top
View user's profile Send private message
Caiman
n00b
n00b


Joined: 01 Jul 2007
Posts: 64

PostPosted: Sun Sep 23, 2018 8:07 pm    Post subject: Reply with quote

emerge --info '=www-client/firefox-60.2.0::gentoo
> '
Code:
Portage 2.3.49 (python 3.6.5-final-0, default/linux/x86/17.0/desktop/plasma/systemd, gcc-7.3.0, glibc-2.26-r7, 4.14.65-gentoo i686)
=================================================================
                         System Settings
=================================================================
System uname: Linux-4.14.65-gentoo-i686-Intel-R-_Atom-TM-_CPU_N2600_@_1.60GHz-with-gentoo-2.4.1
KiB Mem:     1018888 total,     25920 free
KiB Swap:    4194300 total,   4149500 free
Timestamp of repository gentoo: Sun, 23 Sep 2018 06:00:01 +0000
Head commit of repository gentoo: 80b12a6c5979cdfbaa64ecdceb412eaf988ede78
sh bash 4.4_p12
ld GNU ld (Gentoo 2.30 p2) 2.30.0
app-shells/bash:          4.4_p12::gentoo
dev-lang/perl:            5.24.3-r1::gentoo
dev-lang/python:          2.7.15::gentoo, 3.6.5::gentoo
dev-util/cmake:           3.9.6::gentoo
dev-util/pkgconfig:       0.29.2::gentoo
sys-apps/baselayout:      2.4.1-r2::gentoo
sys-apps/sandbox:         2.13::gentoo
sys-devel/autoconf:       2.13::gentoo, 2.69-r4::gentoo
sys-devel/automake:       1.15.1-r2::gentoo
sys-devel/binutils:       2.30-r2::gentoo
sys-devel/gcc:            7.3.0-r3::gentoo
sys-devel/gcc-config:     1.8-r1::gentoo
sys-devel/libtool:        2.4.6-r3::gentoo
sys-devel/make:           4.2.1-r4::gentoo
sys-kernel/linux-headers: 4.13::gentoo (virtual/os-headers)
sys-libs/glibc:           2.26-r7::gentoo
Repositories:

gentoo
    location: /usr/portage
    sync-type: rsync
    sync-uri: rsync://rsync.net.com/gentoo-portage
    priority: -1000
    sync-rsync-verify-max-age: 24
    sync-rsync-verify-metamanifest: yes
    sync-rsync-extra-opts:
    sync-rsync-verify-jobs: 1

ACCEPT_KEYWORDS="x86"
ACCEPT_LICENSE="* -@EULA"
CBUILD="i686-pc-linux-gnu"
CFLAGS="-O2 -march=i686 -pipe"
CHOST="i686-pc-linux-gnu"
CONFIG_PROTECT="/etc /usr/share/config /usr/share/gnupg/qualified.txt"
CONFIG_PROTECT_MASK="/etc/ca-certificates.conf /etc/dconf /etc/env.d /etc/fonts/fonts.conf /etc/gconf /etc/gentoo-release /etc/revdep-rebuild /etc/sandbox.d /etc/terminfo"
CXXFLAGS="-O2 -march=i686 -pipe"
DISTDIR="/usr/portage/distfiles"
EMERGE_DEFAULT_OPTS="--jobs=1  --load-average=4"
ENV_UNSET="DBUS_SESSION_BUS_ADDRESS DISPLAY PERL5LIB PERL5OPT PERLPREFIX PERL_CORE PERL_MB_OPT PERL_MM_OPT XAUTHORITY XDG_CACHE_HOME XDG_CONFIG_HOME XDG_DATA_HOME XDG_RUNTIME_DIR"
FCFLAGS="-O2 -march=i686 -pipe"
FEATURES="assume-digests binpkg-logs config-protect-if-modified distlocks ebuild-locks fixlafiles merge-sync multilib-strict news parallel-fetch preserve-libs protect-owned sandbox sfperms strict unknown-features-warn unmerge-logs unmerge-orphans userfetch userpriv usersandbox usersync xattr"
FFLAGS="-O2 -march=i686 -pipe"
GENTOO_MIRRORS="http://distfiles.gentoo.org"
LANG="en_US.utf8"
LDFLAGS="-Wl,-O1 -Wl,--as-needed"
MAKEOPTS="-j1"
PKGDIR="/usr/portage/packages"
PORTAGE_CONFIGROOT="/"
PORTAGE_RSYNC_OPTS="--recursive --links --safe-links --perms --times --omit-dir-times --compress --force --whole-file --delete --stats --human-readable --timeout=180 --exclude=/distfiles --exclude=/local --exclude=/packages --exclude=/.git"
PORTAGE_TMPDIR="/var/tmp"
USE="X a52 aac aacs acl acpi activities alsa berkdb bidi bluetooth branding bzip2 cairo cdda cdio cdr cli crypt cryptsetup cups cxx dbus declarative device-mapper dri dts dvd dvdr emboss encode exif fam ffmpeg flac fortran gdbm gif glamor gnutls gpm gtk harfbuzz iconv ipv6 jpeg kde kipi kwallet lcms ldap libnotify libtirpc live lua mad matroska mng modules mp3 mp4 mpeg ncurses nls nptl ogg opengl openh264 openmp opus pam pango pcre pdf phonon plasma png policykit ppds pulseaudio qml qt5 readline savedconfig sddm sdl seccomp semantic-desktop spell ssl startup-notification svg svga symlink systemd tcpd theora tiff tls truetype udev udisks unicode upower usb user-session vcd vlm vorbis vpx widgets wxwidgets x264 x86 xattr xcb xcomposite xml xv xvid zlib" ABI_X86="32" ALSA_CARDS="ali5451 als4000 atiixp atiixp-modem bt87x ca0106 cmipci emu10k1 emu10k1x ens1370 ens1371 es1938 es1968 fm801 hda-intel intel8x0 intel8x0m maestro3 trident usb-audio via82xx via82xx-modem ymfpci" APACHE2_MODULES="authn_core authz_core socache_shmcb unixd actions alias auth_basic authn_alias authn_anon authn_dbm authn_default authn_file authz_dbm authz_default authz_groupfile authz_host authz_owner authz_user autoindex cache cgi cgid dav dav_fs dav_lock deflate dir disk_cache env expires ext_filter file_cache filter headers include info log_config logio mem_cache mime mime_magic negotiation rewrite setenvif speling status unique_id userdir usertrack vhost_alias" CALLIGRA_FEATURES="karbon plan sheets stage words" COLLECTD_PLUGINS="df interface irq load memory rrdtool swap syslog" CPU_FLAGS_X86="mmx" ELIBC="glibc" GPSD_PROTOCOLS="ashtech aivdm earthmate evermore fv18 garmin garmintxt gpsclock isync itrax mtk3301 nmea ntrip navcom oceanserver oldstyle oncore rtcm104v2 rtcm104v3 sirf skytraq superstar2 timing tsip tripmate tnt ublox ubx" GRUB_PLATFORMS="pc" INPUT_DEVICES="libinput" KERNEL="linux" LCD_DEVICES="bayrad cfontz cfontz633 glk hd44780 lb216 lcdm001 mtxorb ncurses text" LIBREOFFICE_EXTENSIONS="presenter-console presenter-minimizer" OFFICE_IMPLEMENTATION="libreoffice" PHP_TARGETS="php5-6 php7-0" POSTGRES_TARGETS="postgres9_5 postgres10" PYTHON_SINGLE_TARGET="python3_6" PYTHON_TARGETS="python2_7 python3_6" RUBY_TARGETS="ruby22 ruby23" USERLAND="GNU" XTABLES_ADDONS="quota2 psd pknock lscan length2 ipv4options ipset ipp2p iface geoip fuzzy condition tee tarpit sysrq steal rawnat logmark ipmark dhcpmac delude chaos account"
Unset:  CC, CPPFLAGS, CTARGET, CXX, INSTALL_MASK, LC_ALL, LINGUAS, PORTAGE_BINHOST, PORTAGE_BUNZIP2_COMMAND, PORTAGE_COMPRESS, PORTAGE_COMPRESS_FLAGS, PORTAGE_RSYNC_EXTRA_OPTS


[Moderator edit: added [code] tags to preserve output layout. -Hu]
Back to top
View user's profile Send private message
Caiman
n00b
n00b


Joined: 01 Jul 2007
Posts: 64

PostPosted: Sun Sep 23, 2018 8:10 pm    Post subject: Reply with quote

Code:
emerge -pqv '=www-client/firefox-60.2.0::gentoo'
[ebuild     U ] www-client/firefox-60.2.0 [52.9.0] USE="bindist* dbus gmp-autoupdate pulseaudio screenshot%* startup-notification -custom-cflags -custom-optimization -debug -eme-free -hardened -hwaccel -jack (-neon) (-selinux) -system-harfbuzz -system-icu -system-jpeg -system-libevent -system-libvpx -system-sqlite -test -wifi (-gtk2%) (-jemalloc%*) (-pgo%) (-rust%) (-system-cairo%)" L10N="-ach -af -an -ar -as -ast -az -bg -bn-BD -bn-IN -br -bs -ca -cak -cs -cy -da -de -dsb -el -en-GB -en-ZA -eo -es-AR -es-CL -es-ES -es-MX -et -eu -fa -ff -fi -fr -fy -ga -gd -gl -gn -gu -he -hi -hr -hsb -hu -hy -id -is -it -ja -ka -kab -kk -km -kn -ko -lij -lt -lv -mai -mk -ml -mr -ms -nb -nl -nn -or -pa -pl -pt-BR -pt-PT -rm -ro -ru -si -sk -sl -son -sq -sr -sv -ta -te -th -tr -uk -uz -vi -xh -zh-CN -zh-TW"

 * IMPORTANT: 22 news items need reading for repository 'gentoo'.
 * Use eselect news read to view new items.


[Moderator edit: added [code] tags to preserve output layout. -Hu]
Back to top
View user's profile Send private message
Caiman
n00b
n00b


Joined: 01 Jul 2007
Posts: 64

PostPosted: Sun Sep 23, 2018 8:40 pm    Post subject: Reply with quote

Code:
tail --lines=100 /var/tmp/portage/www-client/firefox-60.2.0/temp/build.log
119:14.33 /var/tmp/portage/www-client/firefox-60.2.0/work/firefox-60.2.0/media/libsoundtouch/src/FIRFilter.cpp:192:0: warning: ignoring #pragma omp parallel [-Wunknown-pragmas]
119:14.33      #pragma omp parallel for
119:14.33
119:14.34 In file included from /var/tmp/portage/www-client/firefox-60.2.0/work/firefox-60.2.0/ff/media/libsoundtouch/src/Unified_cpp_libsoundtouch_src0.cpp:47:0:
119:14.34 /var/tmp/portage/www-client/firefox-60.2.0/work/firefox-60.2.0/media/libsoundtouch/src/InterpolateShannon.cpp:75:0: warning: "PI" redefined
119:14.34  #define PI 3.1415926536
119:14.35
119:14.35 In file included from /var/tmp/portage/www-client/firefox-60.2.0/work/firefox-60.2.0/ff/media/libsoundtouch/src/Unified_cpp_libsoundtouch_src0.cpp:2:0:
119:14.35 /var/tmp/portage/www-client/firefox-60.2.0/work/firefox-60.2.0/media/libsoundtouch/src/AAFilter.cpp:52:0: note: this is the location of the previous definition
119:14.36  #define PI       M_PI
119:14.36
119:14.38 In file included from /var/tmp/portage/www-client/firefox-60.2.0/work/firefox-60.2.0/ff/media/libsoundtouch/src/Unified_cpp_libsoundtouch_src0.cpp:83:0:
119:14.38 /var/tmp/portage/www-client/firefox-60.2.0/work/firefox-60.2.0/media/libsoundtouch/src/TDStretch.cpp:306:0: warning: ignoring #pragma omp parallel [-Wunknown-pragmas]
119:14.38      #pragma omp parallel for
119:14.38
119:14.39 /var/tmp/portage/www-client/firefox-60.2.0/work/firefox-60.2.0/media/libsoundtouch/src/TDStretch.cpp:331:0: warning: ignoring #pragma omp critical [-Wunknown-pragmas]
119:14.39              #pragma omp critical
119:14.39
119:14.94 In file included from /var/tmp/portage/www-client/firefox-60.2.0/work/firefox-60.2.0/ff/media/libsoundtouch/src/Unified_cpp_libsoundtouch_src0.cpp:56:0:
119:14.94 /var/tmp/portage/www-client/firefox-60.2.0/work/firefox-60.2.0/media/libsoundtouch/src/RateTransposer.cpp: In member function 'void soundtouch::RateTransposer::processSamples(const SAMPLETYPE*, uint)':
119:14.94 /var/tmp/portage/www-client/firefox-60.2.0/work/firefox-60.2.0/media/libsoundtouch/src/RateTransposer.cpp:133:10: warning: variable 'count' set but not used [-Wunused-but-set-variable]
119:14.95      uint count;
119:14.95           ^~~~~
119:18.20 libmedia_libsoundtouch_src.a.desc
119:18.20 rm -f libmedia_libsoundtouch_src.a
119:18.21 /var/tmp/portage/www-client/firefox-60.2.0/work/firefox-60.2.0/ff/_virtualenv/bin/python /var/tmp/portage/www-client/firefox-60.2.0/work/firefox-60.2.0/config/expandlibs_gen.py -o libmedia_libsoundtouch_src.a.desc sse_optimized.o Unified_cpp_libsoundtouch_src0.o
119:18.98 gmake[4]: Leaving directory '/var/tmp/portage/www-client/firefox-60.2.0/work/firefox-60.2.0/ff/media/libsoundtouch/src'
119:19.05 gmake[4]: Entering directory '/var/tmp/portage/www-client/firefox-60.2.0/work/firefox-60.2.0/ff/media/mp4parse-rust'
119:19.05 libmedia_mp4parse-rust.a.desc
119:19.05 rm -f libmedia_mp4parse-rust.a
119:19.05 /var/tmp/portage/www-client/firefox-60.2.0/work/firefox-60.2.0/ff/_virtualenv/bin/python /var/tmp/portage/www-client/firefox-60.2.0/work/firefox-60.2.0/config/expandlibs_gen.py -o libmedia_mp4parse-rust.a.desc
119:19.85 gmake[4]: Leaving directory '/var/tmp/portage/www-client/firefox-60.2.0/work/firefox-60.2.0/ff/media/mp4parse-rust'
119:19.91 gmake[4]: Entering directory '/var/tmp/portage/www-client/firefox-60.2.0/work/firefox-60.2.0/ff/media/psshparser'
119:19.92 mkdir -p '.deps/'
119:19.93 /usr/bin/i686-pc-linux-gnu-g++ -o Unified_cpp_media_psshparser0.o -c -I/var/tmp/portage/www-client/firefox-60.2.0/work/firefox-60.2.0/ff/dist/system_wrappers -include /var/tmp/portage/www-client/firefox-60.2.0/work/firefox-60.2.0/config/gcc_hidden.h -DNDEBUG=1 -DTRIMMED=1 -DMOZ_NO_MOZALLOC -I/var/tmp/portage/www-client/firefox-60.2.0/work/firefox-60.2.0/media/psshparser -I/var/tmp/portage/www-client/firefox-60.2.0/work/firefox-60.2.0/ff/media/psshparser -I/var/tmp/portage/www-client/firefox-60.2.0/work/firefox-60.2.0/ff/dist/include -I/usr/include/nspr -I/usr/include/nss -I/usr/include/pixman-1 -fPIC -DMOZILLA_CLIENT -include /var/tmp/portage/www-client/firefox-60.2.0/work/firefox-60.2.0/ff/mozilla-config.h -U_FORTIFY_SOURCE -D_FORTIFY_SOURCE=2 -Wall -Wempty-body -Wignored-qualifiers -Woverloaded-virtual -Wpointer-arith -Wsign-compare -Wtype-limits -Wunreachable-code -Wwrite-strings -Wno-invalid-offsetof -Wc++1z-compat -Wduplicated-cond -Wimplicit-fallthrough -Wno-error=maybe-uninitialized -Wno-error=deprecated-declarations -Wno-error=array-bounds -Wno-error=free-nonheap-object -Wformat -Wformat-security -Wformat-overflow=2 -fno-sized-deallocation -march=i686 -pipe -fno-delete-null-pointer-checks -fno-lifetime-dse -fno-schedule-insns -fno-schedule-insns2 -U_FORTIFY_SOURCE -D_FORTIFY_SOURCE=2 -fno-exceptions -fno-strict-aliasing -fno-rtti -ffunction-sections -fdata-sections -fno-exceptions -fno-math-errno -pthread -pipe -O2 -fomit-frame-pointer  -MD -MP -MF .deps/Unified_cpp_media_psshparser0.o.pp  -fdiagnostics-color  /var/tmp/portage/www-client/firefox-60.2.0/work/firefox-60.2.0/ff/media/psshparser/Unified_cpp_media_psshparser0.cpp
119:21.93 libpsshparser.a.desc
119:21.93 rm -f libpsshparser.a
119:21.93 /var/tmp/portage/www-client/firefox-60.2.0/work/firefox-60.2.0/ff/_virtualenv/bin/python /var/tmp/portage/www-client/firefox-60.2.0/work/firefox-60.2.0/config/expandlibs_gen.py -o libpsshparser.a.desc Unified_cpp_media_psshparser0.o
119:22.67 gmake[4]: Leaving directory '/var/tmp/portage/www-client/firefox-60.2.0/work/firefox-60.2.0/ff/media/psshparser'
119:22.73 gmake[4]: Entering directory '/var/tmp/portage/www-client/firefox-60.2.0/work/firefox-60.2.0/ff/security'
119:22.73 libnss.a.desc
119:22.74 rm -f libnss.a
119:22.74 /var/tmp/portage/www-client/firefox-60.2.0/work/firefox-60.2.0/ff/_virtualenv/bin/python /var/tmp/portage/www-client/firefox-60.2.0/work/firefox-60.2.0/config/expandlibs_gen.py -o libnss.a.desc
119:23.52 gmake[4]: Leaving directory '/var/tmp/portage/www-client/firefox-60.2.0/work/firefox-60.2.0/ff/security'
119:23.57 gmake[4]: Entering directory '/var/tmp/portage/www-client/firefox-60.2.0/work/firefox-60.2.0/ff/toolkit/library/rust'
119:23.57 force-cargo-library-build
119:23.57 env   RUSTFLAGS='-C opt-level=2 '  CARGO_TARGET_DIR=/var/tmp/portage/www-client/firefox-60.2.0/work/firefox-60.2.0/ff/toolkit/library RUSTC=/usr/bin/rustc MOZ_SRC=/var/tmp/portage/www-client/firefox-60.2.0/work/firefox-60.2.0 MOZ_DIST=/var/tmp/portage/www-client/firefox-60.2.0/work/firefox-60.2.0/ff/dist LIBCLANG_PATH="" CLANG_PATH="" PKG_CONFIG_ALLOW_CROSS=1 RUST_BACKTRACE=full MOZ_TOPOBJDIR=/var/tmp/portage/www-client/firefox-60.2.0/work/firefox-60.2.0/ff  MOZ_CARGO_WRAP_LDFLAGS="-lpthread -Wl,-O1 -Wl,--as-needed -Wl,-rpath=/usr/lib/firefox,--enable-new-dtags -Wl,-z,noexecstack -Wl,-z,text -Wl,-z,relro -Wl,-rpath-link,/var/tmp/portage/www-client/firefox-60.2.0/work/firefox-60.2.0/ff/dist/bin -Wl,-rpath-link,/usr/lib -fdiagnostics-color" MOZ_CARGO_WRAP_LD=" /usr/bin/i686-pc-linux-gnu-gcc -std=gnu99" CARGO_TARGET_I686_UNKNOWN_LINUX_GNU_LINKER=/var/tmp/portage/www-client/firefox-60.2.0/work/firefox-60.2.0/build/cargo-linker /usr/bin/cargo rustc  --release --frozen --manifest-path /var/tmp/portage/www-client/firefox-60.2.0/work/firefox-60.2.0/toolkit/library/rust/Cargo.toml --color=always --lib --target=i686-unknown-linux-gnu --features "cubeb_pulse_rust cubeb-remoting no-static-ideograph-encoder-tables" --  -C lto
119:39.81    Compiling lazy_static v0.2.11
119:39.81    Compiling mp4parse_fallible v0.0.1
119:39.82    Compiling boxfnonce v0.0.3
119:39.82    Compiling num-traits v0.2.0
119:42.97    Compiling runloop v0.1.0
119:43.13    Compiling prefs_parser v0.0.1 (file:///var/tmp/portage/www-client/firefox-60.2.0/work/firefox-60.2.0/modules/libpref/parser)
119:43.87    Compiling scoped-tls v0.1.0
119:47.51    Compiling moz_cbor v0.1.1
119:48.27    Compiling libc v0.2.33
119:56.12    Compiling semver-parser v0.7.0
119:58.79    Compiling matches v0.1.6
120:00.38    Compiling lazycell v0.4.0
120:02.64    Compiling foreign-types v0.3.0
120:03.46    Compiling cose v0.1.4
120:03.71    Compiling unicode-xid v0.0.4
120:05.94    Compiling quote v0.3.15
120:06.23 error: linking with `/var/tmp/portage/www-client/firefox-60.2.0/work/firefox-60.2.0/build/cargo-linker` failed: exit code: 1
120:06.23   |
120:06.24   = note: "/var/tmp/portage/www-client/firefox-60.2.0/work/firefox-60.2.0/build/cargo-linker" "-Wl,--as-needed" "-Wl,-z,noexecstack" "-m32" "-L" "/usr/lib/rustlib/i686-unknown-linux-gnu/lib" "/var/tmp/portage/www-client/firefox-60.2.0/work/firefox-60.2.0/ff/toolkit/library/release/build/cose-07f74104284ed8a2/build_script_build-07f74104284ed8a2.build_script_build0.rcgu.o" "-o" "/var/tmp/portage/www-client/firefox-60.2.0/work/firefox-60.2.0/ff/toolkit/library/release/build/cose-07f74104284ed8a2/build_script_build-07f74104284ed8a2" "/var/tmp/portage/www-client/firefox-60.2.0/work/firefox-60.2.0/ff/toolkit/library/release/build/cose-07f74104284ed8a2/build_script_build-07f74104284ed8a2.crate.allocator.rcgu.o" "-Wl,--gc-sections" "-pie" "-Wl,-z,relro,-z,now" "-Wl,-O1" "-nodefaultlibs" "-L" "/var/tmp/portage/www-client/firefox-60.2.0/work/firefox-60.2.0/ff/toolkit/library/release/deps" "-L" "/usr/lib/rustlib/i686-unknown-linux-gnu/lib" "-Wl,-Bstatic" "/usr/lib/rustlib/i686-unknown-linux-gnu/lib/libstd-3a04e5487357b9dc.rlib" "/usr/lib/rustlib/i686-unknown-linux-gnu/lib/libpanic_unwind-75baa38f22cc081b.rlib" "/usr/lib/rustlib/i686-unknown-linux-gnu/lib/liballoc_jemalloc-cc6cad7f4861198e.rlib" "/usr/lib/rustlib/i686-unknown-linux-gnu/lib/libunwind-0df808026f9bff72.rlib" "/usr/lib/rustlib/i686-unknown-linux-gnu/lib/liballoc_system-5885ff2e63807fd7.rlib" "/usr/lib/rustlib/i686-unknown-linux-gnu/lib/liblibc-4b46c18a44d67980.rlib" "/usr/lib/rustlib/i686-unknown-linux-gnu/lib/liballoc-22af9bc8b767b147.rlib" "/usr/lib/rustlib/i686-unknown-linux-gnu/lib/libstd_unicode-46e7ab27ec583312.rlib" "/usr/lib/rustlib/i686-unknown-linux-gnu/lib/libcore-b4b9c53c65e9ed4f.rlib" "/usr/lib/rustlib/i686-unknown-linux-gnu/lib/libcompiler_builtins-0bcc823f82eb498d.rlib" "-Wl,-Bdynamic" "-l" "dl" "-l" "rt" "-l" "pthread" "-l" "pthread" "-l" "gcc_s" "-l" "c" "-l" "m" "-l" "rt" "-l" "pthread" "-l" "util" "-l" "util"
120:06.25   = note: /usr/lib/gcc/i686-pc-linux-gnu/7.3.0/../../../../i686-pc-linux-gnu/bin/ld: internal error /var/tmp/portage/sys-devel/binutils-2.30-r2/work/binutils-2.30/ld/ldlang.c 6635
120:06.25           collect2: error: ld returned 1 exit status
120:06.26
120:06.26
120:06.26 error: aborting due to previous error
120:06.27
120:06.62 error: Could not compile `cose`.
120:06.63 warning: build failed, waiting for other jobs to finish...
120:14.65 error: build failed
120:14.70 gmake[4]: *** [/var/tmp/portage/www-client/firefox-60.2.0/work/firefox-60.2.0/config/rules.mk:972: force-cargo-library-build] Error 101
120:14.71 gmake[4]: Leaving directory '/var/tmp/portage/www-client/firefox-60.2.0/work/firefox-60.2.0/ff/toolkit/library/rust'
120:14.71 gmake[3]: *** [/var/tmp/portage/www-client/firefox-60.2.0/work/firefox-60.2.0/config/recurse.mk:73: toolkit/library/rust/target] Error 2
120:14.71 gmake[3]: Leaving directory '/var/tmp/portage/www-client/firefox-60.2.0/work/firefox-60.2.0/ff'
120:14.71 gmake[2]: *** [/var/tmp/portage/www-client/firefox-60.2.0/work/firefox-60.2.0/config/recurse.mk:33: compile] Error 2
120:14.72 gmake[2]: Leaving directory '/var/tmp/portage/www-client/firefox-60.2.0/work/firefox-60.2.0/ff'
120:14.72 gmake[1]: *** [/var/tmp/portage/www-client/firefox-60.2.0/work/firefox-60.2.0/config/rules.mk:434: default] Error 2
120:14.72 gmake[1]: Leaving directory '/var/tmp/portage/www-client/firefox-60.2.0/work/firefox-60.2.0/ff'
120:14.72 gmake: *** [client.mk:168: build] Error 2
120:14.73 0 compiler warnings present.
 * ERROR: www-client/firefox-60.2.0::gentoo failed (compile phase):
 *   (no error message)
 *
 * Call stack:
 *     ebuild.sh, line 124:  Called src_compile
 *   environment, line 5073:  Called die
 * The specific snippet of code:
 *       MOZ_MAKE_FLAGS="${MAKEOPTS}" SHELL="${SHELL:-${EPREFIX}/bin/bash}" MOZ_NOSPAM=1 ./mach build --verbose || die
 *
 * If you need support, post the output of `emerge --info '=www-client/firefox-60.2.0::gentoo'`,
 * the complete build log and the output of `emerge -pqv '=www-client/firefox-60.2.0::gentoo'`.
 * The complete build log is located at '/var/tmp/portage/www-client/firefox-60.2.0/temp/build.log'.
 * The ebuild environment file is located at '/var/tmp/portage/www-client/firefox-60.2.0/temp/environment'.
 * Working directory: '/var/tmp/portage/www-client/firefox-60.2.0/work/firefox-60.2.0'
 * S: '/var/tmp/portage/www-client/firefox-60.2.0/work/firefox-60.2.0'


[Moderator edit: added [code] tags to preserve output layout. -Hu]
Back to top
View user's profile Send private message
sokhapkin
n00b
n00b


Joined: 13 Jan 2005
Posts: 33
Location: N Ft Myers, FL

PostPosted: Tue Sep 25, 2018 12:13 am    Post subject: Reply with quote

Downgrade binutils to version 2.29, it build firefox fine. Both 2.30 and 2.31 fail.
_________________
Sergey Okhapkin
http://www.callwithus.com
Back to top
View user's profile Send private message
multix
Apprentice
Apprentice


Joined: 28 Nov 2004
Posts: 216
Location: Italy

PostPosted: Tue Sep 25, 2018 2:40 pm    Post subject: Reply with quote

Caiman, do you have have news on this?
I have tried build FF on two ThinkPads and run into the same issue.
ONe of the two has added SWAP.

Reading around, it appears that the process may hit 32bit limit, this could be an issue.

Is the binutils solution "confirmed" ? That could still be related to different linker options.

Code:

Package:    www-client/firefox-60.2.0
Repository: gentoo
Maintainer: mozilla@gentoo.org
USE:        abi_x86_32 bindist elibc_glibc gmp-autoupdate kernel_linux screenshot userland_GNU x86
FEATURES:   preserve-libs sandbox userpriv usersandbox


and fails in exactly the same place:
Quote:

Compiling cose v0.1.4
linking with `/var/tmp/portage/www-client/firefox-60.2.0/work/firefox-60.2.0/build/cargo-linker` failed: exit code: 1

_________________
Unix is user friendly. It is only careful selecting its friends.
Back to top
View user's profile Send private message
Caiman
n00b
n00b


Joined: 01 Jul 2007
Posts: 64

PostPosted: Sun Oct 28, 2018 10:21 am    Post subject: Reply with quote

I skipped failed update for firefox-60.2.0 and did not downgraded binutils to version 2.29 as suggested


build for www-client/firefox-60.3.0 was successful with sys-devel/binutils-2.30-r4
Back to top
View user's profile Send private message
multix
Apprentice
Apprentice


Joined: 28 Nov 2004
Posts: 216
Location: Italy

PostPosted: Tue Nov 06, 2018 2:41 pm    Post subject: Reply with quote

Downgrading binutils helped indeed, but apparently also upgrading... perhaps the latest stuff fixed the bug again.
_________________
Unix is user friendly. It is only careful selecting its friends.
Back to top
View user's profile Send private message
Display posts from previous:   
Reply to topic    Gentoo Forums Forum Index Desktop Environments All times are GMT
Page 1 of 1

 
Jump to:  
You cannot post new topics in this forum
You cannot reply to topics in this forum
You cannot edit your posts in this forum
You cannot delete your posts in this forum
You cannot vote in polls in this forum