Gentoo Forums
Gentoo Forums
Gentoo Forums
Quick Search: in
[SOLVED] texlive-core-2017-r3 doesn't build
View unanswered posts
View posts from last 24 hours

 
Reply to topic    Gentoo Forums Forum Index Portage & Programming
View previous topic :: View next topic  
Author Message
NP_complete
Tux's lil' helper
Tux's lil' helper


Joined: 21 Mar 2009
Posts: 94

PostPosted: Sun May 20, 2018 12:55 pm    Post subject: [SOLVED] texlive-core-2017-r3 doesn't build Reply with quote

I just sync'd the system and got:
Code:
checking requested system `harfbuzz' library... failed
configure: error: some requested system libraries failed

!!! Please attach the following file when seeking support:
!!! /var/tmp/portage/app-text/texlive-core-2017-r3/work/texlive-core-2017_build/config.log
 * ERROR: app-text/texlive-core-2017-r3::gentoo failed (configure phase):
 *   econf failed
 *
 * Call stack:
 *               ebuild.sh, line  124:  Called src_configure
 *             environment, line 2409:  Called econf '-C' '--bindir=/usr/bin' '--datadir=/var/tmp/portage/app-text/texlive-core-2017-r3/work/texlive-core-2017_build' '--with-system-freetype2' '--with-system-zlib' '--with-system-libpng' '--with-system-xpdf' '--with-system-poppler' '--with-system-teckit' '--with-teckit-includes=/usr/include/teckit' '--with-system-kpathsea' '--with-kpathsea-includes=/usr/include' '--with-system-icu' '--with-system-ptexenc' '--with-system-harfbuzz' '--with-system-icu' '--with-system-graphite2' '--with-system-cairo' '--with-system-pixman' '--with-system-zziplib' '--with-system-libpaper' '--with-system-gmp' '--with-system-mpfr' '--without-texinfo' '--disable-dialog' '--disable-multiplatform' '--enable-epsfwin' '--enable-mftalkwin' '--enable-regiswin' '--enable-tektronixwin' '--enable-unitermwin' '--with-ps=gs' '--disable-psutils' '--disable-t1utils' '--enable-ipc' '--disable-biber' '--disable-bibtex-x' '--disable-dvipng' '--disable-dvipsk' '--disable-chktex' '--disable-lcdf-typetools' '--disable-pdfopen' '--disable-ps2eps' '--disable-ps2pk' '--disable-detex' '--disable-ttf2pk2' '--disable-tex4htk' '--disable-cjkutils' '--disable-xdvik' '--disable-xindy' '--enable-luatex' '--disable-dvi2tty' '--disable-dvisvgm' '--disable-vlna' '--enable-shared' '--disable-native-texlive-build' '--disable-largefile' '--enable-luajittex' '--enable-mfluajit' '--enable-xetex' '--disable-ptex' '--disable-eptex' '--disable-uptex' '--disable-euptex' '--disable-mendexk' '--disable-makejvf' '--disable-pmp' '--disable-upmp' '--disable-texdoctk' '--with-x'
 *        phase-helpers.sh, line  666:  Called __helpers_die 'econf failed'
 *   isolated-functions.sh, line  117:  Called die
 * The specific snippet of code:
 *         die "$@"
 *
 * If you need support, post the output of `emerge --info '=app-text/texlive-core-2017-r3::gentoo'`,
 * the complete build log and the output of `emerge -pqv '=app-text/texlive-core-2017-r3::gentoo'`.
 * The complete build log is located at '/var/tmp/portage/app-text/texlive-core-2017-r3/temp/build.log'.
 * The ebuild environment file is located at '/var/tmp/portage/app-text/texlive-core-2017-r3/temp/environment'.
 * Working directory: '/var/tmp/portage/app-text/texlive-core-2017-r3/work/texlive-core-2017_build'
 * S: '/var/tmp/portage/app-text/texlive-core-2017-r3/work/texlive-core-2017_build'

>>> Failed to emerge app-text/texlive-core-2017-r3, Log file:

>>>  '/var/tmp/portage/app-text/texlive-core-2017-r3/temp/build.log'

 * Messages for package app-text/texlive-core-2017-r3:

 * ERROR: app-text/texlive-core-2017-r3::gentoo failed (configure phase):
 *   econf failed
 *
 * Call stack:
 *               ebuild.sh, line  124:  Called src_configure
 *             environment, line 2409:  Called econf '-C' '--bindir=/usr/bin' '--datadir=/var/tmp/portage/app-text/texlive-core-2017-r3/work/texlive-core-2017_build' '--with-system-freetype2' '--with-system-zlib' '--with-system-libpng' '--with-system-xpdf' '--with-system-poppler' '--with-system-teckit' '--with-teckit-includes=/usr/include/teckit' '--with-system-kpathsea' '--with-kpathsea-includes=/usr/include' '--with-system-icu' '--with-system-ptexenc' '--with-system-harfbuzz' '--with-system-icu' '--with-system-graphite2' '--with-system-cairo' '--with-system-pixman' '--with-system-zziplib' '--with-system-libpaper' '--with-system-gmp' '--with-system-mpfr' '--without-texinfo' '--disable-dialog' '--disable-multiplatform' '--enable-epsfwin' '--enable-mftalkwin' '--enable-regiswin' '--enable-tektronixwin' '--enable-unitermwin' '--with-ps=gs' '--disable-psutils' '--disable-t1utils' '--enable-ipc' '--disable-biber' '--disable-bibtex-x' '--disable-dvipng' '--disable-dvipsk' '--disable-chktex' '--disable-lcdf-typetools' '--disable-pdfopen' '--disable-ps2eps' '--disable-ps2pk' '--disable-detex' '--disable-ttf2pk2' '--disable-tex4htk' '--disable-cjkutils' '--disable-xdvik' '--disable-xindy' '--enable-luatex' '--disable-dvi2tty' '--disable-dvisvgm' '--disable-vlna' '--enable-shared' '--disable-native-texlive-build' '--disable-largefile' '--enable-luajittex' '--enable-mfluajit' '--enable-xetex' '--disable-ptex' '--disable-eptex' '--disable-uptex' '--disable-euptex' '--disable-mendexk' '--disable-makejvf' '--disable-pmp' '--disable-upmp' '--disable-texdoctk' '--with-x'
 *        phase-helpers.sh, line  666:  Called __helpers_die 'econf failed'
 *   isolated-functions.sh, line  117:  Called die
 * The specific snippet of code:
 *         die "$@"
(I have the "latex" USE flag set globally).

Any ideas? Many thanks!

[Moderator edit: changed [quote] tags to [code] tags to preserve output layout. -Hu]


Last edited by NP_complete on Mon May 21, 2018 3:35 pm; edited 1 time in total
Back to top
View user's profile Send private message
Jaglover
Watchman
Watchman


Joined: 29 May 2005
Posts: 6397
Location: Saint Amant, Acadiana

PostPosted: Sun May 20, 2018 1:11 pm    Post subject: Reply with quote

Common sense tells if configure failed you should look at configure log. No?
_________________
Please learn how to denote units correctly!
Back to top
View user's profile Send private message
NP_complete
Tux's lil' helper
Tux's lil' helper


Joined: 21 Mar 2009
Posts: 94

PostPosted: Sun May 20, 2018 1:51 pm    Post subject: Reply with quote

/var/tmp/portage/app-text/texlive-core-2017-r3/work/texlive-core-2017_build/config.log follows. The problem seems to be in media-libs/harfbuzz.

Many thanks.

Code:
This file contains any messages produced by compilers while
running configure, to aid debugging if configure makes a mistake.

It was created by TeX Live configure 2016-05-23, which was
generated by GNU Autoconf 2.69.  Invocation command line was

  $ /var/tmp/portage/app-text/texlive-core-2017-r3/work/texlive-20170524-source/configure --prefix=/usr --build=x86_64-pc-linux-gnu --host=x86_64-pc-linux-gnu --mandir=/usr/share/man --infodir=/usr/share/info --datadir=/usr/share --sysconfdir=/etc --localstatedir=/var/lib --disable-dependency-tracking --disable-silent-rules --libdir=/usr/lib64 -C --bindir=/usr/bin --datadir=/var/tmp/portage/app-text/texlive-core-2017-r3/work/texlive-core-2017_build --with-system-freetype2 --with-system-zlib --with-system-libpng --with-system-xpdf --with-system-poppler --with-system-teckit --with-teckit-includes=/usr/include/teckit --with-system-kpathsea --with-kpathsea-includes=/usr/include --with-system-icu --with-system-ptexenc --with-system-harfbuzz --with-system-icu --with-system-graphite2 --with-system-cairo --with-system-pixman --with-system-zziplib --with-system-libpaper --with-system-gmp --with-system-mpfr --without-texinfo --disable-dialog --disable-multiplatform --enable-epsfwin --enable-mftalkwin --enable-regiswin --enable-tektronixwin --enable-unitermwin --with-ps=gs --disable-psutils --disable-t1utils --enable-ipc --disable-biber --disable-bibtex-x --disable-dvipng --disable-dvipsk --disable-chktex --disable-lcdf-typetools --disable-pdfopen --disable-ps2eps --disable-ps2pk --disable-detex --disable-ttf2pk2 --disable-tex4htk --disable-cjkutils --disable-xdvik --disable-xindy --enable-luatex --disable-dvi2tty --disable-dvisvgm --disable-vlna --enable-shared --disable-native-texlive-build --disable-largefile --enable-luajittex --enable-mfluajit --enable-xetex --disable-ptex --disable-eptex --disable-uptex --disable-euptex --disable-mendexk --disable-makejvf --disable-pmp --disable-upmp --disable-texdoctk --with-x

## --------- ##
## Platform. ##
## --------- ##

hostname = gazelle
uname -m = x86_64
uname -r = 4.9.95-gentoo
uname -s = Linux
uname -v = #1 SMP Sat Apr 28 13:02:17 CEST 2018

/usr/bin/uname -p = Intel(R) Core(TM) i7-4710MQ CPU @ 2.50GHz
/bin/uname -X     = unknown

/bin/arch              = unknown
/usr/bin/arch -k       = unknown
/usr/convex/getsysinfo = unknown
/usr/bin/hostinfo      = unknown
/bin/machine           = unknown
/usr/bin/oslevel       = unknown
/bin/universe          = unknown

PATH: /usr/lib/portage/python3.5/ebuild-helpers/xattr
PATH: /usr/lib/portage/python3.5/ebuild-helpers
PATH: /usr/local/sbin
PATH: /usr/local/bin
PATH: /usr/sbin
PATH: /usr/bin
PATH: /sbin
PATH: /bin
PATH: /usr/x86_64-pc-linux-gnu/gcc-bin/6.4.0
PATH: /usr/lib/llvm/5/bin
PATH: /usr/local/sbin
PATH: /usr/local/bin
PATH: /usr/sbin
PATH: /usr/bin
PATH: /sbin
PATH: /bin
PATH: /opt/bin


## ----------- ##
## Core tests. ##
## ----------- ##

configure:2944: creating cache config.cache
configure:3062: checking build system type
configure:3076: result: x86_64-pc-linux-gnu
configure:3096: checking host system type
configure:3109: result: x86_64-pc-linux-gnu
configure:3145: checking for x86_64-pc-linux-gnu-gcc
configure:3172: result: x86_64-pc-linux-gnu-gcc
configure:3441: checking for C compiler version
configure:3450: x86_64-pc-linux-gnu-gcc --version >&5
x86_64-pc-linux-gnu-gcc (Gentoo 6.4.0-r1 p1.3) 6.4.0
Copyright (C) 2017 Free Software Foundation, Inc.
This is free software; see the source for copying conditions.  There is NO
warranty; not even for MERCHANTABILITY or FITNESS FOR A PARTICULAR PURPOSE.

configure:3461: $? = 0
configure:3450: x86_64-pc-linux-gnu-gcc -v >&5
Using built-in specs.
COLLECT_GCC=/usr/x86_64-pc-linux-gnu/gcc-bin/6.4.0/x86_64-pc-linux-gnu-gcc
COLLECT_LTO_WRAPPER=/usr/libexec/gcc/x86_64-pc-linux-gnu/6.4.0/lto-wrapper
Target: x86_64-pc-linux-gnu
Configured with: /var/tmp/portage/sys-devel/gcc-6.4.0-r1/work/gcc-6.4.0/configure --host=x86_64-pc-linux-gnu --build=x86_64-pc-linux-gnu --prefix=/usr --bindir=/usr/x86_64-pc-linux-gnu/gcc-bin/6.4.0 --includedir=/usr/lib/gcc/x86_64-pc-linux-gnu/6.4.0/include --datadir=/usr/share/gcc-data/x86_64-pc-linux-gnu/6.4.0 --mandir=/usr/share/gcc-data/x86_64-pc-linux-gnu/6.4.0/man --infodir=/usr/share/gcc-data/x86_64-pc-linux-gnu/6.4.0/info --with-gxx-include-dir=/usr/lib/gcc/x86_64-pc-linux-gnu/6.4.0/include/g++-v6 --with-python-dir=/share/gcc-data/x86_64-pc-linux-gnu/6.4.0/python --enable-languages=c,c++,fortran --enable-obsolete --enable-secureplt --disable-werror --with-system-zlib --enable-nls --without-included-gettext --enable-checking=release --with-bugurl=https://bugs.gentoo.org/ --with-pkgversion='Gentoo 6.4.0-r1 p1.3' --disable-esp --enable-libstdcxx-time --enable-shared --enable-threads=posix --enable-__cxa_atexit --enable-clocale=gnu --enable-multilib --with-multilib-list=m32,m64 --disable-altivec --disable-fixed-point --enable-targets=all --disable-libgcj --enable-libgomp --disable-libmudflap --disable-libssp --disable-libcilkrts --disable-libmpx --enable-vtable-verify --enable-libvtv --enable-lto --without-isl --enable-libsanitizer --enable-default-pie --enable-default-ssp
Thread model: posix
gcc version 6.4.0 (Gentoo 6.4.0-r1 p1.3)
configure:3461: $? = 0
configure:3450: x86_64-pc-linux-gnu-gcc -V >&5
x86_64-pc-linux-gnu-gcc: error: unrecognized command line option '-V'
x86_64-pc-linux-gnu-gcc: fatal error: no input files
compilation terminated.
configure:3461: $? = 1
configure:3450: x86_64-pc-linux-gnu-gcc -qversion >&5
x86_64-pc-linux-gnu-gcc: error: unrecognized command line option '-qversion'; did you mean '--version'?
x86_64-pc-linux-gnu-gcc: fatal error: no input files
compilation terminated.
configure:3461: $? = 1
configure:3481: checking whether the C compiler works
configure:3503: x86_64-pc-linux-gnu-gcc -march=native -O2 -pipe  -Wl,-O1 -Wl,--as-needed conftest.c  >&5
configure:3507: $? = 0
configure:3555: result: yes
configure:3558: checking for C compiler default output file name
configure:3560: result: a.out
configure:3566: checking for suffix of executables
configure:3573: x86_64-pc-linux-gnu-gcc -o conftest -march=native -O2 -pipe  -Wl,-O1 -Wl,--as-needed conftest.c  >&5
configure:3577: $? = 0
configure:3599: result:
configure:3621: checking whether we are cross compiling
configure:3629: x86_64-pc-linux-gnu-gcc -o conftest -march=native -O2 -pipe  -Wl,-O1 -Wl,--as-needed conftest.c  >&5
configure:3633: $? = 0
configure:3640: ./conftest
configure:3644: $? = 0
configure:3659: result: no
configure:3664: checking for suffix of object files
configure:3686: x86_64-pc-linux-gnu-gcc -c -march=native -O2 -pipe  conftest.c >&5
configure:3690: $? = 0
configure:3711: result: o
configure:3715: checking whether we are using the GNU C compiler
configure:3734: x86_64-pc-linux-gnu-gcc -c -march=native -O2 -pipe  conftest.c >&5
configure:3734: $? = 0
configure:3743: result: yes
configure:3752: checking whether x86_64-pc-linux-gnu-gcc accepts -g
configure:3772: x86_64-pc-linux-gnu-gcc -c -g  conftest.c >&5
configure:3772: $? = 0
configure:3813: result: yes
configure:3830: checking for x86_64-pc-linux-gnu-gcc option to accept ISO C89
configure:3893: x86_64-pc-linux-gnu-gcc  -c -march=native -O2 -pipe  conftest.c >&5
configure:3893: $? = 0
configure:3906: result: none needed
configure:3931: checking whether x86_64-pc-linux-gnu-gcc understands -c and -o together
configure:3953: x86_64-pc-linux-gnu-gcc -c conftest.c -o conftest2.o
configure:3956: $? = 0
configure:3953: x86_64-pc-linux-gnu-gcc -c conftest.c -o conftest2.o
configure:3956: $? = 0
configure:3968: result: yes
configure:4093: checking for native WIN32 or MINGW32
configure:4111: x86_64-pc-linux-gnu-gcc -c -march=native -O2 -pipe  conftest.c >&5
conftest.c:10:3: error: unknown type name 'choke'
   choke me
   ^~~~~
conftest.c:12:1: error: expected '=', ',', ';', 'asm' or '__attribute__' before 'int'
 int
 ^~~
configure:4111: $? = 1
configure: failed program was:
| /* confdefs.h */
| #define PACKAGE_NAME "TeX Live"
| #define PACKAGE_TARNAME "tex-live"
| #define PACKAGE_VERSION "2016-05-23"
| #define PACKAGE_STRING "TeX Live 2016-05-23"
| #define PACKAGE_BUGREPORT "tex-k@tug.org"
| #define PACKAGE_URL ""
| /* end confdefs.h.  */
| #ifndef WIN32
|   choke me
| #endif
| int
| main ()
| {
|
|   ;
|   return 0;
| }
configure:4136: result: no
configure:4194: Assuming `--enable-autosp=yes'
configure:4212: Assuming `--enable-devnag=yes'
configure:4230: Assuming `--enable-lacheck=yes'
configure:4248: Assuming `--enable-m-tx=yes'
configure:4266: Assuming `--enable-pmx=yes'
configure:4338: Assuming `--enable-tpic2pdftex=yes'
configure:4420: Assuming `--with-clisp-runtime=system'
configure:4454: Assuming `--enable-xpdfopen=yes'
configure:4473: Assuming `--enable-web2c=yes'
configure:4887: Assuming `--enable-afm2pl=yes'
configure:5024: Assuming `--enable-dtl=yes'
configure:5068: Assuming `--enable-dvidvi=yes'
configure:5090: Assuming `--enable-dviljk=yes'
configure:5112: Assuming `--enable-dvipdfm-x=yes'
configure:5178: Assuming `--enable-dvipos=yes'
configure:5247: Assuming `--enable-gregorio=yes'
configure:5269: Assuming `--enable-gsftopk=yes'
configure:5378: Assuming `--enable-makeindexk=yes'
configure:5444: Assuming `--enable-musixtnt=yes'
configure:5511: Assuming `--enable-seetexk=yes'
configure:5578: Assuming `--enable-ttfdump=yes'
configure:5600: Assuming `--enable-upmendex=yes'
configure:5668: Assuming `--enable-texlive=yes'
configure:5701: Using installed `harfbuzz' headers and library
configure:5754: Using installed `icu' headers and library
configure:5784: Using installed `teckit' headers and library
configure:5828: Using installed `graphite2' headers and library
configure:5858: Using installed `zziplib' headers and library
configure:5902: Using installed `xpdf' headers and library
configure:5932: Using installed `poppler' headers and library
configure:5986: Using installed `mpfr' headers and library
configure:6040: Using installed `gmp' headers and library
configure:6070: Using installed `cairo' headers and library
configure:6114: Using installed `pixman' headers and library
configure:6144: Assuming `potrace' headers and library from TL tree
configure:6184: Assuming `gd' headers and library from TL tree
configure:6247: Using installed `freetype2' headers and library
configure:6291: Using installed `libpng' headers and library
configure:6345: Using installed `libpaper' headers and library
configure:6391: Using installed `zlib' headers and library
configure:6422: Using installed `ptexenc' headers and library
configure:6466: Using installed `kpathsea' headers and library
configure:6528: checking for a BSD-compatible install
configure:6596: result: /usr/lib/portage/python3.5/ebuild-helpers/xattr/install -c
configure:6607: checking whether build environment is sane
configure:6662: result: yes
configure:6810: checking for a thread-safe mkdir -p
configure:6849: result: /bin/mkdir -p
configure:6856: checking for gawk
configure:6872: found /usr/bin/gawk
configure:6883: result: gawk
configure:6894: checking whether make sets $(MAKE)
configure:6916: result: yes
configure:6946: checking for style of include used by make
configure:6974: result: GNU
configure:7008: checking whether make supports nested variables
configure:7025: result: yes
configure:7097: checking how to print strings
configure:7124: result: printf
configure:7145: checking for a sed that does not truncate output
configure:7209: result: /bin/sed
configure:7227: checking for grep that handles long lines and -e
configure:7285: result: /bin/grep
configure:7290: checking for egrep
configure:7352: result: /bin/grep -E
configure:7357: checking for fgrep
configure:7419: result: /bin/grep -F
configure:7454: checking for ld used by x86_64-pc-linux-gnu-gcc
configure:7521: result: /usr/x86_64-pc-linux-gnu/bin/ld
configure:7528: checking if the linker (/usr/x86_64-pc-linux-gnu/bin/ld) is GNU ld
configure:7543: result: yes
configure:7555: checking for BSD- or MS-compatible name lister (nm)
configure:7609: result: /usr/bin/x86_64-pc-linux-gnu-nm -B
configure:7739: checking the name lister (/usr/bin/x86_64-pc-linux-gnu-nm -B) interface
configure:7746: x86_64-pc-linux-gnu-gcc -c -march=native -O2 -pipe  conftest.c >&5
configure:7749: /usr/bin/x86_64-pc-linux-gnu-nm -B "conftest.o"
configure:7752: output
0000000000000000 B some_variable
configure:7759: result: BSD nm
configure:7762: checking whether ln -s works
configure:7766: result: yes
configure:7774: checking the maximum length of command line arguments
configure:7905: result: 1572864
configure:7953: checking how to convert x86_64-pc-linux-gnu file names to x86_64-pc-linux-gnu format
configure:7993: result: func_convert_file_noop
configure:8000: checking how to convert x86_64-pc-linux-gnu file names to toolchain format
configure:8020: result: func_convert_file_noop
configure:8027: checking for /usr/x86_64-pc-linux-gnu/bin/ld option to reload object files
configure:8034: result: -r
configure:8068: checking for x86_64-pc-linux-gnu-objdump
configure:8084: found /usr/bin/x86_64-pc-linux-gnu-objdump
configure:8095: result: x86_64-pc-linux-gnu-objdump
configure:8164: checking how to recognize dependent libraries
configure:8364: result: pass_all
configure:8409: checking for x86_64-pc-linux-gnu-dlltool
configure:8439: result: no
configure:8449: checking for dlltool
configure:8479: result: no
configure:8506: checking how to associate runtime and link libraries
configure:8533: result: printf %s\n
configure:8549: checking for x86_64-pc-linux-gnu-ar
configure:8576: result: x86_64-pc-linux-gnu-ar
configure:8657: checking for archiver @FILE support
configure:8674: x86_64-pc-linux-gnu-gcc -c -march=native -O2 -pipe  conftest.c >&5
configure:8674: $? = 0
configure:8677: x86_64-pc-linux-gnu-ar cru libconftest.a @conftest.lst >&5
configure:8680: $? = 0
configure:8685: x86_64-pc-linux-gnu-ar cru libconftest.a @conftest.lst >&5
x86_64-pc-linux-gnu-ar: conftest.o: No such file or directory
configure:8688: $? = 1
configure:8700: result: @
configure:8718: checking for x86_64-pc-linux-gnu-strip
configure:8734: found /usr/bin/x86_64-pc-linux-gnu-strip
configure:8745: result: x86_64-pc-linux-gnu-strip
configure:8817: checking for x86_64-pc-linux-gnu-ranlib
configure:8844: result: x86_64-pc-linux-gnu-ranlib
configure:8986: checking command to parse /usr/bin/x86_64-pc-linux-gnu-nm -B output from x86_64-pc-linux-gnu-gcc object
configure:9139: x86_64-pc-linux-gnu-gcc -c -march=native -O2 -pipe  conftest.c >&5
configure:9142: $? = 0
configure:9146: /usr/bin/x86_64-pc-linux-gnu-nm -B conftest.o \| sed -n -e 's/^.*[ ]\([ABCDGIRSTW][ABCDGIRSTW]*\)[ ][ ]*\([_A-Za-z][_A-Za-z0-9]*\)$/\1 \2 \2/p' | sed '/ __gnu_lto/d' \> conftest.nm
configure:9149: $? = 0
configure:9215: x86_64-pc-linux-gnu-gcc -o conftest -march=native -O2 -pipe  -Wl,-O1 -Wl,--as-needed conftest.c conftstm.o >&5
configure:9218: $? = 0
configure:9256: result: ok
configure:9303: checking for sysroot
configure:9333: result: no
configure:9340: checking for a working dd
configure:9378: result: /bin/dd
configure:9382: checking how to truncate binary pipes
configure:9397: result: /bin/dd bs=4096 count=1
configure:9533: x86_64-pc-linux-gnu-gcc -c -march=native -O2 -pipe  conftest.c >&5
configure:9536: $? = 0
configure:9686: checking for x86_64-pc-linux-gnu-mt
configure:9716: result: no
configure:9726: checking for mt
configure:9756: result: no
configure:9776: checking if : is a manifest tool
configure:9782: : '-?'
configure:9790: result: no
configure:10467: checking how to run the C preprocessor
configure:10498: x86_64-pc-linux-gnu-gcc -E  conftest.c
configure:10498: $? = 0
configure:10512: x86_64-pc-linux-gnu-gcc -E  conftest.c
conftest.c:9:28: fatal error: ac_nonexistent.h: No such file or directory
 #include <ac_nonexistent.h>
                            ^
compilation terminated.
configure:10512: $? = 1
configure: failed program was:
| /* confdefs.h */
| #define PACKAGE_NAME "TeX Live"
| #define PACKAGE_TARNAME "tex-live"
| #define PACKAGE_VERSION "2016-05-23"
| #define PACKAGE_STRING "TeX Live 2016-05-23"
| #define PACKAGE_BUGREPORT "tex-k@tug.org"
| #define PACKAGE_URL ""
| /* end confdefs.h.  */
| #include <ac_nonexistent.h>
configure:10537: result: x86_64-pc-linux-gnu-gcc -E
configure:10557: x86_64-pc-linux-gnu-gcc -E  conftest.c
configure:10557: $? = 0
configure:10571: x86_64-pc-linux-gnu-gcc -E  conftest.c
conftest.c:9:28: fatal error: ac_nonexistent.h: No such file or directory
 #include <ac_nonexistent.h>
                            ^
compilation terminated.
configure:10571: $? = 1
configure: failed program was:
| /* confdefs.h */
| #define PACKAGE_NAME "TeX Live"
| #define PACKAGE_TARNAME "tex-live"
| #define PACKAGE_VERSION "2016-05-23"
| #define PACKAGE_STRING "TeX Live 2016-05-23"
| #define PACKAGE_BUGREPORT "tex-k@tug.org"
| #define PACKAGE_URL ""
| /* end confdefs.h.  */
| #include <ac_nonexistent.h>
configure:10600: checking for ANSI C header files
configure:10620: x86_64-pc-linux-gnu-gcc -c -march=native -O2 -pipe  conftest.c >&5
configure:10620: $? = 0
configure:10693: x86_64-pc-linux-gnu-gcc -o conftest -march=native -O2 -pipe  -Wl,-O1 -Wl,--as-needed conftest.c  >&5
configure:10693: $? = 0
configure:10693: ./conftest
configure:10693: $? = 0
configure:10704: result: yes
configure:10811: checking how to create a pax tar archive
configure:10822: tar --version
tar (GNU tar) 1.29
Copyright (C) 2015 Free Software Foundation, Inc.
License GPLv3+: GNU GPL version 3 or later <http://gnu.org/licenses/gpl.html>.
This is free software: you are free to change and redistribute it.
There is NO WARRANTY, to the extent permitted by law.

Written by John Gilmore and Jay Fenlason.
configure:10825: $? = 0
configure:10865: tardir=conftest.dir && eval tar --format=posix -chf - "$tardir" >conftest.tar
configure:10868: $? = 0
configure:10872: tar -xf - <conftest.tar
configure:10875: $? = 0
configure:10877: cat conftest.dir/file
GrepMe
configure:10880: $? = 0
configure:10893: result: gnutar
configure:10902: checking dependency style of x86_64-pc-linux-gnu-gcc
configure:11013: result: none
configure:11072: checking whether to enable maintainer-specific portions of Makefiles
configure:11081: result: no
configure:11094: checking whether the compiler accepts prototypes
configure:11110: x86_64-pc-linux-gnu-gcc -o conftest -march=native -O2 -pipe  -Wl,-O1 -Wl,--as-needed conftest.c  >&5
configure:11110: $? = 0
configure:11118: result: yes
configure:11123: checking what warning flags to pass to the C compiler
configure:11168: result: -Wimplicit -Wreturn-type
configure:11722: checking for objdir
configure:11737: result: .libs
configure:12001: checking if x86_64-pc-linux-gnu-gcc supports -fno-rtti -fno-exceptions
configure:12019: x86_64-pc-linux-gnu-gcc -c -march=native -O2 -pipe  -fno-rtti -fno-exceptions conftest.c >&5
cc1: warning: command line option '-fno-rtti' is valid for C++/ObjC++ but not for C
configure:12023: $? = 0
configure:12036: result: no
configure:16360: checking assert.h usability
configure:16360: x86_64-pc-linux-gnu-gcc -c -march=native -O2 -pipe  conftest.c >&5
configure:16360: $? = 0
configure:16360: result: yes
configure:16360: checking assert.h presence
configure:16360: x86_64-pc-linux-gnu-gcc -E  conftest.c
configure:16360: $? = 0
configure:16360: result: yes
configure:16360: checking for assert.h
configure:16360: result: yes
configure:16360: checking float.h usability
configure:16360: x86_64-pc-linux-gnu-gcc -c -march=native -O2 -pipe  conftest.c >&5
configure:16360: $? = 0
configure:16360: result: yes
configure:16360: checking float.h presence
configure:16360: x86_64-pc-linux-gnu-gcc -E  conftest.c
configure:16360: $? = 0
configure:16360: result: yes
configure:16360: checking for float.h
configure:16360: result: yes
configure:16360: checking limits.h usability
configure:16360: x86_64-pc-linux-gnu-gcc -c -march=native -O2 -pipe  conftest.c >&5
configure:16360: $? = 0
configure:16360: result: yes
configure:16360: checking limits.h presence
configure:16360: x86_64-pc-linux-gnu-gcc -E  conftest.c
configure:16360: $? = 0
configure:16360: result: yes
configure:16360: checking for limits.h
configure:16360: result: yes
configure:16360: checking pwd.h usability
configure:16360: x86_64-pc-linux-gnu-gcc -c -march=native -O2 -pipe  conftest.c >&5
configure:16360: $? = 0
configure:16360: result: yes
configure:16360: checking pwd.h presence
configure:16360: x86_64-pc-linux-gnu-gcc -E  conftest.c
configure:16360: $? = 0
configure:16360: result: yes
configure:16360: checking for pwd.h
configure:16360: result: yes
configure:16360: checking for stdlib.h
configure:16360: result: yes
configure:16360: checking sys/param.h usability
configure:16360: x86_64-pc-linux-gnu-gcc -c -march=native -O2 -pipe  conftest.c >&5
configure:16360: $? = 0
configure:16360: result: yes
configure:16360: checking sys/param.h presence
configure:16360: x86_64-pc-linux-gnu-gcc -E  conftest.c
configure:16360: $? = 0
configure:16360: result: yes
configure:16360: checking for sys/param.h
configure:16360: result: yes
configure:16372: checking for putenv
configure:16372: x86_64-pc-linux-gnu-gcc -o conftest -march=native -O2 -pipe  -Wl,-O1 -Wl,--as-needed conftest.c  >&5
configure:16372: $? = 0
configure:16372: result: yes
configure:16384: checking for getcwd
configure:16384: x86_64-pc-linux-gnu-gcc -o conftest -march=native -O2 -pipe  -Wl,-O1 -Wl,--as-needed conftest.c  >&5
configure:16384: $? = 0
configure:16384: result: yes
configure:16384: checking for getwd
configure:16384: x86_64-pc-linux-gnu-gcc -o conftest -march=native -O2 -pipe  -Wl,-O1 -Wl,--as-needed conftest.c  >&5
/var/tmp/portage/app-text/texlive-core-2017-r3/temp/ccRvWYRU.o: In function `main':
conftest.c:(.text.startup+0x7): warning: the `getwd' function is dangerous and should not be used.
configure:16384: $? = 0
configure:16384: result: yes
configure:16384: checking for memcmp
configure:16384: x86_64-pc-linux-gnu-gcc -o conftest -march=native -O2 -pipe  -Wl,-O1 -Wl,--as-needed conftest.c  >&5
conftest.c:58:6: warning: conflicting types for built-in function 'memcmp'
 char memcmp ();
      ^~~~~~
configure:16384: $? = 0
configure:16384: result: yes
configure:16384: checking for memcpy
configure:16384: x86_64-pc-linux-gnu-gcc -o conftest -march=native -O2 -pipe  -Wl,-O1 -Wl,--as-needed conftest.c  >&5
conftest.c:59:6: warning: conflicting types for built-in function 'memcpy'
 char memcpy ();
      ^~~~~~
configure:16384: $? = 0
configure:16384: result: yes
configure:16384: checking for mkstemp
configure:16384: x86_64-pc-linux-gnu-gcc -o conftest -march=native -O2 -pipe  -Wl,-O1 -Wl,--as-needed conftest.c  >&5
configure:16384: $? = 0
configure:16384: result: yes
configure:16384: checking for mktemp
configure:16384: x86_64-pc-linux-gnu-gcc -o conftest -march=native -O2 -pipe  -Wl,-O1 -Wl,--as-needed conftest.c  >&5
/var/tmp/portage/app-text/texlive-core-2017-r3/temp/ccYgc1n9.o: In function `main':
conftest.c:(.text.startup+0x7): warning: the use of `mktemp' is dangerous, better use `mkstemp' or `mkdtemp'
configure:16384: $? = 0
configure:16384: result: yes
configure:16384: checking for strchr
configure:16384: x86_64-pc-linux-gnu-gcc -o conftest -march=native -O2 -pipe  -Wl,-O1 -Wl,--as-needed conftest.c  >&5
conftest.c:62:6: warning: conflicting types for built-in function 'strchr'
 char strchr ();
      ^~~~~~
configure:16384: $? = 0
configure:16384: result: yes
configure:16384: checking for strrchr
configure:16384: x86_64-pc-linux-gnu-gcc -o conftest -march=native -O2 -pipe  -Wl,-O1 -Wl,--as-needed conftest.c  >&5
conftest.c:63:6: warning: conflicting types for built-in function 'strrchr'
 char strrchr ();
      ^~~~~~~
configure:16384: $? = 0
configure:16384: result: yes
configure:16393: checking for an ANSI C-conforming const
configure:16459: x86_64-pc-linux-gnu-gcc -c -march=native -O2 -pipe  conftest.c >&5
configure:16459: $? = 0
configure:16466: result: yes
configure:16474: checking for inline
configure:16490: x86_64-pc-linux-gnu-gcc -c -march=native -O2 -pipe  conftest.c >&5
configure:16490: $? = 0
configure:16498: result: inline
configure:16516: checking for size_t
configure:16516: x86_64-pc-linux-gnu-gcc -c -march=native -O2 -pipe  conftest.c >&5
configure:16516: $? = 0
configure:16516: x86_64-pc-linux-gnu-gcc -c -march=native -O2 -pipe  conftest.c >&5
conftest.c: In function 'main':
conftest.c:77:21: error: expected expression before ')' token
 if (sizeof ((size_t)))
                     ^
configure:16516: $? = 1
configure: failed program was:
| /* confdefs.h */
| #define PACKAGE_NAME "TeX Live"
| #define PACKAGE_TARNAME "tex-live"
| #define PACKAGE_VERSION "2016-05-23"
| #define PACKAGE_STRING "TeX Live 2016-05-23"
| #define PACKAGE_BUGREPORT "tex-k@tug.org"
| #define PACKAGE_URL ""
| #define STDC_HEADERS 1
| #define HAVE_SYS_TYPES_H 1
| #define HAVE_SYS_STAT_H 1
| #define HAVE_STDLIB_H 1
| #define HAVE_STRING_H 1
| #define HAVE_MEMORY_H 1
| #define HAVE_STRINGS_H 1
| #define HAVE_INTTYPES_H 1
| #define HAVE_STDINT_H 1
| #define HAVE_UNISTD_H 1
| #define HAVE_DLFCN_H 1
| #define PACKAGE "tex-live"
| #define VERSION "2016-05-23"
| #define LT_OBJDIR ".libs/"
| #define HAVE_FSEEKO 1
| #define HAVE_DIRENT_H 1
| #define STDC_HEADERS 1
| #define HAVE_ASSERT_H 1
| #define HAVE_FLOAT_H 1
| #define HAVE_LIMITS_H 1
| #define HAVE_PWD_H 1
| #define HAVE_STDLIB_H 1
| #define HAVE_SYS_PARAM_H 1
| #define HAVE_PUTENV 1
| #define HAVE_GETCWD 1
| #define HAVE_GETWD 1
| #define HAVE_MEMCMP 1
| #define HAVE_MEMCPY 1
| #define HAVE_MKSTEMP 1
| #define HAVE_MKTEMP 1
| #define HAVE_STRCHR 1
| #define HAVE_STRRCHR 1
| /* end confdefs.h.  */
| #include <stdio.h>
| #ifdef HAVE_SYS_TYPES_H
| # include <sys/types.h>
| #endif
| #ifdef HAVE_SYS_STAT_H
| # include <sys/stat.h>
| #endif
| #ifdef STDC_HEADERS
| # include <stdlib.h>
| # include <stddef.h>
| #else
| # ifdef HAVE_STDLIB_H
| #  include <stdlib.h>
| # endif
| #endif
| #ifdef HAVE_STRING_H
| # if !defined STDC_HEADERS && defined HAVE_MEMORY_H
| #  include <memory.h>
| # endif
| # include <string.h>
| #endif
| #ifdef HAVE_STRINGS_H
| # include <strings.h>
| #endif
| #ifdef HAVE_INTTYPES_H
| # include <inttypes.h>
| #endif
| #ifdef HAVE_STDINT_H
| # include <stdint.h>
| #endif
| #ifdef HAVE_UNISTD_H
| # include <unistd.h>
| #endif
| int
| main ()
| {
| if (sizeof ((size_t)))
|        return 0;
|   ;
|   return 0;
| }
configure:16516: result: yes
configure:16527: checking for int64_t
configure:16527: x86_64-pc-linux-gnu-gcc -c -march=native -O2 -pipe  conftest.c >&5
configure:16527: $? = 0
configure:16527: x86_64-pc-linux-gnu-gcc -c -march=native -O2 -pipe  conftest.c >&5
conftest.c: In function 'main':
conftest.c:79:53: warning: integer overflow in expression [-Woverflow]
    < (int64_t) (((((int64_t) 1 << N) << N) - 1) * 2 + 2))];
                                                     ^
conftest.c:78:12: error: storage size of 'test_array' isn't constant
 static int test_array [1 - 2 * !((int64_t) (((((int64_t) 1 << N) << N) - 1) * 2 + 1)
            ^~~~~~~~~~
configure:16527: $? = 1
configure: failed program was:
| /* confdefs.h */
| #define PACKAGE_NAME "TeX Live"
| #define PACKAGE_TARNAME "tex-live"
| #define PACKAGE_VERSION "2016-05-23"
| #define PACKAGE_STRING "TeX Live 2016-05-23"
| #define PACKAGE_BUGREPORT "tex-k@tug.org"
| #define PACKAGE_URL ""
| #define STDC_HEADERS 1
| #define HAVE_SYS_TYPES_H 1
| #define HAVE_SYS_STAT_H 1
| #define HAVE_STDLIB_H 1
| #define HAVE_STRING_H 1
| #define HAVE_MEMORY_H 1
| #define HAVE_STRINGS_H 1
| #define HAVE_INTTYPES_H 1
| #define HAVE_STDINT_H 1
| #define HAVE_UNISTD_H 1
| #define HAVE_DLFCN_H 1
| #define PACKAGE "tex-live"
| #define VERSION "2016-05-23"
| #define LT_OBJDIR ".libs/"
| #define HAVE_FSEEKO 1
| #define HAVE_DIRENT_H 1
| #define STDC_HEADERS 1
| #define HAVE_ASSERT_H 1
| #define HAVE_FLOAT_H 1
| #define HAVE_LIMITS_H 1
| #define HAVE_PWD_H 1
| #define HAVE_STDLIB_H 1
| #define HAVE_SYS_PARAM_H 1
| #define HAVE_PUTENV 1
| #define HAVE_GETCWD 1
| #define HAVE_GETWD 1
| #define HAVE_MEMCMP 1
| #define HAVE_MEMCPY 1
| #define HAVE_MKSTEMP 1
| #define HAVE_MKTEMP 1
| #define HAVE_STRCHR 1
| #define HAVE_STRRCHR 1
| /* end confdefs.h.  */
| #include <stdio.h>
| #ifdef HAVE_SYS_TYPES_H
| # include <sys/types.h>
| #endif
| #ifdef HAVE_SYS_STAT_H
| # include <sys/stat.h>
| #endif
| #ifdef STDC_HEADERS
| # include <stdlib.h>
| # include <stddef.h>
| #else
| # ifdef HAVE_STDLIB_H
| #  include <stdlib.h>
| # endif
| #endif
| #ifdef HAVE_STRING_H
| # if !defined STDC_HEADERS && defined HAVE_MEMORY_H
| #  include <memory.h>
| # endif
| # include <string.h>
| #endif
| #ifdef HAVE_STRINGS_H
| # include <strings.h>
| #endif
| #ifdef HAVE_INTTYPES_H
| # include <inttypes.h>
| #endif
| #ifdef HAVE_STDINT_H
| # include <stdint.h>
| #endif
| #ifdef HAVE_UNISTD_H
| # include <unistd.h>
| #endif
|            enum { N = 64 / 2 - 1 };
| int
| main ()
| {
| static int test_array [1 - 2 * !((int64_t) (((((int64_t) 1 << N) << N) - 1) * 2 + 1)
|        < (int64_t) (((((int64_t) 1 << N) << N) - 1) * 2 + 2))];
| test_array [0] = 0;
| return test_array [0];
|
|   ;
|   return 0;
| }
configure:16527: result: yes
configure:16538: checking for uint64_t
configure:16538: x86_64-pc-linux-gnu-gcc -c -march=native -O2 -pipe  conftest.c >&5
configure:16538: $? = 0
configure:16538: result: yes
configure:16558: checking whether isascii is declared
configure:16558: x86_64-pc-linux-gnu-gcc -c -march=native -O2 -pipe  conftest.c >&5
configure:16558: $? = 0
configure:16558: result: yes
configure:16570: checking for struct stat.st_mtim
configure:16570: x86_64-pc-linux-gnu-gcc -c -march=native -O2 -pipe  conftest.c >&5
conftest.c: In function 'main':
conftest.c:79:5: error: used struct type value where scalar is required
 if (ac_aggr.st_mtim)
     ^~~~~~~
configure:16570: $? = 1
configure: failed program was:
| /* confdefs.h */
| #define PACKAGE_NAME "TeX Live"
| #define PACKAGE_TARNAME "tex-live"
| #define PACKAGE_VERSION "2016-05-23"
| #define PACKAGE_STRING "TeX Live 2016-05-23"
| #define PACKAGE_BUGREPORT "tex-k@tug.org"
| #define PACKAGE_URL ""
| #define STDC_HEADERS 1
| #define HAVE_SYS_TYPES_H 1
| #define HAVE_SYS_STAT_H 1
| #define HAVE_STDLIB_H 1
| #define HAVE_STRING_H 1
| #define HAVE_MEMORY_H 1
| #define HAVE_STRINGS_H 1
| #define HAVE_INTTYPES_H 1
| #define HAVE_STDINT_H 1
| #define HAVE_UNISTD_H 1
| #define HAVE_DLFCN_H 1
| #define PACKAGE "tex-live"
| #define VERSION "2016-05-23"
| #define LT_OBJDIR ".libs/"
| #define HAVE_FSEEKO 1
| #define HAVE_DIRENT_H 1
| #define STDC_HEADERS 1
| #define HAVE_ASSERT_H 1
| #define HAVE_FLOAT_H 1
| #define HAVE_LIMITS_H 1
| #define HAVE_PWD_H 1
| #define HAVE_STDLIB_H 1
| #define HAVE_SYS_PARAM_H 1
| #define HAVE_PUTENV 1
| #define HAVE_GETCWD 1
| #define HAVE_GETWD 1
| #define HAVE_MEMCMP 1
| #define HAVE_MEMCPY 1
| #define HAVE_MKSTEMP 1
| #define HAVE_MKTEMP 1
| #define HAVE_STRCHR 1
| #define HAVE_STRRCHR 1
| #define HAVE_DECL_ISASCII 1
| /* end confdefs.h.  */
| #include <stdio.h>
| #ifdef HAVE_SYS_TYPES_H
| # include <sys/types.h>
| #endif
| #ifdef HAVE_SYS_STAT_H
| # include <sys/stat.h>
| #endif
| #ifdef STDC_HEADERS
| # include <stdlib.h>
| # include <stddef.h>
| #else
| # ifdef HAVE_STDLIB_H
| #  include <stdlib.h>
| # endif
| #endif
| #ifdef HAVE_STRING_H
| # if !defined STDC_HEADERS && defined HAVE_MEMORY_H
| #  include <memory.h>
| # endif
| # include <string.h>
| #endif
| #ifdef HAVE_STRINGS_H
| # include <strings.h>
| #endif
| #ifdef HAVE_INTTYPES_H
| # include <inttypes.h>
| #endif
| #ifdef HAVE_STDINT_H
| # include <stdint.h>
| #endif
| #ifdef HAVE_UNISTD_H
| # include <unistd.h>
| #endif
| int
| main ()
| {
| static struct stat ac_aggr;
| if (ac_aggr.st_mtim)
| return 0;
|   ;
|   return 0;
| }
configure:16570: x86_64-pc-linux-gnu-gcc -c -march=native -O2 -pipe  conftest.c >&5
configure:16570: $? = 0
configure:16570: result: yes
configure:16589: checking for X
configure:16697: x86_64-pc-linux-gnu-gcc -E  conftest.c
configure:16697: $? = 0
configure:16728: x86_64-pc-linux-gnu-gcc -o conftest -march=native -O2 -pipe  -Wl,-O1 -Wl,--as-needed conftest.c -lX11  >&5
configure:16728: $? = 0
configure:16778: result: libraries , headers
configure:16877: x86_64-pc-linux-gnu-gcc -o conftest -march=native -O2 -pipe  -Wl,-O1 -Wl,--as-needed conftest.c   -lX11 >&5
configure:16877: $? = 0
configure:16975: checking for gethostbyname
configure:16975: x86_64-pc-linux-gnu-gcc -o conftest -march=native -O2 -pipe  -Wl,-O1 -Wl,--as-needed conftest.c  >&5
configure:16975: $? = 0
configure:16975: result: yes
configure:17072: checking for connect
configure:17072: x86_64-pc-linux-gnu-gcc -o conftest -march=native -O2 -pipe  -Wl,-O1 -Wl,--as-needed conftest.c  >&5
configure:17072: $? = 0
configure:17072: result: yes
configure:17121: checking for remove
configure:17121: x86_64-pc-linux-gnu-gcc -o conftest -march=native -O2 -pipe  -Wl,-O1 -Wl,--as-needed conftest.c  >&5
configure:17121: $? = 0
configure:17121: result: yes
configure:17170: checking for shmat
configure:17170: x86_64-pc-linux-gnu-gcc -o conftest -march=native -O2 -pipe  -Wl,-O1 -Wl,--as-needed conftest.c  >&5
configure:17170: $? = 0
configure:17170: result: yes
configure:17228: checking for IceConnectionNumber in -lICE
configure:17253: x86_64-pc-linux-gnu-gcc -o conftest -march=native -O2 -pipe  -Wl,-O1 -Wl,--as-needed conftest.c -lICE   >&5
configure:17253: $? = 0
configure:17262: result: yes
configure:17385: checking for C++ compiler version
configure:17394: x86_64-pc-linux-gnu-g++ --version >&5
x86_64-pc-linux-gnu-g++ (Gentoo 6.4.0-r1 p1.3) 6.4.0
Copyright (C) 2017 Free Software Foundation, Inc.
This is free software; see the source for copying conditions.  There is NO
warranty; not even for MERCHANTABILITY or FITNESS FOR A PARTICULAR PURPOSE.

configure:17405: $? = 0
configure:17394: x86_64-pc-linux-gnu-g++ -v >&5
Using built-in specs.
COLLECT_GCC=/usr/x86_64-pc-linux-gnu/gcc-bin/6.4.0/x86_64-pc-linux-gnu-g++
COLLECT_LTO_WRAPPER=/usr/libexec/gcc/x86_64-pc-linux-gnu/6.4.0/lto-wrapper
Target: x86_64-pc-linux-gnu
Configured with: /var/tmp/portage/sys-devel/gcc-6.4.0-r1/work/gcc-6.4.0/configure --host=x86_64-pc-linux-gnu --build=x86_64-pc-linux-gnu --prefix=/usr --bindir=/usr/x86_64-pc-linux-gnu/gcc-bin/6.4.0 --includedir=/usr/lib/gcc/x86_64-pc-linux-gnu/6.4.0/include --datadir=/usr/share/gcc-data/x86_64-pc-linux-gnu/6.4.0 --mandir=/usr/share/gcc-data/x86_64-pc-linux-gnu/6.4.0/man --infodir=/usr/share/gcc-data/x86_64-pc-linux-gnu/6.4.0/info --with-gxx-include-dir=/usr/lib/gcc/x86_64-pc-linux-gnu/6.4.0/include/g++-v6 --with-python-dir=/share/gcc-data/x86_64-pc-linux-gnu/6.4.0/python --enable-languages=c,c++,fortran --enable-obsolete --enable-secureplt --disable-werror --with-system-zlib --enable-nls --without-included-gettext --enable-checking=release --with-bugurl=https://bugs.gentoo.org/ --with-pkgversion='Gentoo 6.4.0-r1 p1.3' --disable-esp --enable-libstdcxx-time --enable-shared --enable-threads=posix --enable-__cxa_atexit --enable-clocale=gnu --enable-multilib --with-multilib-list=m32,m64 --disable-altivec --disable-fixed-point --enable-targets=all --disable-libgcj --enable-libgomp --disable-libmudflap --disable-libssp --disable-libcilkrts --disable-libmpx --enable-vtable-verify --enable-libvtv --enable-lto --without-isl --enable-libsanitizer --enable-default-pie --enable-default-ssp
Thread model: posix
gcc version 6.4.0 (Gentoo 6.4.0-r1 p1.3)
configure:17405: $? = 0
configure:17394: x86_64-pc-linux-gnu-g++ -V >&5
x86_64-pc-linux-gnu-g++: error: unrecognized command line option '-V'
x86_64-pc-linux-gnu-g++: fatal error: no input files
compilation terminated.
configure:17405: $? = 1
configure:17394: x86_64-pc-linux-gnu-g++ -qversion >&5
x86_64-pc-linux-gnu-g++: error: unrecognized command line option '-qversion'; did you mean '--version'?
x86_64-pc-linux-gnu-g++: fatal error: no input files
compilation terminated.
configure:17405: $? = 1
configure:17409: checking whether we are using the GNU C++ compiler
configure:17428: x86_64-pc-linux-gnu-g++ -c -march=native -O2 -pipe -std=c++11  conftest.cpp >&5
configure:17428: $? = 0
configure:17437: result: yes
configure:17446: checking whether x86_64-pc-linux-gnu-g++ accepts -g
configure:17466: x86_64-pc-linux-gnu-g++ -c -g  conftest.cpp >&5
configure:17466: $? = 0
configure:17507: result: yes
configure:17532: checking dependency style of x86_64-pc-linux-gnu-g++
configure:17643: result: none
configure:17657: checking what warning flags to pass to the C++ compiler
configure:17698: result: -Wreturn-type -Wno-write-strings
configure:17722: checking how to run the C++ preprocessor
configure:17749: x86_64-pc-linux-gnu-g++ -E  conftest.cpp
configure:17749: $? = 0
configure:17763: x86_64-pc-linux-gnu-g++ -E  conftest.cpp
conftest.cpp:43:28: fatal error: ac_nonexistent.h: No such file or directory
 #include <ac_nonexistent.h>
                            ^
compilation terminated.
configure:17763: $? = 1
configure: failed program was:
| /* confdefs.h */
| #define PACKAGE_NAME "TeX Live"
| #define PACKAGE_TARNAME "tex-live"
| #define PACKAGE_VERSION "2016-05-23"
| #define PACKAGE_STRING "TeX Live 2016-05-23"
| #define PACKAGE_BUGREPORT "tex-k@tug.org"
| #define PACKAGE_URL ""
| #define STDC_HEADERS 1
| #define HAVE_SYS_TYPES_H 1
| #define HAVE_SYS_STAT_H 1
| #define HAVE_STDLIB_H 1
| #define HAVE_STRING_H 1
| #define HAVE_MEMORY_H 1
| #define HAVE_STRINGS_H 1
| #define HAVE_INTTYPES_H 1
| #define HAVE_STDINT_H 1
| #define HAVE_UNISTD_H 1
| #define HAVE_DLFCN_H 1
| #define PACKAGE "tex-live"
| #define VERSION "2016-05-23"
| #define LT_OBJDIR ".libs/"
| #define HAVE_FSEEKO 1
| #define HAVE_DIRENT_H 1
| #define STDC_HEADERS 1
| #define HAVE_ASSERT_H 1
| #define HAVE_FLOAT_H 1
| #define HAVE_LIMITS_H 1
| #define HAVE_PWD_H 1
| #define HAVE_STDLIB_H 1
| #define HAVE_SYS_PARAM_H 1
| #define HAVE_PUTENV 1
| #define HAVE_GETCWD 1
| #define HAVE_GETWD 1
| #define HAVE_MEMCMP 1
| #define HAVE_MEMCPY 1
| #define HAVE_MKSTEMP 1
| #define HAVE_MKTEMP 1
| #define HAVE_STRCHR 1
| #define HAVE_STRRCHR 1
| #define HAVE_DECL_ISASCII 1
| #define HAVE_STRUCT_STAT_ST_MTIM 1
| /* end confdefs.h.  */
| #include <ac_nonexistent.h>
configure:17788: result: x86_64-pc-linux-gnu-g++ -E
configure:17808: x86_64-pc-linux-gnu-g++ -E  conftest.cpp
configure:17808: $? = 0
configure:17822: x86_64-pc-linux-gnu-g++ -E  conftest.cpp
conftest.cpp:43:28: fatal error: ac_nonexistent.h: No such file or directory
 #include <ac_nonexistent.h>
                            ^
compilation terminated.
configure:17822: $? = 1
configure: failed program was:
| /* confdefs.h */
| #define PACKAGE_NAME "TeX Live"
| #define PACKAGE_TARNAME "tex-live"
| #define PACKAGE_VERSION "2016-05-23"
| #define PACKAGE_STRING "TeX Live 2016-05-23"
| #define PACKAGE_BUGREPORT "tex-k@tug.org"
| #define PACKAGE_URL ""
| #define STDC_HEADERS 1
| #define HAVE_SYS_TYPES_H 1
| #define HAVE_SYS_STAT_H 1
| #define HAVE_STDLIB_H 1
| #define HAVE_STRING_H 1
| #define HAVE_MEMORY_H 1
| #define HAVE_STRINGS_H 1
| #define HAVE_INTTYPES_H 1
| #define HAVE_STDINT_H 1
| #define HAVE_UNISTD_H 1
| #define HAVE_DLFCN_H 1
| #define PACKAGE "tex-live"
| #define VERSION "2016-05-23"
| #define LT_OBJDIR ".libs/"
| #define HAVE_FSEEKO 1
| #define HAVE_DIRENT_H 1
| #define STDC_HEADERS 1
| #define HAVE_ASSERT_H 1
| #define HAVE_FLOAT_H 1
| #define HAVE_LIMITS_H 1
| #define HAVE_PWD_H 1
| #define HAVE_STDLIB_H 1
| #define HAVE_SYS_PARAM_H 1
| #define HAVE_PUTENV 1
| #define HAVE_GETCWD 1
| #define HAVE_GETWD 1
| #define HAVE_MEMCMP 1
| #define HAVE_MEMCPY 1
| #define HAVE_MKSTEMP 1
| #define HAVE_MKTEMP 1
| #define HAVE_STRCHR 1
| #define HAVE_STRRCHR 1
| #define HAVE_DECL_ISASCII 1
| #define HAVE_STRUCT_STAT_ST_MTIM 1
| /* end confdefs.h.  */
| #include <ac_nonexistent.h>
configure:17984: checking for ld used by x86_64-pc-linux-gnu-g++
configure:18051: result: /usr/x86_64-pc-linux-gnu/bin/ld -m elf_x86_64
configure:18058: checking if the linker (/usr/x86_64-pc-linux-gnu/bin/ld -m elf_x86_64) is GNU ld
configure:18073: result: yes
configure:18128: checking whether the x86_64-pc-linux-gnu-g++ linker (/usr/x86_64-pc-linux-gnu/bin/ld -m elf_x86_64) supports shared libraries
configure:19201: result: yes
configure:19237: x86_64-pc-linux-gnu-g++ -c -march=native -O2 -pipe -std=c++11  conftest.cpp >&5
configure:19240: $? = 0
configure:19721: checking for x86_64-pc-linux-gnu-g++ option to produce PIC
configure:19728: result: -fPIC -DPIC
configure:19736: checking if x86_64-pc-linux-gnu-g++ PIC flag -fPIC -DPIC works
configure:19754: x86_64-pc-linux-gnu-g++ -c -march=native -O2 -pipe -std=c++11  -fPIC -DPIC -DPIC conftest.cpp >&5
configure:19758: $? = 0
configure:19771: result: yes
configure:19794: checking if x86_64-pc-linux-gnu-g++ static flag -static works
configure:19822: result: yes
configure:19834: checking if x86_64-pc-linux-gnu-g++ supports -c -o file.o
configure:19855: x86_64-pc-linux-gnu-g++ -c -march=native -O2 -pipe -std=c++11  -o out/conftest2.o conftest.cpp >&5
configure:19859: $? = 0
configure:19881: result: yes
configure:19886: checking if x86_64-pc-linux-gnu-g++ supports -c -o file.o
configure:19933: result: yes
configure:19963: checking whether the x86_64-pc-linux-gnu-g++ linker (/usr/x86_64-pc-linux-gnu/bin/ld -m elf_x86_64) supports shared libraries
configure:20003: result: yes
configure:20144: checking dynamic linker characteristics
configure:20889: result: GNU/Linux ld.so
configure:20954: checking how to hardcode library paths into programs
configure:20979: result: immediate
configure:21020: checking whether ln -s works
configure:21024: result: yes
configure:21077: checking for TeX specific libraries to build
configure:21090: result:
configure:21101: checking for x86_64-pc-linux-gnu-pkg-config
configure:21117: found /usr/bin/x86_64-pc-linux-gnu-pkg-config
configure:21128: result: x86_64-pc-linux-gnu-pkg-config
configure:21230: checking for x86_64-pc-linux-gnu-freetype-config
configure:21260: result: no
configure:21270: checking for freetype-config
configure:21286: found /usr/bin/freetype-config
configure:21297: result: freetype-config
configure:21415: checking for x86_64-pc-linux-gnu-icu-config
configure:21431: found /usr/bin/x86_64-pc-linux-gnu-icu-config
configure:21442: result: x86_64-pc-linux-gnu-icu-config
configure:21525: checking requested system `kpathsea' library
configure:21542: x86_64-pc-linux-gnu-gcc -o conftest -march=native -O2 -pipe -I/usr/lib64  -Wl,-O1 -Wl,--as-needed conftest.c -lkpathsea  >&5
configure:21542: $? = 0
configure:21549: result: ok
configure:21586: checking requested system `zlib' library
configure:21603: x86_64-pc-linux-gnu-gcc -o conftest -march=native -O2 -pipe  -I/usr/lib64  -Wl,-O1 -Wl,--as-needed conftest.c -lz -lkpathsea  >&5
configure:21603: $? = 0
configure:21610: result: ok
configure:21617: checking requested system `libpaper' library
configure:21632: x86_64-pc-linux-gnu-gcc -o conftest -march=native -O2 -pipe   -I/usr/lib64  -Wl,-O1 -Wl,--as-needed conftest.c -lpaper -lz -lkpathsea  >&5
configure:21632: $? = 0
configure:21639: result: ok
configure:21646: checking requested system `libpng' library
configure:21662: x86_64-pc-linux-gnu-gcc -o conftest -march=native -O2 -pipe -I/usr/include/libpng16   -I/usr/lib64  -Wl,-O1 -Wl,--as-needed conftest.c -lpng16 -lz -lpaper -lz -lkpathsea  >&5
configure:21662: $? = 0
configure:21669: result: ok
configure:21676: checking requested system `freetype2' library
configure:21692: x86_64-pc-linux-gnu-gcc -o conftest -march=native -O2 -pipe -I/usr/include/freetype2 -I/usr/include/libpng16   -I/usr/lib64  -Wl,-O1 -Wl,--as-needed conftest.c -lfreetype -lpng16 -lz -lpaper -lz -lkpathsea  >&5
configure:21692: $? = 0
configure:21699: result: ok
configure:21766: checking requested system `pixman' library
configure:21781: x86_64-pc-linux-gnu-gcc -o conftest -march=native -O2 -pipe -I/usr/include/pixman-1 -I/usr/include/freetype2 -I/usr/include/libpng16   -I/usr/lib64  -Wl,-O1 -Wl,--as-needed conftest.c -lpixman-1 -lfreetype -lpng16 -lz -lpaper -lz -lkpathsea  >&5
configure:21781: $? = 0
configure:21788: result: ok
configure:21795: checking requested system `cairo' library
configure:21810: x86_64-pc-linux-gnu-gcc -o conftest -march=native -O2 -pipe -I/usr/include/cairo -I/usr/include/glib-2.0 -I/usr/lib64/glib-2.0/include -I/usr/include/pixman-1 -I/usr/include/freetype2 -I/usr/include/libdrm -I/usr/include/libpng16 -I/usr/include/pixman-1 -I/usr/include/freetype2 -I/usr/include/libpng16   -I/usr/lib64  -Wl,-O1 -Wl,--as-needed conftest.c -lcairo -lpixman-1 -lfreetype -lpng16 -lz -lpaper -lz -lkpathsea  >&5
configure:21810: $? = 0
configure:21817: result: ok
configure:21824: checking requested system `gmp' library
configure:21839: x86_64-pc-linux-gnu-gcc -o conftest -march=native -O2 -pipe  -I/usr/include/cairo -I/usr/include/glib-2.0 -I/usr/lib64/glib-2.0/include -I/usr/include/pixman-1 -I/usr/include/freetype2 -I/usr/include/libdrm -I/usr/include/libpng16 -I/usr/include/pixman-1 -I/usr/include/freetype2 -I/usr/include/libpng16   -I/usr/lib64  -Wl,-O1 -Wl,--as-needed conftest.c -lgmp -lcairo -lpixman-1 -lfreetype -lpng16 -lz -lpaper -lz -lkpathsea  >&5
configure:21839: $? = 0
configure:21846: result: ok
configure:21853: checking requested system `mpfr' library
configure:21868: x86_64-pc-linux-gnu-gcc -o conftest -march=native -O2 -pipe   -I/usr/include/cairo -I/usr/include/glib-2.0 -I/usr/lib64/glib-2.0/include -I/usr/include/pixman-1 -I/usr/include/freetype2 -I/usr/include/libdrm -I/usr/include/libpng16 -I/usr/include/pixman-1 -I/usr/include/freetype2 -I/usr/include/libpng16   -I/usr/lib64  -Wl,-O1 -Wl,--as-needed conftest.c -lmpfr -lgmp -lcairo -lpixman-1 -lfreetype -lpng16 -lz -lpaper -lz -lkpathsea  >&5
configure:21868: $? = 0
configure:21875: result: ok
configure:21887: checking requested system `poppler' library
configure:21902: x86_64-pc-linux-gnu-g++ -o conftest -march=native -O2 -pipe -std=c++11 -DPOPPLER_VERSION=\"0.62.0\" -I/usr/include/poppler   -I/usr/include/cairo -I/usr/include/glib-2.0 -I/usr/lib64/glib-2.0/include -I/usr/include/pixman-1 -I/usr/include/freetype2 -I/usr/include/libdrm -I/usr/include/libpng16 -I/usr/include/pixman-1 -I/usr/include/freetype2 -I/usr/include/libpng16   -I/usr/lib64  -Wl,-O1 -Wl,--as-needed conftest.cpp -lpoppler -lmpfr -lgmp -lcairo -lpixman-1 -lfreetype -lpng16 -lz -lpaper -lz -lkpathsea  >&5
<command-line>:0:18: warning: missing terminating " character
configure:21902: $? = 0
configure:21909: result: ok
configure:21926: checking requested system `xpdf' library
configure:21941: x86_64-pc-linux-gnu-g++ -o conftest -march=native -O2 -pipe -std=c++11 -DPOPPLER_VERSION=\"0.62.0\" -I/usr/include/poppler -DPOPPLER_VERSION=\"0.62.0\" -I/usr/include/poppler   -I/usr/include/cairo -I/usr/include/glib-2.0 -I/usr/lib64/glib-2.0/include -I/usr/include/pixman-1 -I/usr/include/freetype2 -I/usr/include/libdrm -I/usr/include/libpng16 -I/usr/include/pixman-1 -I/usr/include/freetype2 -I/usr/include/libpng16   -I/usr/lib64  -Wl,-O1 -Wl,--as-needed conftest.cpp -lpoppler -lpoppler -lmpfr -lgmp -lcairo -lpixman-1 -lfreetype -lpng16 -lz -lpaper -lz -lkpathsea  >&5
<command-line>:0:18: warning: missing terminating " character
<command-line>:0:18: warning: missing terminating " character
configure:21941: $? = 0
configure:21948: result: ok
configure:21960: checking requested system `zziplib' library
configure:21975: x86_64-pc-linux-gnu-gcc -o conftest -march=native -O2 -pipe  -DPOPPLER_VERSION=\"0.62.0\" -I/usr/include/poppler -DPOPPLER_VERSION=\"0.62.0\" -I/usr/include/poppler   -I/usr/include/cairo -I/usr/include/glib-2.0 -I/usr/lib64/glib-2.0/include -I/usr/include/pixman-1 -I/usr/include/freetype2 -I/usr/include/libdrm -I/usr/include/libpng16 -I/usr/include/pixman-1 -I/usr/include/freetype2 -I/usr/include/libpng16   -I/usr/lib64  -Wl,-O1 -Wl,--as-needed conftest.c -lzzip -lz -lpoppler -lpoppler -lmpfr -lgmp -lcairo -lpixman-1 -lfreetype -lpng16 -lz -lpaper -lz -lkpathsea  >&5
<command-line>:0:18: warning: missing terminating " character
<command-line>:0:18: warning: missing terminating " character
configure:21975: $? = 0
configure:21982: result: ok
configure:21989: checking requested system `graphite2' library
configure:22005: x86_64-pc-linux-gnu-gcc -o conftest -march=native -O2 -pipe   -DPOPPLER_VERSION=\"0.62.0\" -I/usr/include/poppler -DPOPPLER_VERSION=\"0.62.0\" -I/usr/include/poppler   -I/usr/include/cairo -I/usr/include/glib-2.0 -I/usr/lib64/glib-2.0/include -I/usr/include/pixman-1 -I/usr/include/freetype2 -I/usr/include/libdrm -I/usr/include/libpng16 -I/usr/include/pixman-1 -I/usr/include/freetype2 -I/usr/include/libpng16   -I/usr/lib64  -Wl,-O1 -Wl,--as-needed conftest.c -lgraphite2 -lzzip -lz -lpoppler -lpoppler -lmpfr -lgmp -lcairo -lpixman-1 -lfreetype -lpng16 -lz -lpaper -lz -lkpathsea  >&5
<command-line>:0:18: warning: missing terminating " character
<command-line>:0:18: warning: missing terminating " character
configure:22005: $? = 0
configure:22012: result: ok
configure:22024: checking requested system `teckit' library
configure:22039: x86_64-pc-linux-gnu-g++ -o conftest -march=native -O2 -pipe -std=c++11    -DPOPPLER_VERSION=\"0.62.0\" -I/usr/include/poppler -DPOPPLER_VERSION=\"0.62.0\" -I/usr/include/poppler   -I/usr/include/cairo -I/usr/include/glib-2.0 -I/usr/lib64/glib-2.0/include -I/usr/include/pixman-1 -I/usr/include/freetype2 -I/usr/include/libdrm -I/usr/include/libpng16 -I/usr/include/pixman-1 -I/usr/include/freetype2 -I/usr/include/libpng16   -I/usr/lib64  -Wl,-O1 -Wl,--as-needed conftest.cpp -lTECkit -lgraphite2 -lzzip -lz -lpoppler -lpoppler -lmpfr -lgmp -lcairo -lpixman-1 -lfreetype -lpng16 -lz -lpaper -lz -lkpathsea  >&5
<command-line>:0:18: warning: missing terminating " character
<command-line>:0:18: warning: missing terminating " character
configure:22039: $? = 0
configure:22046: result: ok
configure:22063: checking requested system `icu' library
configure:22079: x86_64-pc-linux-gnu-g++ -o conftest -march=native -O2 -pipe -std=c++11 -DU_DISABLE_RENAMING=1 -I/usr/include     -DPOPPLER_VERSION=\"0.62.0\" -I/usr/include/poppler -DPOPPLER_VERSION=\"0.62.0\" -I/usr/include/poppler   -I/usr/include/cairo -I/usr/include/glib-2.0 -I/usr/lib64/glib-2.0/include -I/usr/include/pixman-1 -I/usr/include/freetype2 -I/usr/include/libdrm -I/usr/include/libpng16 -I/usr/include/pixman-1 -I/usr/include/freetype2 -I/usr/include/libpng16   -I/usr/lib64  -Wl,-O1 -Wl,--as-needed conftest.cpp -L/usr/lib64 -licui18n -licuuc -licudata -lpthread -ldl -lm    -lTECkit -lgraphite2 -lzzip -lz -lpoppler -lpoppler -lmpfr -lgmp -lcairo -lpixman-1 -lfreetype -lpng16 -lz -lpaper -lz -lkpathsea  >&5
<command-line>:0:18: warning: missing terminating " character
<command-line>:0:18: warning: missing terminating " character
configure:22079: $? = 0
configure:22086: result: ok
configure:22098: checking requested system `harfbuzz' library
configure:22113: x86_64-pc-linux-gnu-gcc -o conftest -march=native -O2 -pipe -I/usr/include/harfbuzz -I/usr/include/glib-2.0 -I/usr/lib64/glib-2.0/include -DU_DISABLE_RENAMING=1 -I/usr/include     -DPOPPLER_VERSION=\"0.62.0\" -I/usr/include/poppler -DPOPPLER_VERSION=\"0.62.0\" -I/usr/include/poppler   -I/usr/include/cairo -I/usr/include/glib-2.0 -I/usr/lib64/glib-2.0/include -I/usr/include/pixman-1 -I/usr/include/freetype2 -I/usr/include/libdrm -I/usr/include/libpng16 -I/usr/include/pixman-1 -I/usr/include/freetype2 -I/usr/include/libpng16   -I/usr/lib64  -Wl,-O1 -Wl,--as-needed conftest.c -lharfbuzz-icu -lharfbuzz -L/usr/lib64 -licui18n -licuuc -licudata -lpthread -ldl -lm    -lTECkit -lgraphite2 -lzzip -lz -lpoppler -lpoppler -lmpfr -lgmp -lcairo -lpixman-1 -lfreetype -lpng16 -lz -lpaper -lz -lkpathsea  >&5
<command-line>:0:18: warning: missing terminating " character
<command-line>:0:18: warning: missing terminating " character
/usr/lib64/libharfbuzz.so: undefined reference to `FT_Done_MM_Var'
collect2: error: ld returned 1 exit status
configure:22113: $? = 1
configure: failed program was:
| /* confdefs.h */
| #define PACKAGE_NAME "TeX Live"
| #define PACKAGE_TARNAME "tex-live"
| #define PACKAGE_VERSION "2016-05-23"
| #define PACKAGE_STRING "TeX Live 2016-05-23"
| #define PACKAGE_BUGREPORT "tex-k@tug.org"
| #define PACKAGE_URL ""
| #define STDC_HEADERS 1
| #define HAVE_SYS_TYPES_H 1
| #define HAVE_SYS_STAT_H 1
| #define HAVE_STDLIB_H 1
| #define HAVE_STRING_H 1
| #define HAVE_MEMORY_H 1
| #define HAVE_STRINGS_H 1
| #define HAVE_INTTYPES_H 1
| #define HAVE_STDINT_H 1
| #define HAVE_UNISTD_H 1
| #define HAVE_DLFCN_H 1
| #define PACKAGE "tex-live"
| #define VERSION "2016-05-23"
| #define LT_OBJDIR ".libs/"
| #define HAVE_FSEEKO 1
| #define HAVE_DIRENT_H 1
| #define STDC_HEADERS 1
| #define HAVE_ASSERT_H 1
| #define HAVE_FLOAT_H 1
| #define HAVE_LIMITS_H 1
| #define HAVE_PWD_H 1
| #define HAVE_STDLIB_H 1
| #define HAVE_SYS_PARAM_H 1
| #define HAVE_PUTENV 1
| #define HAVE_GETCWD 1
| #define HAVE_GETWD 1
| #define HAVE_MEMCMP 1
| #define HAVE_MEMCPY 1
| #define HAVE_MKSTEMP 1
| #define HAVE_MKTEMP 1
| #define HAVE_STRCHR 1
| #define HAVE_STRRCHR 1
| #define HAVE_DECL_ISASCII 1
| #define HAVE_STRUCT_STAT_ST_MTIM 1
| /* end confdefs.h.  */
| #include <hb.h>
| int
| main ()
| {
| const char *v = hb_version_string();
|   ;
|   return 0;
| }
configure:22120: result: failed
configure:22125: error: some requested system libraries failed
Back to top
View user's profile Send private message
fedeliallalinea
Bodhisattva
Bodhisattva


Joined: 08 Mar 2003
Posts: 19235
Location: here

PostPosted: Mon May 21, 2018 10:48 am    Post subject: Reply with quote

What version of media-libs/freetype you installed?
_________________
Questions are guaranteed in life; Answers aren't.
Back to top
View user's profile Send private message
NP_complete
Tux's lil' helper
Tux's lil' helper


Joined: 21 Mar 2009
Posts: 94

PostPosted: Mon May 21, 2018 12:31 pm    Post subject: Reply with quote

Hi fedeliallalinea,

With the -latex USE flag set, and all TeX/LaTeX packages removed, I have
Code:
[ebuild   R    ] media-libs/freetype-2.9.1-r3:2::gentoo  USE="X adobe-cff bzip2 cleartype_hinting png -bindist -debug -doc -fontforge -harfbuzz -infinality -static-libs -utils" ABI_X86="(64) -32 (-x32)" 0 KiB

Doesn't -harfbuzz look suspicious?

Normally, I have dev-texlive/texlive-pictures and dev-texlive/texlive-latexextra installed. This time, however, I had to uninstall all TeX/LaTeX packages since texlive-core-2017 doesn't build. Now, when I do
Code:
emerge -pv dev-texlive/texlive-pictures dev-texlive/texlive-latexextra
I get
Code:
[ebuild     UD ] media-libs/freetype-2.8:2::gentoo [2.9.1-r3:2::gentoo] USE="X adobe-cff bzip2 cleartype_hinting png -bindist -debug -doc -fontforge -harfbuzz -infinality -static-libs -utils" ABI_X86="(64) -32 (-x32)" 0 KiB
Why would Portage want to downgrade media-libs/freetype?

Many thanks.

[Moderator edit: changed [quote] tags to [code] tags to preserve output layout. -Hu]
Back to top
View user's profile Send private message
fedeliallalinea
Bodhisattva
Bodhisattva


Joined: 08 Mar 2003
Posts: 19235
Location: here

PostPosted: Mon May 21, 2018 2:52 pm    Post subject: Reply with quote

NP_complete wrote:
Now, when I do
Quote:
emerge -pv dev-texlive/texlive-pictures dev-texlive/texlive-latexextra
I get
Quote:
[ebuild UD ] media-libs/freetype-2.8:2::gentoo [2.9.1-r3:2::gentoo] USE="X adobe-cff bzip2 cleartype_hinting png -bindist -debug -doc -fontforge -harfbuzz -infinality -static-libs -utils" ABI_X86="(64) -32 (-x32)" 0 KiB
Why would Portage want to downgrade media-libs/freetype?

Portage want downgrade freetype because app-text/texlive-core r3 need a version <2.9
Code:
DEPEND="${COMMON_DEPEND}
        <media-libs/freetype-2.9.1-r2

Try to sync portage tree and install revision 4
Code:
commit edc56c40bdf0d98d3d01dd13a4368c462c58be4e
Author: Andreas K. Hüttel <dilfridge@gentoo.org>
Date:   Sun May 20 22:25:47 2018 +0200

    app-text/texlive-core: Revbump for poppler-0.64 and recent freetype
   
    Bug: https://bugs.gentoo.org/655052
    Package-Manager: Portage-2.3.38, Repoman-2.3.9

_________________
Questions are guaranteed in life; Answers aren't.
Back to top
View user's profile Send private message
NP_complete
Tux's lil' helper
Tux's lil' helper


Joined: 21 Mar 2009
Posts: 94

PostPosted: Mon May 21, 2018 3:34 pm    Post subject: Reply with quote

Upgrading to app-text/texlive-core-2017-r4 solved it. Thank you so much!
Back to top
View user's profile Send private message
Display posts from previous:   
Reply to topic    Gentoo Forums Forum Index Portage & Programming All times are GMT
Page 1 of 1

 
Jump to:  
You cannot post new topics in this forum
You cannot reply to topics in this forum
You cannot edit your posts in this forum
You cannot delete your posts in this forum
You cannot vote in polls in this forum