Gentoo Forums
Gentoo Forums
Gentoo Forums
Quick Search: in
Cannot build some packages
View unanswered posts
View posts from last 24 hours

 
Reply to topic    Gentoo Forums Forum Index Duplicate Threads
View previous topic :: View next topic  
Author Message
Belliash
Advocate
Advocate


Joined: 24 Nov 2004
Posts: 2417
Location: Wroclaw, Poland

PostPosted: Wed Sep 06, 2017 7:06 am    Post subject: Cannot build some packages Reply with quote

I got the following error during mongodb build:

Code:
src/mongo/db/storage/mmap_v1/mmap_v1_engine.cpp: In function 'void mongo::{anonymous}::checkReadAhead(const string&)':
src/mongo/db/storage/mmap_v1/mmap_v1_engine.cpp:176:70: error: 'major' was not declared in this scope
         string path = str::stream() << "/sys/dev/block/" << major(dev) << ':' << minor(dev)
                                                                      ^
src/mongo/db/storage/mmap_v1/mmap_v1_engine.cpp:176:91: error: 'minor' was not declared in this scope
         string path = str::stream() << "/sys/dev/block/" << major(dev) << ':' << minor(dev)
                                                                                           ^




Synced yesterday morning, did full update and now cannot emerge mongodb.
Any ideas?
_________________
Asio Software Technologies
Belliash IT Weblog


Last edited by Belliash on Wed Sep 06, 2017 9:23 am; edited 1 time in total
Back to top
View user's profile Send private message
fedeliallalinea
Bodhisattva
Bodhisattva


Joined: 08 Mar 2003
Posts: 16861
Location: here

PostPosted: Wed Sep 06, 2017 7:52 am    Post subject: Reply with quote

https://forums.gentoo.org/viewtopic-t-1068690.html
_________________
Questions are guaranteed in life; Answers aren't.
Back to top
View user's profile Send private message
Belliash
Advocate
Advocate


Joined: 24 Nov 2004
Posts: 2417
Location: Wroclaw, Poland

PostPosted: Wed Sep 06, 2017 9:17 am    Post subject: Reply with quote

kde-plasma/kscreenlocker-5.10.5.1:
Code:
/usr/bin/x86_64-pc-linux-gnu-g++  -march=core-avx2 -mtune=core-avx2 -msse4.1 -msse4.2 -mcx16 -msahf -mpopcnt -O2 -s -pipe -fomit-frame-pointer -std=c++0x -fno-operator-names -fno-exceptions -Wall -Wextra -Wcast-align -Wchar-subscripts -Wformat-security -Wno-long-long -Wpointer-arith -Wundef -Wnon-virtual-dtor -Woverloaded-virtual -Werror=return-type -Wvla -Wdate-time  -Wl,--enable-new-dtags -Wl,-O1,--enable-new-dtags,--sort-common,--hash-style=both,--as-needed -rdynamic CMakeFiles/kscreenlocker_greet.dir/authenticator.cpp.o CMakeFiles/kscreenlocker_greet.dir/greeterapp.cpp.o CMakeFiles/kscreenlocker_greet.dir/main.cpp.o CMakeFiles/kscreenlocker_greet.dir/noaccessnetworkaccessmanagerfactory.cpp.o CMakeFiles/kscreenlocker_greet.dir/wallpaper_integration.cpp.o CMakeFiles/kscreenlocker_greet.dir/kwinglplatform.cpp.o CMakeFiles/kscreenlocker_greet.dir/seccomp_filter.cpp.o CMakeFiles/kscreenlocker_greet.dir/qrc_fallbacktheme.cpp.o CMakeFiles/kscreenlocker_greet.dir/kscreensaversettings.cpp.o CMakeFiles/kscreenlocker_greet.dir/wayland-ksld-protocol.c.o CMakeFiles/kscreenlocker_greet.dir/kscreenlocker_greet_autogen/mocs_compilation.cpp.o  -o kscreenlocker_greet /usr/lib64/libKF5Crash.so.5.37.0 /usr/lib64/libKF5QuickAddons.so.5.37.0 /usr/lib64/libKF5WindowSystem.so.5.37.0 /usr/lib64/libQt5X11Extras.so.5.7.1 -lSM -lICE -lX11 -lXext /usr/lib64/libKF5WaylandClient.so.5.37.0 /usr/lib/libwayland-client.so /usr/lib64/libQt5DBus.so.5.7.1 /usr/lib/libseccomp.so /usr/lib64/libQt5Widgets.so.5.7.1 /usr/lib64/libKF5ConfigGui.so.5.37.0 /usr/lib64/libQt5Xml.so.5.7.1 /usr/lib64/libKF5Declarative.so.5.37.0 /usr/lib64/libKF5Package.so.5.37.0 /usr/lib64/libKF5CoreAddons.so.5.37.0 /usr/lib64/libKF5I18n.so.5.37.0 /usr/lib64/libKF5ConfigCore.so.5.37.0 /usr/lib64/libQt5Quick.so.5.7.1 /usr/lib64/libQt5Qml.so.5.7.1 /usr/lib64/libQt5Network.so.5.7.1 /usr/lib64/libQt5Gui.so.5.7.1 /usr/lib64/libQt5Core.so.5.7.1
/usr/lib/gcc/x86_64-pc-linux-gnu/6.4.0/../../../../x86_64-pc-linux-gnu/bin/ld: CMakeFiles/kscreenlocker_greet.dir/kwinglplatform.cpp.o: undefined reference to symbol 'glGetString'
/usr/lib64/libGLESv2.so.2: error adding symbols: DSO missing from command line
collect2: error: ld returned 1 exit status
make[2]: *** [greeter/CMakeFiles/kscreenlocker_greet.dir/build.make:386: greeter/kscreenlocker_greet] Error 1
make[1]: *** [CMakeFiles/Makefile2:414: greeter/CMakeFiles/kscreenlocker_greet.dir/all] Error 2
make[1]: *** Waiting for unfinished jobs....


dev-util/colm-0.13.0.5:
Code:
libtool: link: x86_64-pc-linux-gnu-g++ -Wall -DPREFIX=\"/usr\" -Iinclude -DLOAD_COLM -march=core-avx2 -mtune=core-avx2 -msse4.1 -msse4.2 -mcx16 -msahf -mpopcnt -O2 -s -pipe -fomit-frame-pointer -Wl,-O1 -Wl,--enable-new-dtags -Wl,--sort-common -Wl,--hash-style=both -Wl,--as-needed -o .libs/colm colm-loadcolm.o colm-main.o gen/colm-if2.o gen/colm-parse2.o  libprog.a ./.libs/libcolm.so
Making all in doc
make[1]: b: Command not found
make[1]: b: Command not found
make[1]: b: Command not found
make[1]: b: Command not found
make[1]: b: Command not found
make[1]: b: Command not found
make[1]: b: Command not found
make[1]: b: Command not found
make[1]: b: Command not found
make[1]: b: Command not found
make[1]: b: Command not found
make[1]: b: Command not found
make[1]: b: Command not found
make[1]: b: Command not found
make[1]: b: Command not found
make[1]: b: Command not found
make[1]: b: Command not found
make[1]: b: Command not found
make[1]: b: Command not found
make[1]: b: Command not found
make[1]: b: Command not found
make[1]: b: Command not found
make[1]: b: Command not found
make[1]: b: Command not found
make[1]: b: Command not found
make[1]: b: Command not found
make[1]: b: Command not found
make[1]: b: Command not found
make[1]: b: Command not found
make[1]: b: Command not found
make[1]: b: Command not found
>>> Source compiled.
>>> Test phase [not enabled]: dev-util/colm-0.13.0.5

>>> Install colm-0.13.0.5 into /var/tmp/portage/dev-util/colm-0.13.0.5/image/ category dev-util
make -j16 -s DESTDIR=/var/tmp/portage/dev-util/colm-0.13.0.5/image/ install
Making install in src
 /bin/mkdir -p '/var/tmp/portage/dev-util/colm-0.13.0.5/image//usr/lib64'
 /bin/sh ../libtool   --mode=install /usr/lib/portage/python3.4/ebuild-helpers/xattr/install -c   libcolm.la '/var/tmp/portage/dev-util/colm-0.13.0.5/image//usr/lib64'
 /bin/mkdir -p '/var/tmp/portage/dev-util/colm-0.13.0.5/image//usr/include/colm'
 /usr/lib/portage/python3.4/ebuild-helpers/xattr/install -c -m 644 bytecode.h config.h defs.h debug.h pool.h input.h pdarun.h map.h type.h tree.h struct.h program.h colm.h internal.h '/var/tmp/portage/dev-util/colm-0.13.0.5/image//usr/include/colm'
libtool: install: /usr/lib/portage/python3.4/ebuild-helpers/xattr/install -c .libs/libcolm-0.13.0.5.so /var/tmp/portage/dev-util/colm-0.13.0.5/image//usr/lib64/libcolm-0.13.0.5.so
libtool: install: (cd /var/tmp/portage/dev-util/colm-0.13.0.5/image//usr/lib64 && { ln -s -f libcolm-0.13.0.5.so libcolm.so || { rm -f libcolm.so && ln -s libcolm-0.13.0.5.so libcolm.so; }; })
libtool: install: /usr/lib/portage/python3.4/ebuild-helpers/xattr/install -c .libs/libcolm.lai /var/tmp/portage/dev-util/colm-0.13.0.5/image//usr/lib64/libcolm.la
libtool: install: /usr/lib/portage/python3.4/ebuild-helpers/xattr/install -c .libs/libcolm.a /var/tmp/portage/dev-util/colm-0.13.0.5/image//usr/lib64/libcolm.a
libtool: install: chmod 644 /var/tmp/portage/dev-util/colm-0.13.0.5/image//usr/lib64/libcolm.a
libtool: install: x86_64-pc-linux-gnu-ranlib /var/tmp/portage/dev-util/colm-0.13.0.5/image//usr/lib64/libcolm.a
libtool: warning: remember to run 'libtool --finish /usr/lib64'
 /bin/mkdir -p '/var/tmp/portage/dev-util/colm-0.13.0.5/image//usr/bin'
  /bin/sh ../libtool   --mode=install /usr/lib/portage/python3.4/ebuild-helpers/xattr/install -c colm '/var/tmp/portage/dev-util/colm-0.13.0.5/image//usr/bin'
libtool: install: /usr/lib/portage/python3.4/ebuild-helpers/xattr/install -c .libs/colm /var/tmp/portage/dev-util/colm-0.13.0.5/image//usr/bin/colm
Making install in doc
make[1]: b: Command not found
make[1]: b: Command not found
make[1]: b: Command not found
make[1]: b: Command not found
make[1]: b: Command not found
make[1]: b: Command not found
make[1]: b: Command not found
make[1]: b: Command not found
make[1]: b: Command not found
make[1]: b: Command not found
make[1]: b: Command not found
make[1]: b: Command not found
make[1]: b: Command not found
make[1]: b: Command not found
make[1]: b: Command not found
make[1]: b: Command not found
make[1]: b: Command not found
make[1]: b: Command not found
make[1]: b: Command not found
make[1]: b: Command not found
make[1]: b: Command not found
make[1]: b: Command not found
make[1]: b: Command not found
make[1]: b: Command not found
make[1]: b: Command not found
make[1]: b: Command not found
make[1]: b: Command not found
make[1]: b: Command not found
make[1]: b: Command not found
make[1]: b: Command not found
make[1]: b: Command not found
make[2]: b: Command not found
make[2]: b: Command not found
make[2]: b: Command not found
make[2]: b: Command not found
make[2]: b: Command not found
make[2]: b: Command not found
make[2]: b: Command not found
make[2]: b: Command not found
make[2]: b: Command not found
make[2]: b: Command not found
make[2]: b: Command not found
make[2]: b: Command not found
make[2]: b: Command not found
make[2]: b: Command not found
make[2]: b: Command not found
make[2]: b: Command not found
make[2]: b: Command not found
make[2]: b: Command not found
make[2]: b: Command not found
make[2]: b: Command not found
make[2]: b: Command not found
make[2]: b: Command not found
make[2]: b: Command not found
make[2]: b: Command not found
make[2]: b: Command not found
make[2]: b: Command not found
make[2]: b: Command not found
make[2]: b: Command not found
make[2]: b: Command not found
make[2]: b: Command not found
make[2]: b: Command not found
 /bin/mkdir -p '/var/tmp/portage/dev-util/colm-0.13.0.5/image//usr/share/doc/colm-0.13.0.5'
 /usr/lib/portage/python3.4/ebuild-helpers/xattr/install -c -m 644 ./0_00_welcome.html ./0_06_scope.html ./1_05_variables.html ./3_00_language_transformation.html ./8_00_advanced_topics.html ./9_00_q_and_a.html ./0_01_installing.html ./1_00_language_overview.html ./1_06_iterators.html ./3_01_lex.html ./8_01_embedding.html ./0_02_vim_syntax.html ./1_01_statements.html ./2_00_types.html ./3_02_parse.html ./8_02_modularity.html ./0_03_commandline.html ./1_02_expressions.html ./2_01_basic.html ./3_03_match.html ./8_03_performance.html ./0_04_hello_world.html ./1_03_control_flow.html ./2_02_list_map_struct_alias.html ./3_04_undo.html ./8_04_error_handling.html ./0_05_fizzbuzz.html ./1_04_functions.html ./2_03_def.html ./3_05_reduction.html ./8_05_contributing.html '/var/tmp/portage/dev-util/colm-0.13.0.5/image//usr/share/doc/colm-0.13.0.5'
/usr/bin/install: cannot stat './0_00_welcome.html': No such file or directory
/usr/bin/install: cannot stat './0_06_scope.html': No such file or directory
/usr/bin/install: cannot stat './1_05_variables.html': No such file or directory
/usr/bin/install: cannot stat './3_00_language_transformation.html': No such file or directory
/usr/bin/install: cannot stat './8_00_advanced_topics.html': No such file or directory
/usr/bin/install: cannot stat './9_00_q_and_a.html': No such file or directory
/usr/bin/install: cannot stat './0_01_installing.html': No such file or directory
/usr/bin/install: cannot stat './1_00_language_overview.html': No such file or directory
/usr/bin/install: cannot stat './1_06_iterators.html': No such file or directory
/usr/bin/install: cannot stat './3_01_lex.html': No such file or directory
/usr/bin/install: cannot stat './8_01_embedding.html': No such file or directory
/usr/bin/install: cannot stat './0_02_vim_syntax.html': No such file or directory
/usr/bin/install: cannot stat './1_01_statements.html': No such file or directory
/usr/bin/install: cannot stat './2_00_types.html': No such file or directory
/usr/bin/install: cannot stat './3_02_parse.html': No such file or directory
/usr/bin/install: cannot stat './8_02_modularity.html': No such file or directory
/usr/bin/install: cannot stat './0_03_commandline.html': No such file or directory
/usr/bin/install: cannot stat './1_02_expressions.html': No such file or directory
/usr/bin/install: cannot stat './2_01_basic.html': No such file or directory
/usr/bin/install: cannot stat './3_03_match.html': No such file or directory
/usr/bin/install: cannot stat './8_03_performance.html': No such file or directory
/usr/bin/install: cannot stat './0_04_hello_world.html': No such file or directory
/usr/bin/install: cannot stat './1_03_control_flow.html': No such file or directory
/usr/bin/install: cannot stat './2_02_list_map_struct_alias.html': No such file or directory
/usr/bin/install: cannot stat './3_04_undo.html': No such file or directory
/usr/bin/install: cannot stat './8_04_error_handling.html': No such file or directory
/usr/bin/install: cannot stat './0_05_fizzbuzz.html': No such file or directory
/usr/bin/install: cannot stat './1_04_functions.html': No such file or directory
/usr/bin/install: cannot stat './2_03_def.html': No such file or directory
/usr/bin/install: cannot stat './3_05_reduction.html': No such file or directory
/usr/bin/install: cannot stat './8_05_contributing.html': No such file or directory
make[2]: *** [Makefile:358: install-docDATA] Error 1
make[1]: *** [Makefile:427: install-am] Error 2
make: *** [Makefile:461: install-recursive] Error 1



media-plugins/audacious-plugins-3.8.2:
Code:
gl-spectrum.cc: In function 'void draw_rectangle(float, float, float, float, float, float, float, float, float)':
gl-spectrum.cc:178:23: error: 'glColor3f' was not declared in this scope
     glColor3f (r, g, b);
                       ^
gl-spectrum.cc:180:14: error: 'GL_POLYGON' was not declared in this scope
     glBegin (GL_POLYGON);
              ^~~~~~~~~~
gl-spectrum.cc:180:24: error: 'glBegin' was not declared in this scope
     glBegin (GL_POLYGON);
                        ^
gl-spectrum.cc:181:27: error: 'glVertex3f' was not declared in this scope
     glVertex3f (x1, y2, z1);
                           ^
gl-spectrum.cc:185:12: error: 'glEnd' was not declared in this scope
     glEnd ();
            ^
gl-spectrum.cc: In function 'void draw_bars()':
gl-spectrum.cc:221:19: error: 'glPushMatrix' was not declared in this scope
     glPushMatrix ();
                   ^
gl-spectrum.cc:222:37: error: 'glTranslatef' was not declared in this scope
     glTranslatef (0.0f, -0.5f, -5.0f);
                                     ^
gl-spectrum.cc:223:39: error: 'glRotatef' was not declared in this scope
     glRotatef (38.0f, 1.0f, 0.0f, 0.0f);
                                       ^
gl-spectrum.cc:225:39: error: 'GL_FILL' was not declared in this scope
     glPolygonMode (GL_FRONT_AND_BACK, GL_FILL);
                                       ^~~~~~~
gl-spectrum.cc:225:46: error: 'glPolygonMode' was not declared in this scope
     glPolygonMode (GL_FRONT_AND_BACK, GL_FILL);
                                              ^
gl-spectrum.cc:240:18: error: 'glPopMatrix' was not declared in this scope
     glPopMatrix ();
                  ^
gl-spectrum.cc: In member function 'virtual void GLSpectrumWidget::paintGL()':
gl-spectrum.cc:256:19: error: 'GL_PROJECTION' was not declared in this scope
     glMatrixMode (GL_PROJECTION);
                   ^~~~~~~~~~~~~
gl-spectrum.cc:256:32: error: 'glMatrixMode' was not declared in this scope
     glMatrixMode (GL_PROJECTION);
                                ^
gl-spectrum.cc:257:18: error: 'glPushMatrix' was not declared in this scope
     glPushMatrix();
                  ^
gl-spectrum.cc:258:20: error: 'glLoadIdentity' was not declared in this scope
     glLoadIdentity();
                    ^
gl-spectrum.cc:259:41: error: 'glFrustum' was not declared in this scope
     glFrustum (-1.1f, 1, -1.5f, 1, 2, 10);
                                         ^
gl-spectrum.cc:260:19: error: 'GL_MODELVIEW' was not declared in this scope
     glMatrixMode (GL_MODELVIEW);
                   ^~~~~~~~~~~~
gl-spectrum.cc:265:30: error: 'GL_FILL' was not declared in this scope
     glPolygonMode (GL_FRONT, GL_FILL);
                              ^~~~~~~
gl-spectrum.cc:265:37: error: 'glPolygonMode' was not declared in this scope
     glPolygonMode (GL_FRONT, GL_FILL);
                                     ^
gl-spectrum.cc:274:18: error: 'glPopMatrix' was not declared in this scope
     glPopMatrix ();
                  ^


So many packages does not build after last sync....
Some of them seems to be related to new mesa.


btw, indeed sync fixed mongodb, but not above :(
_________________
Asio Software Technologies
Belliash IT Weblog
Back to top
View user's profile Send private message
fedeliallalinea
Bodhisattva
Bodhisattva


Joined: 08 Mar 2003
Posts: 16861
Location: here

PostPosted: Wed Sep 06, 2017 9:31 am    Post subject: Reply with quote

kde-plasma/kscreenlocke -> https://bugs.gentoo.org/show_bug.cgi?id=629632

media-plugins/audacious-plugins -> https://bugs.gentoo.org/show_bug.cgi?id=558228
_________________
Questions are guaranteed in life; Answers aren't.
Back to top
View user's profile Send private message
fedeliallalinea
Bodhisattva
Bodhisattva


Joined: 08 Mar 2003
Posts: 16861
Location: here

PostPosted: Wed Sep 06, 2017 10:02 am    Post subject: Reply with quote

For dev-util/colm fill a new bug
_________________
Questions are guaranteed in life; Answers aren't.
Back to top
View user's profile Send private message
asturm
Developer
Developer


Joined: 05 Apr 2007
Posts: 5561
Location: Austria

PostPosted: Wed Sep 06, 2017 12:13 pm    Post subject: Reply with quote

Belliash wrote:
kde-plasma/kscreenlocker-5.10.5.1:

Do not set gles2. Neither positively nor negative. Just make sure it is never mentioned in make.conf and package.use.
_________________
backend.cpp:92:2: warning: #warning TODO - this error message is about as useful as a cooling unit in the arctic
Back to top
View user's profile Send private message
pjp
Administrator
Administrator


Joined: 16 Apr 2002
Posts: 16750

PostPosted: Sat Sep 09, 2017 3:21 am    Post subject: Reply with quote

Moved from Unsupported Software to Duplicate Threads.

Issue appears to be solved per the following thread:
fedeliallalinea wrote:
https://forums.gentoo.org/viewtopic-t-1068690.html

_________________
Ladies and gentlemen, allow me to present, Man Not Caring. -- Perry Cox
Back to top
View user's profile Send private message
Display posts from previous:   
Reply to topic    Gentoo Forums Forum Index Duplicate Threads All times are GMT
Page 1 of 1

 
Jump to:  
You cannot post new topics in this forum
You cannot reply to topics in this forum
You cannot edit your posts in this forum
You cannot delete your posts in this forum
You cannot vote in polls in this forum