Gentoo Forums
Gentoo Forums
Gentoo Forums
Quick Search: in
Installation mono-4.4.1.0 schlägt fehl
View unanswered posts
View posts from last 24 hours
View posts from last 7 days

 
Reply to topic    Gentoo Forums Forum Index Deutsches Forum (German)
View previous topic :: View next topic  
Author Message
Rocky007
n00b
n00b


Joined: 22 Dec 2014
Posts: 30

PostPosted: Tue Aug 08, 2017 6:41 am    Post subject: Installation mono-4.4.1.0 schlägt fehl Reply with quote

Hallo,
ich versuche gerade keepass zu installieren, dabei schlägt die Installation/Kompilation von mono-4.1.1.0 fehl.

emerge --info '=dev-lang/mono-4.4.1.0::gentoo'
Code:

Portage 2.3.6 (python 3.4.5-final-0, default/linux/amd64/13.0/desktop/plasma, gcc-5.4.0, glibc-2.23-r4, 4.9.34-gentoo x86_64)
=================================================================
                         System Settings
=================================================================
System uname: Linux-4.9.34-gentoo-x86_64-AMD_Ryzen_7_1700_Eight-Core_Processor-with-gentoo-2.3
KiB Mem:    16440132 total,   3880612 free
KiB Swap:          0 total,         0 free
Timestamp of repository gentoo: Mon, 07 Aug 2017 06:00:01 +0000
sh bash 4.3_p48-r1
ld GNU ld (Gentoo 2.28 p1.2) 2.28
app-shells/bash:          4.3_p48-r1::gentoo
dev-java/java-config:     2.2.0-r3::gentoo
dev-lang/perl:            5.24.1-r2::gentoo
dev-lang/python:          2.7.12::gentoo, 3.4.5::gentoo
dev-util/cmake:           3.7.2::gentoo
dev-util/pkgconfig:       0.28-r2::gentoo
sys-apps/baselayout:      2.3::gentoo
sys-apps/openrc:          0.28::gentoo
sys-apps/sandbox:         2.10-r3::gentoo
sys-devel/autoconf:       2.13::gentoo, 2.69::gentoo
sys-devel/automake:       1.15-r2::gentoo
sys-devel/binutils:       2.28-r2::gentoo
sys-devel/gcc:            5.4.0-r3::gentoo
sys-devel/gcc-config:     1.7.3::gentoo
sys-devel/libtool:        2.4.6-r3::gentoo
sys-devel/make:           4.2.1::gentoo
sys-kernel/linux-headers: 4.4::gentoo (virtual/os-headers)
sys-libs/glibc:           2.23-r4::gentoo
Repositories:

gentoo
    location: /usr/portage
    sync-type: rsync
    sync-uri: rsync://rsync.gentoo.org/gentoo-portage
    priority: -1000

ACCEPT_KEYWORDS="amd64"
ACCEPT_LICENSE="* -@EULA"
CBUILD="x86_64-pc-linux-gnu"
CFLAGS="-O2 -pipe"
CHOST="x86_64-pc-linux-gnu"
CONFIG_PROTECT="/etc /usr/share/config /usr/share/gnupg/qualified.txt"
CONFIG_PROTECT_MASK="/etc/ca-certificates.conf /etc/dconf /etc/env.d /etc/fonts/fonts.conf /etc/gconf /etc/gentoo-release /etc/php/apache2-php7.0/ext-active/ /etc/php/cgi-php7.0/ext-active/ /etc/php/cli-php7.0/ext-active/ /etc/revdep-rebuild /etc/sandbox.d /etc/terminfo"
CXXFLAGS="-O2 -pipe"
DISTDIR="/usr/portage/distfiles"
FCFLAGS="-O2 -pipe"
FEATURES="assume-digests binpkg-logs buildpkg config-protect-if-modified distlocks ebuild-locks fixlafiles merge-sync news parallel-fetch preserve-libs protect-owned sandbox sfperms splitdebug strict unknown-features-warn unmerge-logs unmerge-orphans userfetch userpriv usersandbox usersync xattr"
FFLAGS="-O2 -pipe"
GENTOO_MIRRORS="http://distfiles.gentoo.org"
LANG="de_DE.utf8"
LDFLAGS="-Wl,-O1 -Wl,--as-needed"
MAKEOPTS="-j32"
PKGDIR="/usr/portage/packages"
PORTAGE_CONFIGROOT="/"
PORTAGE_RSYNC_OPTS="--recursive --links --safe-links --perms --times --omit-dir-times --compress --force --whole-file --delete --stats --human-readable --timeout=180 --exclude=/distfiles --exclude=/local --exclude=/packages --exclude=/.git"
PORTAGE_TMPDIR="/var/tmp"
USE="X a52 aac acl acpi activities alsa amd64 berkdb bluetooth branding bzip2 cairo cdda cdr cli consolekit cracklib crypt cups cxx dbus declarative dri dts dvd dvdr emboss encode exif fam firefox flac fortran gdbm gif glamor iconv ipv6 jpeg kde kipi kwallet lcms ldap libnotify mad mng modules mp3 mp4 mpeg multilib ncurses nls nptl ogg opengl openmp pam pango pcre pdf phonon plasma png policykit ppds qml qt3support qt4 qt5 readline sdl seccomp semantic-desktop session spell ssl startup-notification svg tcpd tiff truetype udev udisks unicode upower usb vorbis widgets wxwidgets x264 xattr xcb xcomposite xinerama xml xscreensaver xv xvid zlib" ABI_X86="32 64" ALSA_CARDS="ali5451 als4000 atiixp atiixp-modem bt87x ca0106 cmipci emu10k1x ens1370 ens1371 es1938 es1968 fm801 hda-intel intel8x0 intel8x0m maestro3 trident usb-audio via82xx via82xx-modem ymfpci" APACHE2_MODULES="authn_core authz_core socache_shmcb unixd actions alias auth_basic authn_alias authn_anon authn_dbm authn_default authn_file authz_dbm authz_default authz_groupfile authz_host authz_owner authz_user autoindex cache cgi cgid dav dav_fs dav_lock deflate dir disk_cache env expires ext_filter file_cache filter headers include info log_config logio mem_cache mime mime_magic negotiation rewrite setenvif speling status unique_id userdir usertrack vhost_alias" CALLIGRA_FEATURES="kexi words flow plan sheets stage tables krita karbon braindump author" COLLECTD_PLUGINS="df interface irq load memory rrdtool swap syslog" CPU_FLAGS_X86="mmx mmxext sse sse2" ELIBC="glibc" GPSD_PROTOCOLS="ashtech aivdm earthmate evermore fv18 garmin garmintxt gpsclock isync itrax mtk3301 nmea ntrip navcom oceanserver oldstyle oncore rtcm104v2 rtcm104v3 sirf skytraq superstar2 timing tsip tripmate tnt ublox ubx" INPUT_DEVICES="evdev synaptics" KERNEL="linux" L10N="de" LCD_DEVICES="bayrad cfontz cfontz633 glk hd44780 lb216 lcdm001 mtxorb ncurses text" LIBREOFFICE_EXTENSIONS="presenter-console presenter-minimizer" LINGUAS="de" OFFICE_IMPLEMENTATION="libreoffice" PHP_TARGETS="php5-6" POSTGRES_TARGETS="postgres9_5" PYTHON_SINGLE_TARGET="python3_4" PYTHON_TARGETS="python2_7 python3_4" RUBY_TARGETS="ruby21 ruby22" USERLAND="GNU" VIDEO_CARDS="intel i965 radeon" XTABLES_ADDONS="quota2 psd pknock lscan length2 ipv4options ipset ipp2p iface geoip fuzzy condition tee tarpit sysrq steal rawnat logmark ipmark dhcpmac delude chaos account"
Unset:  CC, CPPFLAGS, CTARGET, CXX, EMERGE_DEFAULT_OPTS, INSTALL_MASK, LC_ALL, PORTAGE_BUNZIP2_COMMAND, PORTAGE_COMPRESS, PORTAGE_COMPRESS_FLAGS, PORTAGE_RSYNC_EXTRA_OPTS, USE_PYTHON



/var/tmp/portage/dev-lang/mono-4.4.1.0/temp/build.log
Code:

../../../external/referencesource/System/compmod/system/codedom/CodePropertyReferenceExpression.cs(30,42): warning CS0414: The private field `System.CodeDom.CodePropertyReferenceExpression.parameters' is assigned but its value is never used
../../../external/referencesource/System/services/monitoring/system/diagnosticts/AsyncStreamReader.cs(45,25): warning CS0414: The private field `System.Diagnostics.AsyncStreamReader.process' is assigned but its value is never used
Compilation succeeded - 55 warning(s)
MCS     [build] Mono.Posix.dll
Creating the per profile list ../../build/deps/build_System.Core.dll.sources ...
MCS     [build] System.Core.dll
../../../external/referencesource/System.Core/System/Linq/Parallel/Utils/Sorting.cs(73,58): warning CS0472: The result of comparing value type `System.Threading.CancellationToken' with null is always `true'
../../../external/referencesource/System.Core/System/Linq/Parallel/Utils/Sorting.cs(77,58): warning CS0472: The result of comparing value type `System.Threading.CancellationToken' with null is always `true'
../../../external/referencesource/System.Core/System/Linq/SequenceQuery.cs(104,18): warning CS0219: The variable `execType' is assigned but its value is never used
../../../external/referencesource/System.Core/System/Linq/SequenceQuery.cs(197,30): warning CS0219: The variable `argArray' is assigned but its value is never used
System.IO.MemoryMappedFiles/MemoryMappedFile.cs(198,57): warning CS0618: `System.IO.FileStream.Handle' is obsolete: `Use SafeFileHandle instead'
System.IO.Pipes/PipeStream.cs(135,15): warning CS0618: `System.IO.FileStream.FileStream(System.IntPtr, System.IO.FileAccess, bool, int, bool)' is obsolete: `Use FileStream(SafeFileHandle handle, FileAccess access, int bufferSize, bool isAsync) instead'
System.IO.Pipes/PipeUnix.cs(208,37): warning CS0618: `System.IO.FileStream.Handle' is obsolete: `Use SafeFileHandle instead'
System.IO.Pipes/PipeUnix.cs(274,36): warning CS0618: `System.IO.FileStream.Handle' is obsolete: `Use SafeFileHandle instead'
../../../external/referencesource/System.Core/System/Linq/Parallel/QueryOperators/Binary/UnionQueryOperator.cs(192,34): warning CS0414: The private field `System.Linq.Parallel.UnionQueryOperator<TInputOutput>.UnionQueryOperatorEnumerator<TLeftKey,TRightKey>.m_partitionIndex' is assigned but its value is never used
../../../external/referencesource/System.Core/System/Linq/Parallel/QueryOperators/Options/OrderingQueryOperator.cs(27,22): warning CS0414: The private field `System.Linq.Parallel.OrderingQueryOperator<TSource>.m_orderOn' is assigned but its value is never used
../../../external/referencesource/System.Core/System/Linq/Parallel/QueryOperators/Unary/ConcatQueryOperator.cs(236,42): warning CS0414: The private field `System.Linq.Parallel.ConcatQueryOperator<TSource>.ConcatQueryOperatorResults.m_concatOp' is assigned but its value is never used
../../../external/referencesource/System.Core/System/Linq/Parallel/QueryOperators/Unary/SortQueryOperator.cs(153,22): warning CS0414: The private field `System.Linq.Parallel.SortQueryOperatorResults<TInputOutput,TSortKey>.m_preferStriping' is assigned but its value is never used
../../../external/referencesource/System.Core/System/Linq/Parallel/Scheduling/OrderPreservingPipeliningSpoolingTask.cs(28,40): warning CS0414: The private field `System.Linq.Parallel.OrderPreservingPipeliningSpoolingTask<TOutput,TKey>.m_taskScheduler' is assigned but its value is never used
System.IO.MemoryMappedFiles/MemoryMappedFile.cs(114,26): warning CS0414: The private field `System.IO.MemoryMappedFiles.MemoryMappedFile.fileAccess' is assigned but its value is never used
System.IO.MemoryMappedFiles/MemoryMappedFile.cs(115,10): warning CS0414: The private field `System.IO.MemoryMappedFiles.MemoryMappedFile.name' is assigned but its value is never used
System.IO.MemoryMappedFiles/MemoryMappedFile.cs(116,8): warning CS0414: The private field `System.IO.MemoryMappedFiles.MemoryMappedFile.fileCapacity' is assigned but its value is never used
Compilation succeeded - 16 warning(s)
MCS     [build] mcs.exe
AOT     [build] mscorlib.dll.so
AOT     [build] mcs.exe.so
ld: /var/tmp/portage/dev-lang/mono-4.4.1.0/temp/mono_aot_hebh0p.o: relocation R_X86_64_32 against `.bss' can not be used when making a shared object; recompile with -fPIC
ld: final link failed: Nonrepresentable section on output
AOT of image ./../../class/lib/build/mcs.exe failed.
Mono Ahead of Time compiler - compiling assembly /var/tmp/portage/dev-lang/mono-4.4.1.0/work/mono-4.4.1-abi_x86_32.x86/mcs/class/lib/build/mcs.exe
Code: 4383943(64%) Info: 118855(1%) Ex Info: 2026921(29%) Unwind Info: 80(0%) Class Info: 65543(0%) PLT: 6722(0%) GOT Info: 150439(2%) Offsets: 92119(1%) GOT: 60652
Compiled: 21098/21098 (100%), No GOT slots: 12333 (58%), Direct calls: 23500 (110%)
Executing the native assembler: "as"   -o /var/tmp/portage/dev-lang/mono-4.4.1.0/temp/mono_aot_hebh0p.o /var/tmp/portage/dev-lang/mono-4.4.1.0/temp/mono_aot_hebh0p
Executing the native linker: "ld"  -shared -o ./../../class/lib/build//mcs.exe.so.tmp  /var/tmp/portage/dev-lang/mono-4.4.1.0/temp/mono_aot_hebh0p.o
ld: /var/tmp/portage/dev-lang/mono-4.4.1.0/temp/mono_aot_M7k23n.o: relocation R_X86_64_32 against `.bss' can not be used when making a shared object; recompile with -fPIC
ld: final link failed: Nonrepresentable section on output
AOT of image ./../../class/lib/build//mscorlib.dll failed.
Mono Ahead of Time compiler - compiling assembly /var/tmp/portage/dev-lang/mono-4.4.1.0/work/mono-4.4.1-abi_x86_32.x86/mcs/class/lib/build/mscorlib.dll
Code: 4772815(62%) Info: 125957(1%) Ex Info: 2355923(31%) Unwind Info: 103(0%) Class Info: 100752(1%) PLT: 6911(0%) GOT Info: 129734(1%) Offsets: 113542(1%) GOT: 63192
Compiled: 25186/25188 (99%), No GOT slots: 16302 (64%), Direct calls: 40364 (73%)
Executing the native assembler: "as"   -o /var/tmp/portage/dev-lang/mono-4.4.1.0/temp/mono_aot_M7k23n.o /var/tmp/portage/dev-lang/mono-4.4.1.0/temp/mono_aot_M7k23n
Executing the native linker: "ld"  -shared -o /var/tmp/portage/dev-lang/mono-4.4.1.0/work/mono-4.4.1-abi_x86_32.x86/mcs/class/lib/build/mscorlib.dll.so.tmp  /var/tmp/portage/dev-lang/mono-4.4.1.0/temp/mono_aot_M7k23n.o
make[7]: *** [Makefile:36: ../../class/lib/build//mscorlib.dll.so] Error 1
make[6]: *** [../../build/rules.make:143: do-all] Error 2
make[5]: *** [build/rules.make:170: all-recursive] Error 1
make[4]: *** [Makefile:49: profile-do--build--all] Error 2
make[3]: *** [Makefile:45: profiles-do--all] Error 2
make[2]: *** [Makefile:543: all-local] Error 2
make[2]: Leaving directory '/var/tmp/portage/dev-lang/mono-4.4.1.0/work/mono-4.4.1-abi_x86_32.x86/runtime'
make[1]: *** [Makefile:513: all-recursive] Error 1
make[1]: Leaving directory '/var/tmp/portage/dev-lang/mono-4.4.1.0/work/mono-4.4.1-abi_x86_32.x86'
make: *** [Makefile:442: all] Error 2
 * ERROR: dev-lang/mono-4.4.1.0::gentoo failed (compile phase):
 *   emake failed
 *
 * If you need support, post the output of `emerge --info '=dev-lang/mono-4.4.1.0::gentoo'`,
 * the complete build log and the output of `emerge -pqv '=dev-lang/mono-4.4.1.0::gentoo'`.
 * The complete build log is located at '/var/tmp/portage/dev-lang/mono-4.4.1.0/temp/build.log'.
 * The ebuild environment file is located at '/var/tmp/portage/dev-lang/mono-4.4.1.0/temp/environment'.
 * Working directory: '/var/tmp/portage/dev-lang/mono-4.4.1.0/work/mono-4.4.1-abi_x86_32.x86'
 * S: '/var/tmp/portage/dev-lang/mono-4.4.1.0/work/mono-4.4.1'
Back to top
View user's profile Send private message
Display posts from previous:   
Reply to topic    Gentoo Forums Forum Index Deutsches Forum (German) All times are GMT
Page 1 of 1

 
Jump to:  
You cannot post new topics in this forum
You cannot reply to topics in this forum
You cannot edit your posts in this forum
You cannot delete your posts in this forum
You cannot vote in polls in this forum