Gentoo Forums
Gentoo Forums
Gentoo Forums
Quick Search: in
Kdevelop from kde overlay fails building
View unanswered posts
View posts from last 24 hours

 
Reply to topic    Gentoo Forums Forum Index Desktop Environments
View previous topic :: View next topic  
Author Message
cehrig
n00b
n00b


Joined: 27 Jun 2015
Posts: 11

PostPosted: Sat Jun 27, 2015 2:04 pm    Post subject: Kdevelop from kde overlay fails building Reply with quote

Hey,

I just finished a KDE 5 installation but have problems installing Kdevelop from the kde overlay.

It fails with the following log:

Code:
/var/tmp/portage/dev-util/kdevelop-9999/work/kdevelop-9999/languages/cpp/cppduchain/cppduchain.cpp:441:60: error: ‘Utils::StorableSet<rpp::pp_macro, Cpp::MacroIndexConversion, Cpp::StaticMacroSetRepository, true, Cpp::StaticMacroSetRepository::Locker>::Iterator’ has no member named ‘ref’
           pp.environment()->setMacro( new rpp::pp_macro(it.ref()) );
                                                            ^
languages/cpp/cppduchain/CMakeFiles/kdevcppduchain.dir/build.make:399: recipe for target 'languages/cpp/cppduchain/CMakeFiles/kdevcppduchain.dir/cppduchain.cpp.o' failed
make[2]: *** [languages/cpp/cppduchain/CMakeFiles/kdevcppduchain.dir/cppduchain.cpp.o] Error 1
make[2]: Leaving directory '/var/tmp/portage/dev-util/kdevelop-9999/work/kdevelop-9999_build'
CMakeFiles/Makefile2:1884: recipe for target 'languages/cpp/cppduchain/CMakeFiles/kdevcppduchain.dir/all' failed
make[1]: *** [languages/cpp/cppduchain/CMakeFiles/kdevcppduchain.dir/all] Error 2
make[1]: Leaving directory '/var/tmp/portage/dev-util/kdevelop-9999/work/kdevelop-9999_build'
Makefile:116: recipe for target 'all' failed
make: *** [all] Error 2
 * ERROR: dev-util/kdevelop-9999::kde failed (compile phase):
 *   emake failed
 *
 * If you need support, post the output of `emerge --info '=dev-util/kdevelop-9999::kde'`,
 * the complete build log and the output of `emerge -pqv '=dev-util/kdevelop-9999::kde'`.
 * The complete build log is located at '/var/tmp/portage/dev-util/kdevelop-9999/temp/build.log'.
 * The ebuild environment file is located at '/var/tmp/portage/dev-util/kdevelop-9999/temp/environment'.
 * Working directory: '/var/tmp/portage/dev-util/kdevelop-9999/work/kdevelop-9999_build'
 * S: '/var/tmp/portage/dev-util/kdevelop-9999/work/kdevelop-9999'


Emerge Info

Code:
cehrig@mdx-route-01 /usr/portage/dev-util/kdevelop $ emerge --info '=dev-util/kdevelop-9999::kde'
Portage 2.2.18 (python 2.7.9-final-0, default/linux/amd64/13.0/desktop/plasma, gcc-4.8.4, glibc-2.20-r2, 4.0.5-gentoo x86_64)
=================================================================
                         System Settings
=================================================================
System uname: Linux-4.0.5-gentoo-x86_64-Intel-R-_Celeron-R-_CPU_G1840_@_2.80GHz-with-gentoo-2.2
KiB Mem:     3917528 total,   1432228 free
KiB Swap:    8388604 total,   8353084 free
Timestamp of repository gentoo: Sat, 27 Jun 2015 11:30:01 +0000
sh bash 4.3_p33-r2
ld GNU ld (Gentoo 2.25 p1.2) 2.25
app-shells/bash:          4.3_p33-r2::gentoo
dev-lang/perl:            5.20.2-r1::gentoo
dev-lang/python:          2.7.9-r1::gentoo, 3.3.5-r1::gentoo
dev-util/cmake:           3.2.3::gentoo
dev-util/pkgconfig:       0.28-r3::gentoo
sys-apps/baselayout:      2.2::gentoo
sys-apps/openrc:          0.16.4::gentoo
sys-apps/sandbox:         2.6-r1::gentoo
sys-devel/autoconf:       2.69-r1::gentoo
sys-devel/automake:       1.13.4::gentoo, 1.14.1::gentoo, 1.15::gentoo
sys-devel/binutils:       2.25-r1::gentoo
sys-devel/gcc:            4.8.4::gentoo, 4.9.2::gentoo
sys-devel/gcc-config:     1.8::gentoo
sys-devel/libtool:        2.4.6-r1::gentoo
sys-devel/make:           4.1-r1::gentoo
sys-kernel/linux-headers: 4.1::gentoo (virtual/os-headers)
sys-libs/glibc:           2.20-r2::gentoo
Repositories:

gentoo
    location: /usr/portage
    sync-type: rsync
    sync-uri: rsync://rsync.gentoo.org/gentoo-portage
    priority: -1000

kde
    location: /var/lib/layman/kde
    masters: gentoo
    priority: 0

ACCEPT_KEYWORDS="** amd64 ~amd64"
ACCEPT_LICENSE="* -@EULA"
CBUILD="x86_64-pc-linux-gnu"
CFLAGS="-march=native -O2 -pipe"
CHOST="x86_64-pc-linux-gnu"
CONFIG_PROTECT="/etc /usr/share/config /usr/share/gnupg/qualified.txt"
CONFIG_PROTECT_MASK="/etc/ca-certificates.conf /etc/dconf /etc/env.d /etc/fonts/fonts.conf /etc/gconf /etc/gentoo-release /etc/sandbox.d /etc/terminfo"
CXXFLAGS="-march=native -O2 -pipe"
DISTDIR="/usr/portage/distfiles"
FCFLAGS="-O2 -pipe"
FEATURES="assume-digests binpkg-logs config-protect-if-modified distlocks ebuild-locks fixlafiles merge-sync news parallel-fetch preserve-libs protect-owned sandbox sfperms strict unknown-features-warn unmerge-logs unmerge-orphans userfetch userpriv usersandbox usersync"
FFLAGS="-O2 -pipe"
GENTOO_MIRRORS="http://distfiles.gentoo.org"
LANG="en_US.utf8"
LDFLAGS="-Wl,-O1 -Wl,--as-needed"
PKGDIR="/usr/portage/packages"
PORTAGE_CONFIGROOT="/"
PORTAGE_RSYNC_OPTS="--recursive --links --safe-links --perms --times --omit-dir-times --compress --force --whole-file --delete --stats --human-readable --timeout=180 --exclude=/distfiles --exclude=/local --exclude=/packages"
PORTAGE_TMPDIR="/var/tmp"
USE="X a52 aac acl acpi alsa amd64 berkdb bindist bluetooth branding bzip2 cairo cdda cdr cli consolekit cracklib crypt cups cxx dbus declarative dri dts dvd dvdr emboss encode exif fam firefox flac fortran gdbm gif glamor gpm gtk iconv ipv6 jpeg kde kipi lcms ldap libnotify mad mmx mmxext mng modules mp3 mp4 mpeg multilib ncurses nls nptl ogg opengl openmp pam pango pcre pdf phonon plasma png policykit ppds qml qt3support qt5 readline sdl semantic-desktop session spell sse sse2 ssl startup-notification svg tcpd tiff truetype udev udisks unicode upower usb vorbis widgets wxwidgets x264 xcb xcomposite xinerama xml xscreensaver xv xvid zlib" ABI_X86="64" ALSA_CARDS="ali5451 als4000 atiixp atiixp-modem bt87x ca0106 cmipci emu10k1x ens1370 ens1371 es1938 es1968 fm801 hda-intel intel8x0 intel8x0m maestro3 trident usb-audio via82xx via82xx-modem ymfpci" APACHE2_MODULES="authn_core authz_core socache_shmcb unixd actions alias auth_basic authn_alias authn_anon authn_dbm authn_default authn_file authz_dbm authz_default authz_groupfile authz_host authz_owner authz_user autoindex cache cgi cgid dav dav_fs dav_lock deflate dir disk_cache env expires ext_filter file_cache filter headers include info log_config logio mem_cache mime mime_magic negotiation rewrite setenvif speling status unique_id userdir usertrack vhost_alias" CALLIGRA_FEATURES="kexi words flow plan sheets stage tables krita karbon braindump author" CAMERAS="ptp2" COLLECTD_PLUGINS="df interface irq load memory rrdtool swap syslog" CPU_FLAGS_X86="mmx mmxext sse sse2" ELIBC="glibc" GPSD_PROTOCOLS="ashtech aivdm earthmate evermore fv18 garmin garmintxt gpsclock itrax mtk3301 nmea ntrip navcom oceanserver oldstyle oncore rtcm104v2 rtcm104v3 sirf superstar2 timing tsip tripmate tnt ublox ubx" GRUB_PLATFORMS="efi-64" INPUT_DEVICES="evdev" KERNEL="linux" LCD_DEVICES="bayrad cfontz cfontz633 glk hd44780 lb216 lcdm001 mtxorb ncurses text" LIBREOFFICE_EXTENSIONS="presenter-console presenter-minimizer" OFFICE_IMPLEMENTATION="libreoffice" PHP_TARGETS="php5-5" PYTHON_SINGLE_TARGET="python2_7" PYTHON_TARGETS="python2_7 python3_3" RUBY_TARGETS="ruby19 ruby20 ruby22" USERLAND="GNU" VIDEO_CARDS="intel" XTABLES_ADDONS="quota2 psd pknock lscan length2 ipv4options ipset ipp2p iface geoip fuzzy condition tee tarpit sysrq steal rawnat logmark ipmark dhcpmac delude chaos account"
Unset:  CPPFLAGS, CTARGET, EMERGE_DEFAULT_OPTS, INSTALL_MASK, LC_ALL, MAKEOPTS, PORTAGE_BUNZIP2_COMMAND, PORTAGE_COMPRESS, PORTAGE_COMPRESS_FLAGS, PORTAGE_RSYNC_EXTRA_OPTS, USE_PYTHON


Does somebody has experience with installing kdevelop from the overlay or was facing the same issue?

Thx in advance!
Back to top
View user's profile Send private message
asturm
Developer
Developer


Joined: 05 Apr 2007
Posts: 6829
Location: Austria

PostPosted: Sat Jun 27, 2015 3:44 pm    Post subject: Reply with quote

Well, you are emerging a live ebuild, what fails right now might work again in two hours or tomorrow, until it breaks once more. I can give it a try as well in the evening on my plasma 5 box.
_________________
backend.cpp:92:2: warning: #warning TODO - this error message is about as useful as a cooling unit in the arctic
Back to top
View user's profile Send private message
cehrig
n00b
n00b


Joined: 27 Jun 2015
Posts: 11

PostPosted: Sat Jun 27, 2015 4:33 pm    Post subject: Reply with quote

Ah, i will try to build this later and keep that topic updated.

Thx
Back to top
View user's profile Send private message
Display posts from previous:   
Reply to topic    Gentoo Forums Forum Index Desktop Environments All times are GMT
Page 1 of 1

 
Jump to:  
You cannot post new topics in this forum
You cannot reply to topics in this forum
You cannot edit your posts in this forum
You cannot delete your posts in this forum
You cannot vote in polls in this forum