Gentoo Forums
Gentoo Forums
Gentoo Forums
Quick Search: in
[SOLVED] gnome-shell do not compile anymore
View unanswered posts
View posts from last 24 hours

 
Reply to topic    Gentoo Forums Forum Index Desktop Environments
View previous topic :: View next topic  
Author Message
jrevi
Tux's lil' helper
Tux's lil' helper


Joined: 08 Sep 2005
Posts: 129

PostPosted: Tue Jan 13, 2015 8:39 am    Post subject: [SOLVED] gnome-shell do not compile anymore Reply with quote

Dear all,

I cannot compile gnome-shell anymore due to this error which is certainly a dependency issue:

Code:
/usr/lib/gcc/x86_64-pc-linux-gnu/4.8.3/../../../../lib64/libmutter.so: undefined reference to `clutter_stage_set_paint_callback'
collect2: error: ld returned 1 exit status
Makefile:1420: recipe for target 'run-js-test' failed
make[4]: *** [run-js-test] Error 1
make[4]: *** Waiting for unfinished jobs....
/usr/lib/gcc/x86_64-pc-linux-gnu/4.8.3/../../../../lib64/libmutter.so: undefined reference to `clutter_stage_set_paint_callback'
collect2: error: ld returned 1 exit status
Makefile:1396: recipe for target 'gnome-shell' failed
make[4]: *** [gnome-shell] Error 1
make[4]: Leaving directory '/var/tmp/portage/gnome-base/gnome-shell-3.12.2/work/gnome-shell-3.12.2/src'
Makefile:2424: recipe for target 'all-recursive' failed
make[3]: *** [all-recursive] Error 1
make[3]: Leaving directory '/var/tmp/portage/gnome-base/gnome-shell-3.12.2/work/gnome-shell-3.12.2/src'
Makefile:1185: recipe for target 'all' failed
make[2]: *** [all] Error 2
make[2]: Leaving directory '/var/tmp/portage/gnome-base/gnome-shell-3.12.2/work/gnome-shell-3.12.2/src'
Makefile:516: recipe for target 'all-recursive' failed
make[1]: *** [all-recursive] Error 1
make[1]: Leaving directory '/var/tmp/portage/gnome-base/gnome-shell-3.12.2/work/gnome-shell-3.12.2'
Makefile:445: recipe for target 'all' failed
make: *** [all] Error 2


I also tried to recompile mutter without success:

Code:
./.libs/libmutter.so: undefined reference to `clutter_stage_set_paint_callback'
collect2: error: ld returned 1 exit status
Makefile:916: recipe for target 'testasyncgetprop' failed
make[4]: *** [testasyncgetprop] Error 1
make[4]: *** Waiting for unfinished jobs....
./.libs/libmutter.so: undefined reference to `clutter_stage_set_paint_callback'
collect2: error: ld returned 1 exit status
Makefile:924: recipe for target 'testgradient' failed
make[4]: *** [testgradient] Error 1
./.libs/libmutter.so: undefined reference to `clutter_stage_set_paint_callback'
collect2: error: ld returned 1 exit status
Makefile:912: recipe for target 'mutter' failed
make[4]: *** [mutter] Error 1
./.libs/libmutter.so: undefined reference to `clutter_stage_set_paint_callback'
collect2: error: ld returned 1 exit status
Makefile:920: recipe for target 'testboxes' failed
make[4]: *** [testboxes] Error 1


Any help would be appreciated.

Best,
Jerome


Last edited by jrevi on Tue Jan 13, 2015 12:43 pm; edited 1 time in total
Back to top
View user's profile Send private message
eccerr0r
Watchman
Watchman


Joined: 01 Jul 2004
Posts: 7051
Location: almost Mile High in the USA

PostPosted: Tue Jan 13, 2015 12:34 pm    Post subject: Reply with quote

Which version of mutter are you building?
I'm picking up x11-wm/mutter-3.12.2 and it seems to have that symbol defined in it...
_________________
Intel Core i7 2700K@ 4.1GHz/HD3000 graphics/8GB DDR3/180GB SSD
What am I supposed watching?
Back to top
View user's profile Send private message
jrevi
Tux's lil' helper
Tux's lil' helper


Joined: 08 Sep 2005
Posts: 129

PostPosted: Tue Jan 13, 2015 12:43 pm    Post subject: Reply with quote

Hi,

Thanks for your reply. I fixed it by downgrading media-libs/clutter which was updated to 1.20.0 by mistake (version compatible with gnome 3.14).

Best,
Jerom
Back to top
View user's profile Send private message
Display posts from previous:   
Reply to topic    Gentoo Forums Forum Index Desktop Environments All times are GMT
Page 1 of 1

 
Jump to:  
You cannot post new topics in this forum
You cannot reply to topics in this forum
You cannot edit your posts in this forum
You cannot delete your posts in this forum
You cannot vote in polls in this forum