Gentoo Forums
Gentoo Forums
Gentoo Forums
Quick Search: in
net-fs/sshfs fails to compile !
View unanswered posts
View posts from last 24 hours

 
Reply to topic    Gentoo Forums Forum Index Portage & Programming
View previous topic :: View next topic  
Author Message
denn0n
n00b
n00b


Joined: 24 May 2020
Posts: 33

PostPosted: Thu Jul 22, 2021 3:49 am    Post subject: net-fs/sshfs fails to compile ! Reply with quote

in a fresh install

Code:
emerge net-fs/sshfs


fails this is the log I still getting familiar to track errors but I not sure what it's the problem if someone could help to solve this and give me some advice on how to do it thank you !

Code:
cat /var/tmp/portage/net-fs/sshfs-3.7.0/temp/build.log
 * Package:    net-fs/sshfs-3.7.0
 * Repository: gentoo
 * Maintainer: bman@gentoo.org
 * USE:        abi_x86_64 amd64 elibc_glibc kernel_linux userland_GNU
 * FEATURES:   distcc network-sandbox preserve-libs sandbox userpriv usersandbox
>>> Unpacking source...
>>> Unpacking sshfs-3.7.0.tar.xz to /var/tmp/portage/net-fs/sshfs-3.7.0/work
>>> Source unpacked in /var/tmp/portage/net-fs/sshfs-3.7.0/work
>>> Preparing source in /var/tmp/portage/net-fs/sshfs-3.7.0/work/sshfs-3.7.0 ...
>>> Source prepared.
>>> Configuring source in /var/tmp/portage/net-fs/sshfs-3.7.0/work/sshfs-3.7.0 ...
meson setup --buildtype plain --libdir lib64 --localstatedir /var/lib --prefix /usr --sysconfdir /etc --wrap-mode nodownload --build.pkg-config-path /usr/share/pkgconfig --pkg-config-path /usr/share/pkgconfig --native-file /var/tmp/portage/net-fs/sshfs-3.7.0/temp/meson.x86_64-pc-linux-gnu.amd64.ini /var/tmp/portage/net-fs/sshfs-3.7.0/work/sshfs-3.7.0 /var/tmp/portage/net-fs/sshfs-3.7.0/work/sshfs-3.7.0-build
The Meson build system
Version: 0.57.2
Source dir: /var/tmp/portage/net-fs/sshfs-3.7.0/work/sshfs-3.7.0
Build dir: /var/tmp/portage/net-fs/sshfs-3.7.0/work/sshfs-3.7.0-build
Build type: native build
Project name: sshfs
Project version: 3.7.0
C compiler for the host machine: x86_64-pc-linux-gnu-gcc (gcc 10.3.0 "x86_64-pc-linux-gnu-gcc (Gentoo 10.3.0-r2 p3) 10.3.0")
C linker for the host machine: x86_64-pc-linux-gnu-gcc ld.bfd 2.35.2
Host machine cpu family: x86_64
Host machine cpu: x86_64
meson.build:8: WARNING: Consider using the built-in warning_level option instead of using "-Wall".
meson.build:8: WARNING: Consider using the built-in warning_level option instead of using "-Wextra".
Message: Compiler warns about unused result even when casting to void
Program rst2man.py found: YES (/usr/bin/rst2man.py)
Configuring config.h using configuration
Found pkg-config: /usr/bin/x86_64-pc-linux-gnu-pkg-config (1.6.3)
Run-time dependency fuse3 found: YES 3.10.3
Run-time dependency glib-2.0 found: YES 2.68.3
Run-time dependency gthread-2.0 found: YES 2.68.3
Program utils/install_helper.sh found: YES (/var/tmp/portage/net-fs/sshfs-3.7.0/work/sshfs-3.7.0/utils/install_helper.sh)
Build targets in project: 4

Option buildtype is: plain [default: debugoptimized]
Found ninja-1.10.1 at /usr/bin/ninja
>>> Source configured.
>>> Compiling source in /var/tmp/portage/net-fs/sshfs-3.7.0/work/sshfs-3.7.0 ...
ninja -v -j17 -l4 -C /var/tmp/portage/net-fs/sshfs-3.7.0/work/sshfs-3.7.0-build
ninja: Entering directory `/var/tmp/portage/net-fs/sshfs-3.7.0/work/sshfs-3.7.0-build'
[1/7] cp -fPp ../sshfs-3.7.0/test/conftest.py ../sshfs-3.7.0/test/pytest.ini ../sshfs-3.7.0/test/test_sshfs.py ../sshfs-3.7.0/test/util.py /var/tmp/portage/net-fs/sshfs-3.7.0/work/sshfs-3.7.0-build/test
[2/7] x86_64-pc-linux-gnu-gcc -Itest/wrong_command.p -Itest -I../sshfs-3.7.0/test -fdiagnostics-color=always -pipe -D_FILE_OFFSET_BITS=64 -Wall -Winvalid-pch -D_REENTRANT -DHAVE_CONFIG_H -Wall -Wextra -Wno-sign-compare -Wmissing-declarations -Wwrite-strings -Wno-unused-result -march=btver2 -mtune=btver2 -O2 -MD -MQ test/wrong_command.p/wrong_command.c.o -MF test/wrong_command.p/wrong_command.c.o.d -o test/wrong_command.p/wrong_command.c.o -c ../sshfs-3.7.0/test/wrong_command.c
[3/7] x86_64-pc-linux-gnu-gcc  -o test/wrong_command test/wrong_command.p/wrong_command.c.o -Wl,--as-needed -Wl,--no-undefined -march=btver2 -mtune=btver2 -O2 -pipe -Wl,-O1 -Wl,--as-needed
[4/7] /usr/bin/rst2man.py ../sshfs-3.7.0/sshfs.rst sshfs.1
[5/7] x86_64-pc-linux-gnu-gcc -Isshfs.p -I. -I../sshfs-3.7.0 -I/usr/include/fuse3 -I/usr/include/glib-2.0 -I/usr/lib64/glib-2.0/include -fdiagnostics-color=always -pipe -D_FILE_OFFSET_BITS=64 -Wall -Winvalid-pch -D_REENTRANT -DHAVE_CONFIG_H -Wall -Wextra -Wno-sign-compare -Wmissing-declarations -Wwrite-strings -Wno-unused-result -march=btver2 -mtune=btver2 -O2 -pthread -DFUSE_USE_VERSION=31 -MD -MQ sshfs.p/cache.c.o -MF sshfs.p/cache.c.o.d -o sshfs.p/cache.c.o -c ../sshfs-3.7.0/cache.c
[6/7] x86_64-pc-linux-gnu-gcc -Isshfs.p -I. -I../sshfs-3.7.0 -I/usr/include/fuse3 -I/usr/include/glib-2.0 -I/usr/lib64/glib-2.0/include -fdiagnostics-color=always -pipe -D_FILE_OFFSET_BITS=64 -Wall -Winvalid-pch -D_REENTRANT -DHAVE_CONFIG_H -Wall -Wextra -Wno-sign-compare -Wmissing-declarations -Wwrite-strings -Wno-unused-result -march=btver2 -mtune=btver2 -O2 -pthread -DFUSE_USE_VERSION=31 -MD -MQ sshfs.p/sshfs.c.o -MF sshfs.p/sshfs.c.o.d -o sshfs.p/sshfs.c.o -c ../sshfs-3.7.0/sshfs.c
[7/7] x86_64-pc-linux-gnu-gcc  -o sshfs sshfs.p/sshfs.c.o sshfs.p/cache.c.o -Wl,--as-needed -Wl,--no-undefined -march=btver2 -mtune=btver2 -O2 -pipe -Wl,-O1 -Wl,--as-needed -Wl,--start-group /usr/lib64/libfuse3.so -lpthread /usr/lib64/libglib-2.0.so /usr/lib64/libgthread-2.0.so -Wl,--end-group -pthread
FAILED: sshfs
x86_64-pc-linux-gnu-gcc  -o sshfs sshfs.p/sshfs.c.o sshfs.p/cache.c.o -Wl,--as-needed -Wl,--no-undefined -march=btver2 -mtune=btver2 -O2 -pipe -Wl,-O1 -Wl,--as-needed -Wl,--start-group /usr/lib64/libfuse3.so -lpthread /usr/lib64/libglib-2.0.so /usr/lib64/libgthread-2.0.so -Wl,--end-group -pthread
/usr/lib/gcc/x86_64-pc-linux-gnu/10.3.0/../../../../x86_64-pc-linux-gnu/bin/ld: sshfs.p/sshfs.c.o: in function `main':
sshfs.c:(.text.startup+0x635): undefined reference to `fuse_new'
collect2: error: ld returned 1 exit status
distcc[53] ERROR: compile (null) on localhost failed
ninja: build stopped: subcommand failed.
 * ERROR: net-fs/sshfs-3.7.0::gentoo failed (compile phase):
 *   ninja -v -j17 -l4 -C /var/tmp/portage/net-fs/sshfs-3.7.0/work/sshfs-3.7.0-build failed
 *
 * Call stack:
 *     ebuild.sh, line  127:  Called src_compile
 *   environment, line 2145:  Called meson_src_compile
 *   environment, line 1506:  Called eninja '-C' '/var/tmp/portage/net-fs/sshfs-3.7.0/work/sshfs-3.7.0-build'
 *   environment, line 1075:  Called die
 * The specific snippet of code:
 *       "$@" || die "${nonfatal_args[@]}" "${*} failed"
 *
 * If you need support, post the output of `emerge --info '=net-fs/sshfs-3.7.0::gentoo'`,
 * the complete build log and the output of `emerge -pqv '=net-fs/sshfs-3.7.0::gentoo'`.
 * The complete build log is located at '/var/tmp/portage/net-fs/sshfs-3.7.0/temp/build.log'.
 * The ebuild environment file is located at '/var/tmp/portage/net-fs/sshfs-3.7.0/temp/environment'.
 * Working directory: '/var/tmp/portage/net-fs/sshfs-3.7.0/work/sshfs-3.7.0'
 * S: '/var/tmp/portage/net-fs/sshfs-3.7.0/work/sshfs-3.7.0'


Code:
emerge --info '=net-fs/sshfs-3.7.0::gentoo'
Portage 3.0.20 (python 3.9.5-final-0, default/linux/amd64/17.1/desktop/plasma, gcc-10.3.0, glibc-2.33-r1, 5.10.27-gentoo-x86_64 x86_64)
=================================================================
                         System Settings
=================================================================
System uname: Linux-5.10.27-gentoo-x86_64-x86_64-AMD_A8-7410_APU_with_AMD_Radeon_R5_Graphics-with-glibc2.33
KiB Mem:     7047104 total,   2848172 free
KiB Swap:          0 total,         0 free
Timestamp of repository gentoo: Sun, 18 Jul 2021 04:30:01 +0000
Head commit of repository gentoo: 505fd180e97562c9b68495ad0a6bd24d44e233cf
sh bash 5.1_p8
ld GNU ld (Gentoo 2.35.2 p1) 2.35.2
distcc 3.4 x86_64-pc-linux-gnu [enabled]
app-shells/bash:          5.1_p8::gentoo
dev-lang/perl:            5.32.1::gentoo
dev-lang/python:          2.7.18_p11::gentoo, 3.9.5_p2::gentoo
dev-lang/rust:            1.52.1::gentoo
dev-util/cmake:           3.18.5::gentoo
sys-apps/baselayout:      2.7::gentoo
sys-apps/openrc:          0.42.1-r1::gentoo
sys-apps/sandbox:         2.24::gentoo
sys-devel/autoconf:       2.13-r1::gentoo, 2.69-r5::gentoo
sys-devel/automake:       1.16.3-r1::gentoo
sys-devel/binutils:       2.35.2::gentoo
sys-devel/gcc:            10.3.0-r2::gentoo
sys-devel/gcc-config:     2.4::gentoo
sys-devel/libtool:        2.4.6-r6::gentoo
sys-devel/make:           4.3::gentoo
sys-kernel/linux-headers: 5.10::gentoo (virtual/os-headers)
sys-libs/glibc:           2.33-r1::gentoo
Repositories:

gentoo
    location: /var/db/repos/gentoo
    sync-type: rsync
    sync-uri: rsync://rsync.gentoo.org/gentoo-portage
    priority: -1000
    sync-rsync-verify-max-age: 24
    sync-rsync-verify-jobs: 1
    sync-rsync-verify-metamanifest: yes
    sync-rsync-extra-opts:

ACCEPT_KEYWORDS="amd64"
ACCEPT_LICENSE="@FREE"
CBUILD="x86_64-pc-linux-gnu"
CFLAGS="-march=btver2 -mtune=btver2 -O2 -pipe"
CHOST="x86_64-pc-linux-gnu"
CONFIG_PROTECT="/etc /usr/share/config /usr/share/gnupg/qualified.txt"
CONFIG_PROTECT_MASK="/etc/ca-certificates.conf /etc/dconf /etc/env.d /etc/fonts/fonts.conf /etc/gconf /etc/gentoo-release /etc/sandbox.d /etc/terminfo"
CXXFLAGS="-march=btver2 -mtune=btver2 -O2 -pipe"
DISTDIR="/var/cache/distfiles"
ENV_UNSET="CARGO_HOME DBUS_SESSION_BUS_ADDRESS DISPLAY GOBIN GOPATH PERL5LIB PERL5OPT PERLPREFIX PERL_CORE PERL_MB_OPT PERL_MM_OPT XAUTHORITY XDG_CACHE_HOME XDG_CONFIG_HOME XDG_DATA_HOME XDG_RUNTIME_DIR"
FCFLAGS="-march=btver2 -mtune=btver2 -O2 -pipe"
FEATURES="assume-digests binpkg-docompress binpkg-dostrip binpkg-logs config-protect-if-modified distcc distlocks ebuild-locks fixlafiles ipc-sandbox merge-sync multilib-strict network-sandbox news parallel-fetch pid-sandbox preserve-libs protect-owned qa-unresolved-soname-deps sandbox sfperms strict unknown-features-warn unmerge-logs unmerge-orphans userfetch userpriv usersandbox usersync xattr"
FFLAGS="-march=btver2 -mtune=btver2 -O2 -pipe"
GENTOO_MIRRORS="http://gentoo.mirrors.tera-byte.com/"
LANG="C.UTF8"
LDFLAGS="-Wl,-O1 -Wl,--as-needed"
MAKEOPTS="-j17 -l4"
PKGDIR="/var/cache/binpkgs"
PORTAGE_CONFIGROOT="/"
PORTAGE_RSYNC_OPTS="--recursive --links --safe-links --perms --times --omit-dir-times --compress --force --whole-file --delete --stats --human-readable --timeout=180 --exclude=/distfiles --exclude=/local --exclude=/packages --exclude=/.git"
PORTAGE_TMPDIR="/var/tmp"
USE="X a52 aac acl acpi activities alsa amd64 bluetooth branding bzip2 cairo cdda cdr cli crypt cups dbus declarative dri dts dvd dvdr elogind emboss encode exif flac fortran gdbm gif gpm gtk gui iconv icu ipv6 jpeg kde kipi kwallet lcms libglvnd libnotify libtirpc mad mng mp3 mp4 mpeg multilib ncurses nls nptl ogg opengl openmp pam pango pcre pdf phonon plasma png policykit ppds qml qt5 readline sdl seccomp semantic-desktop spell split-usr ssl startup-notification svg tcpd tiff truetype udev udisks unicode upower usb vorbis widgets wxwidgets x264 xattr xcb xml xv xvid zlib" ABI_X86="64" ADA_TARGET="gnat_2018" ALSA_CARDS="ali5451 als4000 atiixp atiixp-modem bt87x ca0106 cmipci emu10k1x ens1370 ens1371 es1938 es1968 fm801 hda-intel intel8x0 intel8x0m maestro3 trident usb-audio via82xx via82xx-modem ymfpci" APACHE2_MODULES="authn_core authz_core socache_shmcb unixd actions alias auth_basic authn_alias authn_anon authn_dbm authn_default authn_file authz_dbm authz_default authz_groupfile authz_host authz_owner authz_user autoindex cache cgi cgid dav dav_fs dav_lock deflate dir disk_cache env expires ext_filter file_cache filter headers include info log_config logio mem_cache mime mime_magic negotiation rewrite setenvif speling status unique_id userdir usertrack vhost_alias" CALLIGRA_FEATURES="karbon sheets words" COLLECTD_PLUGINS="df interface irq load memory rrdtool swap syslog" CPU_FLAGS_X86="mmx mmxext sse sse2" ELIBC="glibc" GPSD_PROTOCOLS="ashtech aivdm earthmate evermore fv18 garmin garmintxt gpsclock greis isync itrax mtk3301 nmea ntrip navcom oceanserver oldstyle oncore rtcm104v2 rtcm104v3 sirf skytraq superstar2 timing tsip tripmate tnt ublox ubx" INPUT_DEVICES="libinput" KERNEL="linux" LCD_DEVICES="bayrad cfontz cfontz633 glk hd44780 lb216 lcdm001 mtxorb ncurses text" LIBREOFFICE_EXTENSIONS="presenter-console presenter-minimizer" LUA_SINGLE_TARGET="lua5-1" LUA_TARGETS="lua5-1" OFFICE_IMPLEMENTATION="libreoffice" PHP_TARGETS="php7-3 php7-4" POSTGRES_TARGETS="postgres10 postgres11" PYTHON_SINGLE_TARGET="python3_9" PYTHON_TARGETS="python3_9" RUBY_TARGETS="ruby26" USERLAND="GNU" VIDEO_CARDS="radeon r300" XTABLES_ADDONS="quota2 psd pknock lscan length2 ipv4options ipset ipp2p iface geoip fuzzy condition tee tarpit sysrq proto steal rawnat logmark ipmark dhcpmac delude chaos account"
Unset:  CC, CPPFLAGS, CTARGET, CXX, EMERGE_DEFAULT_OPTS, INSTALL_MASK, LC_ALL, LINGUAS, PORTAGE_BINHOST, PORTAGE_BUNZIP2_COMMAND, PORTAGE_COMPRESS, PORTAGE_COMPRESS_FLAGS, PORTAGE_RSYNC_EXTRA_OPTS, RUSTFLAGS
Back to top
View user's profile Send private message
fedeliallalinea
Administrator
Administrator


Joined: 08 Mar 2003
Posts: 26733
Location: here

PostPosted: Thu Jul 22, 2021 4:30 am    Post subject: Reply with quote

Moved from Desktop Environments to Portage & Programming.
_________________
Questions are guaranteed in life; Answers aren't.
Back to top
View user's profile Send private message
fedeliallalinea
Administrator
Administrator


Joined: 08 Mar 2003
Posts: 26733
Location: here

PostPosted: Thu Jul 22, 2021 4:32 am    Post subject: Reply with quote

Try to rebuild sys-fs/fuse:3
_________________
Questions are guaranteed in life; Answers aren't.
Back to top
View user's profile Send private message
denn0n
n00b
n00b


Joined: 24 May 2020
Posts: 33

PostPosted: Thu Jul 22, 2021 4:55 am    Post subject: Reply with quote

fedeliallalinea wrote:
Try to rebuild sys-fs/fuse:3

Thank you i didn't know were to post but I will take note

this is the exit of
Code:
emerge sys-fs/fuse
Calculating dependencies... done!

>>> Verifying ebuild manifests

>>> Emerging (1 of 1) sys-fs/fuse-3.10.3::gentoo
 * fuse-3.10.3.tar.xz BLAKE2B SHA512 size ;-) ...                                                                                                                                     [ ok ]
>>> Unpacking source...
>>> Unpacking fuse-3.10.3.tar.xz to /var/tmp/portage/sys-fs/fuse-3.10.3/work
>>> Source unpacked in /var/tmp/portage/sys-fs/fuse-3.10.3/work
>>> Preparing source in /var/tmp/portage/sys-fs/fuse-3.10.3/work/fuse-3.10.3 ...
>>> Source prepared.
>>> Configuring source in /var/tmp/portage/sys-fs/fuse-3.10.3/work/fuse-3.10.3 ...
 * abi_x86_64.amd64: running multilib-minimal_abi_src_configure
meson setup --buildtype plain --libdir lib64 --localstatedir /var/lib --prefix /usr --sysconfdir /etc --wrap-mode nodownload --build.pkg-config-path /usr/share/pkgconfig --pkg-config-path /usr/share/pkgconfig --native-file /var/tmp/portage/sys-fs/fuse-3.10.3/temp/meson.x86_64-pc-linux-gnu.amd64.ini -Dexamples=false -Duseroot=false -Dudevrulesdir=/lib/udev/rules.d /var/tmp/portage/sys-fs/fuse-3.10.3/work/fuse-3.10.3 /var/tmp/portage/sys-fs/fuse-3.10.3/work/fuse-3.10.3-abi_x86_64.amd64
The Meson build system
Version: 0.57.2
Source dir: /var/tmp/portage/sys-fs/fuse-3.10.3/work/fuse-3.10.3
Build dir: /var/tmp/portage/sys-fs/fuse-3.10.3/work/fuse-3.10.3-abi_x86_64.amd64
Build type: native build
Project name: libfuse3
Project version: 3.10.3
C compiler for the host machine: x86_64-pc-linux-gnu-gcc (gcc 10.3.0 "x86_64-pc-linux-gnu-gcc (Gentoo 10.3.0-r2 p3) 10.3.0")
C linker for the host machine: x86_64-pc-linux-gnu-gcc ld.bfd 2.35.2
Host machine cpu family: x86_64
Host machine cpu: x86_64
Checking for function "fork" : YES
Checking for function "fstatat" : YES
Checking for function "openat" : YES
Checking for function "readlinkat" : YES
Checking for function "pipe2" : YES
Checking for function "splice" : YES
Checking for function "vmsplice" : YES
Checking for function "posix_fallocate" : YES
Checking for function "fdatasync" : YES
Checking for function "utimensat" : YES
Checking for function "copy_file_range" : YES
Checking for function "fallocate" : YES
Checking for function "setxattr" : YES
Checking for function "iconv" : YES
Checking whether type "struct stat" has member "st_atim" : YES
Checking whether type "struct stat" has member "st_atimespec" : NO
Configuring config.h using configuration
../fuse-3.10.3/meson.build:68: WARNING: Consider using the built-in warning_level option instead of using "-Wall".
../fuse-3.10.3/meson.build:68: WARNING: Consider using the built-in warning_level option instead of using "-Wextra".
../fuse-3.10.3/meson.build:72: WARNING: Consider using the built-in warning_level option instead of using "-Wall".
../fuse-3.10.3/meson.build:72: WARNING: Consider using the built-in warning_level option instead of using "-Wextra".
../fuse-3.10.3/meson.build:72: WARNING: Consider using the built-in option for language standard version instead of using "-std=c++11".
Message: Compiler warns about unused result even when casting to void
Message: Compiler supports symver attribute
Run-time dependency threads found: YES
Library iconv found: NO
Library dl found: YES
Library rt found: YES
Program install_helper.sh found: YES (/var/tmp/portage/sys-fs/fuse-3.10.3/work/fuse-3.10.3/util/install_helper.sh)
Build targets in project: 9

Option buildtype is: plain [default: debugoptimized]
Found ninja-1.10.1 at /usr/bin/ninja
>>> Source configured.
>>> Compiling source in /var/tmp/portage/sys-fs/fuse-3.10.3/work/fuse-3.10.3 ...
 * abi_x86_64.amd64: running multilib-minimal_abi_src_compile
ninja -v -j17 -l4 -C /var/tmp/portage/sys-fs/fuse-3.10.3/work/fuse-3.10.3-abi_x86_64.amd64
ninja: Entering directory `/var/tmp/portage/sys-fs/fuse-3.10.3/work/fuse-3.10.3-abi_x86_64.amd64'
[1/32] x86_64-pc-linux-gnu-gcc -Ilib/libfuse3.so.3.10.3.p -Ilib -I../fuse-3.10.3/lib -Iinclude -I../fuse-3.10.3/include -I. -I../fuse-3.10.3 -fdiagnostics-color=always -pipe -D_FILE_OFFSET_BITS=64 -Wall -Winvalid-pch -D_REENTRANT -DHAVE_CONFIG_H -Wall -Wextra -Wno-sign-compare -Wstrict-prototypes -Wmissing-declarations -Wwrite-strings -fno-strict-aliasing -Wno-unused-result -DHAVE_SYMVER_ATTRIBUTE -march=btver2 -mtune=btver2 -O2 -fPIC -pthread -DFUSE_USE_VERSION=35 '-DFUSERMOUNT_DIR="/usr/bin"' -MD -MQ lib/libfuse3.so.3.10.3.p/fuse_loop.c.o -MF lib/libfuse3.so.3.10.3.p/fuse_loop.c.o.d -o lib/libfuse3.so.3.10.3.p/fuse_loop.c.o -c ../fuse-3.10.3/lib/fuse_loop.c
[2/32] x86_64-pc-linux-gnu-gcc -Ilib/libfuse3.so.3.10.3.p -Ilib -I../fuse-3.10.3/lib -Iinclude -I../fuse-3.10.3/include -I. -I../fuse-3.10.3 -fdiagnostics-color=always -pipe -D_FILE_OFFSET_BITS=64 -Wall -Winvalid-pch -D_REENTRANT -DHAVE_CONFIG_H -Wall -Wextra -Wno-sign-compare -Wstrict-prototypes -Wmissing-declarations -Wwrite-strings -fno-strict-aliasing -Wno-unused-result -DHAVE_SYMVER_ATTRIBUTE -march=btver2 -mtune=btver2 -O2 -fPIC -pthread -DFUSE_USE_VERSION=35 '-DFUSERMOUNT_DIR="/usr/bin"' -MD -MQ lib/libfuse3.so.3.10.3.p/fuse_signals.c.o -MF lib/libfuse3.so.3.10.3.p/fuse_signals.c.o.d -o lib/libfuse3.so.3.10.3.p/fuse_signals.c.o -c ../fuse-3.10.3/lib/fuse_signals.c
[3/32] cp -fPp ../fuse-3.10.3/test/conftest.py ../fuse-3.10.3/test/pytest.ini ../fuse-3.10.3/test/test_examples.py ../fuse-3.10.3/test/util.py ../fuse-3.10.3/test/test_ctests.py /var/tmp/portage/sys-fs/fuse-3.10.3/work/fuse-3.10.3-abi_x86_64.amd64/test
[4/32] x86_64-pc-linux-gnu-gcc -Itest/readdir_inode.p -Itest -I../fuse-3.10.3/test -Iinclude -I../fuse-3.10.3/include -Ilib -I../fuse-3.10.3/lib -I. -I../fuse-3.10.3 -fdiagnostics-color=always -pipe -D_FILE_OFFSET_BITS=64 -Wall -Winvalid-pch -D_REENTRANT -DHAVE_CONFIG_H -Wall -Wextra -Wno-sign-compare -Wstrict-prototypes -Wmissing-declarations -Wwrite-strings -fno-strict-aliasing -Wno-unused-result -DHAVE_SYMVER_ATTRIBUTE -march=btver2 -mtune=btver2 -O2 -MD -MQ test/readdir_inode.p/readdir_inode.c.o -MF test/readdir_inode.p/readdir_inode.c.o.d -o test/readdir_inode.p/readdir_inode.c.o -c ../fuse-3.10.3/test/readdir_inode.c
[5/32] x86_64-pc-linux-gnu-gcc -Itest/wrong_command.p -Itest -I../fuse-3.10.3/test -fdiagnostics-color=always -pipe -D_FILE_OFFSET_BITS=64 -Wall -Winvalid-pch -D_REENTRANT -DHAVE_CONFIG_H -Wall -Wextra -Wno-sign-compare -Wstrict-prototypes -Wmissing-declarations -Wwrite-strings -fno-strict-aliasing -Wno-unused-result -DHAVE_SYMVER_ATTRIBUTE -march=btver2 -mtune=btver2 -O2 -MD -MQ test/wrong_command.p/wrong_command.c.o -MF test/wrong_command.p/wrong_command.c.o.d -o test/wrong_command.p/wrong_command.c.o -c ../fuse-3.10.3/test/wrong_command.c
[6/32] x86_64-pc-linux-gnu-gcc  -o test/readdir_inode test/readdir_inode.p/readdir_inode.c.o -Wl,--as-needed -Wl,--no-undefined -march=btver2 -mtune=btver2 -O2 -pipe -Wl,-O1 -Wl,--as-needed
[7/32] x86_64-pc-linux-gnu-gcc  -o test/wrong_command test/wrong_command.p/wrong_command.c.o -Wl,--as-needed -Wl,--no-undefined -march=btver2 -mtune=btver2 -O2 -pipe -Wl,-O1 -Wl,--as-needed
[8/32] x86_64-pc-linux-gnu-gcc -Ilib/libfuse3.so.3.10.3.p -Ilib -I../fuse-3.10.3/lib -Iinclude -I../fuse-3.10.3/include -I. -I../fuse-3.10.3 -fdiagnostics-color=always -pipe -D_FILE_OFFSET_BITS=64 -Wall -Winvalid-pch -D_REENTRANT -DHAVE_CONFIG_H -Wall -Wextra -Wno-sign-compare -Wstrict-prototypes -Wmissing-declarations -Wwrite-strings -fno-strict-aliasing -Wno-unused-result -DHAVE_SYMVER_ATTRIBUTE -march=btver2 -mtune=btver2 -O2 -fPIC -pthread -DFUSE_USE_VERSION=35 '-DFUSERMOUNT_DIR="/usr/bin"' -MD -MQ lib/libfuse3.so.3.10.3.p/fuse_opt.c.o -MF lib/libfuse3.so.3.10.3.p/fuse_opt.c.o.d -o lib/libfuse3.so.3.10.3.p/fuse_opt.c.o -c ../fuse-3.10.3/lib/fuse_opt.c
[9/32] x86_64-pc-linux-gnu-gcc -Iutil/fusermount3.p -Iutil -I../fuse-3.10.3/util -Iinclude -I../fuse-3.10.3/include -Ilib -I../fuse-3.10.3/lib -I. -I../fuse-3.10.3 -fdiagnostics-color=always -pipe -D_FILE_OFFSET_BITS=64 -Wall -Winvalid-pch -D_REENTRANT -DHAVE_CONFIG_H -Wall -Wextra -Wno-sign-compare -Wstrict-prototypes -Wmissing-declarations -Wwrite-strings -fno-strict-aliasing -Wno-unused-result -DHAVE_SYMVER_ATTRIBUTE -march=btver2 -mtune=btver2 -O2 '-DFUSE_CONF="/etc/fuse.conf"' -MD -MQ util/fusermount3.p/.._lib_mount_util.c.o -MF util/fusermount3.p/.._lib_mount_util.c.o.d -o util/fusermount3.p/.._lib_mount_util.c.o -c ../fuse-3.10.3/lib/mount_util.c
[10/32] x86_64-pc-linux-gnu-gcc -Iutil/mount.fuse3.p -Iutil -I../fuse-3.10.3/util -Iinclude -I../fuse-3.10.3/include -Ilib -I../fuse-3.10.3/lib -I. -I../fuse-3.10.3 -fdiagnostics-color=always -pipe -D_FILE_OFFSET_BITS=64 -Wall -Winvalid-pch -D_REENTRANT -DHAVE_CONFIG_H -Wall -Wextra -Wno-sign-compare -Wstrict-prototypes -Wmissing-declarations -Wwrite-strings -fno-strict-aliasing -Wno-unused-result -DHAVE_SYMVER_ATTRIBUTE -march=btver2 -mtune=btver2 -O2 -DFUSE_USE_VERSION=35 -MD -MQ util/mount.fuse3.p/mount.fuse.c.o -MF util/mount.fuse3.p/mount.fuse.c.o.d -o util/mount.fuse3.p/mount.fuse.c.o -c ../fuse-3.10.3/util/mount.fuse.c
[11/32] x86_64-pc-linux-gnu-gcc -Ilib/libfuse3.so.3.10.3.p -Ilib -I../fuse-3.10.3/lib -Iinclude -I../fuse-3.10.3/include -I. -I../fuse-3.10.3 -fdiagnostics-color=always -pipe -D_FILE_OFFSET_BITS=64 -Wall -Winvalid-pch -D_REENTRANT -DHAVE_CONFIG_H -Wall -Wextra -Wno-sign-compare -Wstrict-prototypes -Wmissing-declarations -Wwrite-strings -fno-strict-aliasing -Wno-unused-result -DHAVE_SYMVER_ATTRIBUTE -march=btver2 -mtune=btver2 -O2 -fPIC -pthread -DFUSE_USE_VERSION=35 '-DFUSERMOUNT_DIR="/usr/bin"' -MD -MQ lib/libfuse3.so.3.10.3.p/fuse_loop_mt.c.o -MF lib/libfuse3.so.3.10.3.p/fuse_loop_mt.c.o.d -o lib/libfuse3.so.3.10.3.p/fuse_loop_mt.c.o -c ../fuse-3.10.3/lib/fuse_loop_mt.c
[12/32] x86_64-pc-linux-gnu-gcc -Ilib/libfuse3.so.3.10.3.p -Ilib -I../fuse-3.10.3/lib -Iinclude -I../fuse-3.10.3/include -I. -I../fuse-3.10.3 -fdiagnostics-color=always -pipe -D_FILE_OFFSET_BITS=64 -Wall -Winvalid-pch -D_REENTRANT -DHAVE_CONFIG_H -Wall -Wextra -Wno-sign-compare -Wstrict-prototypes -Wmissing-declarations -Wwrite-strings -fno-strict-aliasing -Wno-unused-result -DHAVE_SYMVER_ATTRIBUTE -march=btver2 -mtune=btver2 -O2 -fPIC -pthread -DFUSE_USE_VERSION=35 '-DFUSERMOUNT_DIR="/usr/bin"' -MD -MQ lib/libfuse3.so.3.10.3.p/fuse_lowlevel.c.o -MF lib/libfuse3.so.3.10.3.p/fuse_lowlevel.c.o.d -o lib/libfuse3.so.3.10.3.p/fuse_lowlevel.c.o -c ../fuse-3.10.3/lib/fuse_lowlevel.c
[13/32] x86_64-pc-linux-gnu-gcc -Iutil/fusermount3.p -Iutil -I../fuse-3.10.3/util -Iinclude -I../fuse-3.10.3/include -Ilib -I../fuse-3.10.3/lib -I. -I../fuse-3.10.3 -fdiagnostics-color=always -pipe -D_FILE_OFFSET_BITS=64 -Wall -Winvalid-pch -D_REENTRANT -DHAVE_CONFIG_H -Wall -Wextra -Wno-sign-compare -Wstrict-prototypes -Wmissing-declarations -Wwrite-strings -fno-strict-aliasing -Wno-unused-result -DHAVE_SYMVER_ATTRIBUTE -march=btver2 -mtune=btver2 -O2 '-DFUSE_CONF="/etc/fuse.conf"' -MD -MQ util/fusermount3.p/fusermount.c.o -MF util/fusermount3.p/fusermount.c.o.d -o util/fusermount3.p/fusermount.c.o -c ../fuse-3.10.3/util/fusermount.c
[14/32] x86_64-pc-linux-gnu-gcc -Ilib/libfuse3.so.3.10.3.p -Ilib -I../fuse-3.10.3/lib -Iinclude -I../fuse-3.10.3/include -I. -I../fuse-3.10.3 -fdiagnostics-color=always -pipe -D_FILE_OFFSET_BITS=64 -Wall -Winvalid-pch -D_REENTRANT -DHAVE_CONFIG_H -Wall -Wextra -Wno-sign-compare -Wstrict-prototypes -Wmissing-declarations -Wwrite-strings -fno-strict-aliasing -Wno-unused-result -DHAVE_SYMVER_ATTRIBUTE -march=btver2 -mtune=btver2 -O2 -fPIC -pthread -DFUSE_USE_VERSION=35 '-DFUSERMOUNT_DIR="/usr/bin"' -MD -MQ lib/libfuse3.so.3.10.3.p/buffer.c.o -MF lib/libfuse3.so.3.10.3.p/buffer.c.o.d -o lib/libfuse3.so.3.10.3.p/buffer.c.o -c ../fuse-3.10.3/lib/buffer.c
[15/32] x86_64-pc-linux-gnu-gcc  -o util/fusermount3 util/fusermount3.p/fusermount.c.o util/fusermount3.p/.._lib_mount_util.c.o -Wl,--as-needed -Wl,--no-undefined -march=btver2 -mtune=btver2 -O2 -pipe -Wl,-O1 -Wl,--as-needed
[16/32] x86_64-pc-linux-gnu-gcc -Ilib/libfuse3.so.3.10.3.p -Ilib -I../fuse-3.10.3/lib -Iinclude -I../fuse-3.10.3/include -I. -I../fuse-3.10.3 -fdiagnostics-color=always -pipe -D_FILE_OFFSET_BITS=64 -Wall -Winvalid-pch -D_REENTRANT -DHAVE_CONFIG_H -Wall -Wextra -Wno-sign-compare -Wstrict-prototypes -Wmissing-declarations -Wwrite-strings -fno-strict-aliasing -Wno-unused-result -DHAVE_SYMVER_ATTRIBUTE -march=btver2 -mtune=btver2 -O2 -fPIC -pthread -DFUSE_USE_VERSION=35 '-DFUSERMOUNT_DIR="/usr/bin"' -MD -MQ lib/libfuse3.so.3.10.3.p/cuse_lowlevel.c.o -MF lib/libfuse3.so.3.10.3.p/cuse_lowlevel.c.o.d -o lib/libfuse3.so.3.10.3.p/cuse_lowlevel.c.o -c ../fuse-3.10.3/lib/cuse_lowlevel.c
[17/32] x86_64-pc-linux-gnu-gcc -Ilib/libfuse3.so.3.10.3.p -Ilib -I../fuse-3.10.3/lib -Iinclude -I../fuse-3.10.3/include -I. -I../fuse-3.10.3 -fdiagnostics-color=always -pipe -D_FILE_OFFSET_BITS=64 -Wall -Winvalid-pch -D_REENTRANT -DHAVE_CONFIG_H -Wall -Wextra -Wno-sign-compare -Wstrict-prototypes -Wmissing-declarations -Wwrite-strings -fno-strict-aliasing -Wno-unused-result -DHAVE_SYMVER_ATTRIBUTE -march=btver2 -mtune=btver2 -O2 -fPIC -pthread -DFUSE_USE_VERSION=35 '-DFUSERMOUNT_DIR="/usr/bin"' -MD -MQ lib/libfuse3.so.3.10.3.p/fuse.c.o -MF lib/libfuse3.so.3.10.3.p/fuse.c.o.d -o lib/libfuse3.so.3.10.3.p/fuse.c.o -c ../fuse-3.10.3/lib/fuse.c
../fuse-3.10.3/lib/fuse.c:4579:1: warning: ‘symver’ attribute directive ignored [-Wattributes]
../fuse-3.10.3/lib/fuse.c:4595:1: warning: ‘symver’ attribute directive ignored [-Wattributes]
../fuse-3.10.3/lib/fuse.c:4882:1: warning: ‘symver’ attribute directive ignored [-Wattributes]
../fuse-3.10.3/lib/fuse.c:5036:1: warning: ‘symver’ attribute directive ignored [-Wattributes]
[18/32] x86_64-pc-linux-gnu-gcc -Ilib/libfuse3.so.3.10.3.p -Ilib -I../fuse-3.10.3/lib -Iinclude -I../fuse-3.10.3/include -I. -I../fuse-3.10.3 -fdiagnostics-color=always -pipe -D_FILE_OFFSET_BITS=64 -Wall -Winvalid-pch -D_REENTRANT -DHAVE_CONFIG_H -Wall -Wextra -Wno-sign-compare -Wstrict-prototypes -Wmissing-declarations -Wwrite-strings -fno-strict-aliasing -Wno-unused-result -DHAVE_SYMVER_ATTRIBUTE -march=btver2 -mtune=btver2 -O2 -fPIC -pthread -DFUSE_USE_VERSION=35 '-DFUSERMOUNT_DIR="/usr/bin"' -MD -MQ lib/libfuse3.so.3.10.3.p/fuse_log.c.o -MF lib/libfuse3.so.3.10.3.p/fuse_log.c.o.d -o lib/libfuse3.so.3.10.3.p/fuse_log.c.o -c ../fuse-3.10.3/lib/fuse_log.c
[19/32] x86_64-pc-linux-gnu-gcc -Ilib/libfuse3.so.3.10.3.p -Ilib -I../fuse-3.10.3/lib -Iinclude -I../fuse-3.10.3/include -I. -I../fuse-3.10.3 -fdiagnostics-color=always -pipe -D_FILE_OFFSET_BITS=64 -Wall -Winvalid-pch -D_REENTRANT -DHAVE_CONFIG_H -Wall -Wextra -Wno-sign-compare -Wstrict-prototypes -Wmissing-declarations -Wwrite-strings -fno-strict-aliasing -Wno-unused-result -DHAVE_SYMVER_ATTRIBUTE -march=btver2 -mtune=btver2 -O2 -fPIC -pthread -DFUSE_USE_VERSION=35 '-DFUSERMOUNT_DIR="/usr/bin"' -MD -MQ lib/libfuse3.so.3.10.3.p/helper.c.o -MF lib/libfuse3.so.3.10.3.p/helper.c.o.d -o lib/libfuse3.so.3.10.3.p/helper.c.o -c ../fuse-3.10.3/lib/helper.c
[20/32] x86_64-pc-linux-gnu-gcc -Ilib/libfuse3.so.3.10.3.p -Ilib -I../fuse-3.10.3/lib -Iinclude -I../fuse-3.10.3/include -I. -I../fuse-3.10.3 -fdiagnostics-color=always -pipe -D_FILE_OFFSET_BITS=64 -Wall -Winvalid-pch -D_REENTRANT -DHAVE_CONFIG_H -Wall -Wextra -Wno-sign-compare -Wstrict-prototypes -Wmissing-declarations -Wwrite-strings -fno-strict-aliasing -Wno-unused-result -DHAVE_SYMVER_ATTRIBUTE -march=btver2 -mtune=btver2 -O2 -fPIC -pthread -DFUSE_USE_VERSION=35 '-DFUSERMOUNT_DIR="/usr/bin"' -MD -MQ lib/libfuse3.so.3.10.3.p/mount_util.c.o -MF lib/libfuse3.so.3.10.3.p/mount_util.c.o.d -o lib/libfuse3.so.3.10.3.p/mount_util.c.o -c ../fuse-3.10.3/lib/mount_util.c
[21/32] x86_64-pc-linux-gnu-gcc -Ilib/libfuse3.so.3.10.3.p -Ilib -I../fuse-3.10.3/lib -Iinclude -I../fuse-3.10.3/include -I. -I../fuse-3.10.3 -fdiagnostics-color=always -pipe -D_FILE_OFFSET_BITS=64 -Wall -Winvalid-pch -D_REENTRANT -DHAVE_CONFIG_H -Wall -Wextra -Wno-sign-compare -Wstrict-prototypes -Wmissing-declarations -Wwrite-strings -fno-strict-aliasing -Wno-unused-result -DHAVE_SYMVER_ATTRIBUTE -march=btver2 -mtune=btver2 -O2 -fPIC -pthread -DFUSE_USE_VERSION=35 '-DFUSERMOUNT_DIR="/usr/bin"' -MD -MQ lib/libfuse3.so.3.10.3.p/mount.c.o -MF lib/libfuse3.so.3.10.3.p/mount.c.o.d -o lib/libfuse3.so.3.10.3.p/mount.c.o -c ../fuse-3.10.3/lib/mount.c
../fuse-3.10.3/lib/mount.c: In function ‘fuse_mount_opt_proc’:
../fuse-3.10.3/lib/mount.c:190:7: warning: this statement may fall through [-Wimplicit-fallthrough=]
../fuse-3.10.3/lib/mount.c:192:2: note: here
[22/32] x86_64-pc-linux-gnu-gcc -Ilib/libfuse3.so.3.10.3.p -Ilib -I../fuse-3.10.3/lib -Iinclude -I../fuse-3.10.3/include -I. -I../fuse-3.10.3 -fdiagnostics-color=always -pipe -D_FILE_OFFSET_BITS=64 -Wall -Winvalid-pch -D_REENTRANT -DHAVE_CONFIG_H -Wall -Wextra -Wno-sign-compare -Wstrict-prototypes -Wmissing-declarations -Wwrite-strings -fno-strict-aliasing -Wno-unused-result -DHAVE_SYMVER_ATTRIBUTE -march=btver2 -mtune=btver2 -O2 -fPIC -pthread -DFUSE_USE_VERSION=35 '-DFUSERMOUNT_DIR="/usr/bin"' -MD -MQ lib/libfuse3.so.3.10.3.p/modules_subdir.c.o -MF lib/libfuse3.so.3.10.3.p/modules_subdir.c.o.d -o lib/libfuse3.so.3.10.3.p/modules_subdir.c.o -c ../fuse-3.10.3/lib/modules/subdir.c
[23/32] x86_64-pc-linux-gnu-gcc -Itest/test_write_cache.p -Itest -I../fuse-3.10.3/test -Iinclude -I../fuse-3.10.3/include -Ilib -I../fuse-3.10.3/lib -I. -I../fuse-3.10.3 -fdiagnostics-color=always -pipe -D_FILE_OFFSET_BITS=64 -Wall -Winvalid-pch -D_REENTRANT -DHAVE_CONFIG_H -Wall -Wextra -Wno-sign-compare -Wstrict-prototypes -Wmissing-declarations -Wwrite-strings -fno-strict-aliasing -Wno-unused-result -DHAVE_SYMVER_ATTRIBUTE -march=btver2 -mtune=btver2 -O2 -pthread -MD -MQ test/test_write_cache.p/test_write_cache.c.o -MF test/test_write_cache.p/test_write_cache.c.o.d -o test/test_write_cache.p/test_write_cache.c.o -c ../fuse-3.10.3/test/test_write_cache.c
[24/32] x86_64-pc-linux-gnu-gcc -Itest/test_setattr.p -Itest -I../fuse-3.10.3/test -Iinclude -I../fuse-3.10.3/include -Ilib -I../fuse-3.10.3/lib -I. -I../fuse-3.10.3 -fdiagnostics-color=always -pipe -D_FILE_OFFSET_BITS=64 -Wall -Winvalid-pch -D_REENTRANT -DHAVE_CONFIG_H -Wall -Wextra -Wno-sign-compare -Wstrict-prototypes -Wmissing-declarations -Wwrite-strings -fno-strict-aliasing -Wno-unused-result -DHAVE_SYMVER_ATTRIBUTE -march=btver2 -mtune=btver2 -O2 -pthread -MD -MQ test/test_setattr.p/test_setattr.c.o -MF test/test_setattr.p/test_setattr.c.o.d -o test/test_setattr.p/test_setattr.c.o -c ../fuse-3.10.3/test/test_setattr.c
[25/32] x86_64-pc-linux-gnu-gcc -Ilib/libfuse3.so.3.10.3.p -Ilib -I../fuse-3.10.3/lib -Iinclude -I../fuse-3.10.3/include -I. -I../fuse-3.10.3 -fdiagnostics-color=always -pipe -D_FILE_OFFSET_BITS=64 -Wall -Winvalid-pch -D_REENTRANT -DHAVE_CONFIG_H -Wall -Wextra -Wno-sign-compare -Wstrict-prototypes -Wmissing-declarations -Wwrite-strings -fno-strict-aliasing -Wno-unused-result -DHAVE_SYMVER_ATTRIBUTE -march=btver2 -mtune=btver2 -O2 -fPIC -pthread -DFUSE_USE_VERSION=35 '-DFUSERMOUNT_DIR="/usr/bin"' -MD -MQ lib/libfuse3.so.3.10.3.p/modules_iconv.c.o -MF lib/libfuse3.so.3.10.3.p/modules_iconv.c.o.d -o lib/libfuse3.so.3.10.3.p/modules_iconv.c.o -c ../fuse-3.10.3/lib/modules/iconv.c
[26/32] x86_64-pc-linux-gnu-gcc  -o lib/libfuse3.so.3.10.3 lib/libfuse3.so.3.10.3.p/fuse.c.o lib/libfuse3.so.3.10.3.p/fuse_loop.c.o lib/libfuse3.so.3.10.3.p/fuse_loop_mt.c.o lib/libfuse3.so.3.10.3.p/fuse_lowlevel.c.o lib/libfuse3.so.3.10.3.p/fuse_opt.c.o lib/libfuse3.so.3.10.3.p/fuse_signals.c.o lib/libfuse3.so.3.10.3.p/buffer.c.o lib/libfuse3.so.3.10.3.p/cuse_lowlevel.c.o lib/libfuse3.so.3.10.3.p/helper.c.o lib/libfuse3.so.3.10.3.p/modules_subdir.c.o lib/libfuse3.so.3.10.3.p/mount_util.c.o lib/libfuse3.so.3.10.3.p/fuse_log.c.o lib/libfuse3.so.3.10.3.p/mount.c.o lib/libfuse3.so.3.10.3.p/modules_iconv.c.o -Wl,--as-needed -Wl,--no-undefined -shared -fPIC -Wl,--start-group -Wl,-soname,libfuse3.so.3 -march=btver2 -mtune=btver2 -O2 -pipe -Wl,-O1 -Wl,--as-needed -Wl,--version-script,/var/tmp/portage/sys-fs/fuse-3.10.3/work/fuse-3.10.3/lib/fuse_versionscript -pthread -ldl -lrt -Wl,--end-group
[27/32] x86_64-pc-linux-gnu-gcc -Itest/test_syscalls.p -Itest -I../fuse-3.10.3/test -Iinclude -I../fuse-3.10.3/include -Ilib -I../fuse-3.10.3/lib -I. -I../fuse-3.10.3 -fdiagnostics-color=always -pipe -D_FILE_OFFSET_BITS=64 -Wall -Winvalid-pch -D_REENTRANT -DHAVE_CONFIG_H -Wall -Wextra -Wno-sign-compare -Wstrict-prototypes -Wmissing-declarations -Wwrite-strings -fno-strict-aliasing -Wno-unused-result -DHAVE_SYMVER_ATTRIBUTE -march=btver2 -mtune=btver2 -O2 -MD -MQ test/test_syscalls.p/test_syscalls.c.o -MF test/test_syscalls.p/test_syscalls.c.o.d -o test/test_syscalls.p/test_syscalls.c.o -c ../fuse-3.10.3/test/test_syscalls.c
[28/32] x86_64-pc-linux-gnu-gcc  -o test/test_syscalls test/test_syscalls.p/test_syscalls.c.o -Wl,--as-needed -Wl,--no-undefined -march=btver2 -mtune=btver2 -O2 -pipe -Wl,-O1 -Wl,--as-needed
[29/32] /usr/lib/python-exec/python3.9/meson --internal symbolextractor /var/tmp/portage/sys-fs/fuse-3.10.3/work/fuse-3.10.3-abi_x86_64.amd64 lib/libfuse3.so.3.10.3 lib/libfuse3.so.3.10.3 lib/libfuse3.so.3.10.3.p/libfuse3.so.3.10.3.symbols
[30/32] x86_64-pc-linux-gnu-gcc  -o util/mount.fuse3 util/mount.fuse3.p/mount.fuse.c.o -Wl,--as-needed -Wl,--no-undefined -march=btver2 -mtune=btver2 -O2 -pipe -Wl,-O1 -Wl,--as-needed '-Wl,-rpath,$ORIGIN/../lib' -Wl,-rpath-link,/var/tmp/portage/sys-fs/fuse-3.10.3/work/fuse-3.10.3-abi_x86_64.amd64/lib -Wl,--start-group lib/libfuse3.so.3.10.3 -Wl,--end-group
[31/32] x86_64-pc-linux-gnu-gcc  -o test/test_setattr test/test_setattr.p/test_setattr.c.o -Wl,--as-needed -Wl,--no-undefined -march=btver2 -mtune=btver2 -O2 -pipe -Wl,-O1 -Wl,--as-needed '-Wl,-rpath,$ORIGIN/../lib' -Wl,-rpath-link,/var/tmp/portage/sys-fs/fuse-3.10.3/work/fuse-3.10.3-abi_x86_64.amd64/lib -Wl,--start-group lib/libfuse3.so.3.10.3 -Wl,--end-group -pthread
[32/32] x86_64-pc-linux-gnu-gcc  -o test/test_write_cache test/test_write_cache.p/test_write_cache.c.o -Wl,--as-needed -Wl,--no-undefined -march=btver2 -mtune=btver2 -O2 -pipe -Wl,-O1 -Wl,--as-needed '-Wl,-rpath,$ORIGIN/../lib' -Wl,-rpath-link,/var/tmp/portage/sys-fs/fuse-3.10.3/work/fuse-3.10.3-abi_x86_64.amd64/lib -Wl,--start-group lib/libfuse3.so.3.10.3 -Wl,--end-group -pthread
>>> Source compiled.
 * Skipping make test/check due to ebuild restriction.
>>> Test phase [disabled because of RESTRICT=test]: sys-fs/fuse-3.10.3

>>> Install sys-fs/fuse-3.10.3 into /var/tmp/portage/sys-fs/fuse-3.10.3/image
 * abi_x86_64.amd64: running multilib-minimal_abi_src_install
ninja -v -j17 -l4 -C /var/tmp/portage/sys-fs/fuse-3.10.3/work/fuse-3.10.3-abi_x86_64.amd64 install
ninja: Entering directory `/var/tmp/portage/sys-fs/fuse-3.10.3/work/fuse-3.10.3-abi_x86_64.amd64'
[0/1] /usr/lib/python-exec/python3.9/meson install --no-rebuild
Installing lib/libfuse3.so.3.10.3 to /var/tmp/portage/sys-fs/fuse-3.10.3/image/usr/lib64
Installing util/fusermount3 to /var/tmp/portage/sys-fs/fuse-3.10.3/image/usr/bin
Installing util/mount.fuse3 to /var/tmp/portage/sys-fs/fuse-3.10.3/image/usr/sbin
Installing /var/tmp/portage/sys-fs/fuse-3.10.3/work/fuse-3.10.3/include/fuse.h to /var/tmp/portage/sys-fs/fuse-3.10.3/image/usr/include/fuse3
Installing /var/tmp/portage/sys-fs/fuse-3.10.3/work/fuse-3.10.3/include/fuse_common.h to /var/tmp/portage/sys-fs/fuse-3.10.3/image/usr/include/fuse3
Installing /var/tmp/portage/sys-fs/fuse-3.10.3/work/fuse-3.10.3/include/fuse_lowlevel.h to /var/tmp/portage/sys-fs/fuse-3.10.3/image/usr/include/fuse3
Installing /var/tmp/portage/sys-fs/fuse-3.10.3/work/fuse-3.10.3/include/fuse_opt.h to /var/tmp/portage/sys-fs/fuse-3.10.3/image/usr/include/fuse3
Installing /var/tmp/portage/sys-fs/fuse-3.10.3/work/fuse-3.10.3/include/cuse_lowlevel.h to /var/tmp/portage/sys-fs/fuse-3.10.3/image/usr/include/fuse3
Installing /var/tmp/portage/sys-fs/fuse-3.10.3/work/fuse-3.10.3/include/fuse_log.h to /var/tmp/portage/sys-fs/fuse-3.10.3/image/usr/include/fuse3
Installing /var/tmp/portage/sys-fs/fuse-3.10.3/work/fuse-3.10.3/doc/fusermount3.1 to /var/tmp/portage/sys-fs/fuse-3.10.3/image/usr/share/man/man1
Installing /var/tmp/portage/sys-fs/fuse-3.10.3/work/fuse-3.10.3/doc/mount.fuse3.8 to /var/tmp/portage/sys-fs/fuse-3.10.3/image/usr/share/man/man8
Installing /var/tmp/portage/sys-fs/fuse-3.10.3/work/fuse-3.10.3-abi_x86_64.amd64/meson-private/fuse3.pc to /var/tmp/portage/sys-fs/fuse-3.10.3/image/usr/lib64/pkgconfig
Running custom install script '/var/tmp/portage/sys-fs/fuse-3.10.3/work/fuse-3.10.3/util/install_helper.sh /etc /usr/bin /lib/udev/rules.d false'
>>> Completed installing sys-fs/fuse-3.10.3 into /var/tmp/portage/sys-fs/fuse-3.10.3/image

 * Final size of build directory: 72168 KiB (70.4 MiB)
 * Final size of installed tree:    620 KiB

strip: x86_64-pc-linux-gnu-strip --strip-unneeded -N __gentoo_check_ldflags__ -R .comment -R .GCC.command.line -R .note.gnu.gold-version
   /usr/sbin/mount.fuse3
   /usr/lib64/libfuse3.so.3.10.3
   /usr/bin/fusermount3

>>> Installing (1 of 1) sys-fs/fuse-3.10.3::gentoo
 * >>> SetUID: [chmod go-r] /usr/bin/fusermount3 ...                                                                                                                                  [ ok ]

>>> Recording sys-fs/fuse in "world" favorites file...
>>> Auto-cleaning packages...

>>> No outdated packages were found on your system.

 * GNU info directory index is up-to-date.


rebuild sys-fs/fuse

and then the same

Code:
emerge net-fs/sshfs
Calculating dependencies... done!

>>> Verifying ebuild manifests

>>> Emerging (1 of 1) net-fs/sshfs-3.7.0::gentoo
 * sshfs-3.7.0.tar.xz BLAKE2B SHA512 size ;-) ...                                                                                                                                     [ ok ]
>>> Unpacking source...
>>> Unpacking sshfs-3.7.0.tar.xz to /var/tmp/portage/net-fs/sshfs-3.7.0/work
>>> Source unpacked in /var/tmp/portage/net-fs/sshfs-3.7.0/work
>>> Preparing source in /var/tmp/portage/net-fs/sshfs-3.7.0/work/sshfs-3.7.0 ...
>>> Source prepared.
>>> Configuring source in /var/tmp/portage/net-fs/sshfs-3.7.0/work/sshfs-3.7.0 ...
meson setup --buildtype plain --libdir lib64 --localstatedir /var/lib --prefix /usr --sysconfdir /etc --wrap-mode nodownload --build.pkg-config-path /usr/share/pkgconfig --pkg-config-path /usr/share/pkgconfig --native-file /var/tmp/portage/net-fs/sshfs-3.7.0/temp/meson.x86_64-pc-linux-gnu.amd64.ini /var/tmp/portage/net-fs/sshfs-3.7.0/work/sshfs-3.7.0 /var/tmp/portage/net-fs/sshfs-3.7.0/work/sshfs-3.7.0-build
The Meson build system
Version: 0.57.2
Source dir: /var/tmp/portage/net-fs/sshfs-3.7.0/work/sshfs-3.7.0
Build dir: /var/tmp/portage/net-fs/sshfs-3.7.0/work/sshfs-3.7.0-build
Build type: native build
Project name: sshfs
Project version: 3.7.0
C compiler for the host machine: x86_64-pc-linux-gnu-gcc (gcc 10.3.0 "x86_64-pc-linux-gnu-gcc (Gentoo 10.3.0-r2 p3) 10.3.0")
C linker for the host machine: x86_64-pc-linux-gnu-gcc ld.bfd 2.35.2
Host machine cpu family: x86_64
Host machine cpu: x86_64
meson.build:8: WARNING: Consider using the built-in warning_level option instead of using "-Wall".
meson.build:8: WARNING: Consider using the built-in warning_level option instead of using "-Wextra".
Message: Compiler warns about unused result even when casting to void
Program rst2man.py found: YES (/usr/bin/rst2man.py)
Configuring config.h using configuration
Found pkg-config: /usr/bin/x86_64-pc-linux-gnu-pkg-config (1.6.3)
Run-time dependency fuse3 found: YES 3.10.3
Run-time dependency glib-2.0 found: YES 2.68.3
Run-time dependency gthread-2.0 found: YES 2.68.3
Program utils/install_helper.sh found: YES (/var/tmp/portage/net-fs/sshfs-3.7.0/work/sshfs-3.7.0/utils/install_helper.sh)
Build targets in project: 4

Option buildtype is: plain [default: debugoptimized]
Found ninja-1.10.1 at /usr/bin/ninja
>>> Source configured.
>>> Compiling source in /var/tmp/portage/net-fs/sshfs-3.7.0/work/sshfs-3.7.0 ...
ninja -v -j17 -l4 -C /var/tmp/portage/net-fs/sshfs-3.7.0/work/sshfs-3.7.0-build
ninja: Entering directory `/var/tmp/portage/net-fs/sshfs-3.7.0/work/sshfs-3.7.0-build'
[1/7] cp -fPp ../sshfs-3.7.0/test/conftest.py ../sshfs-3.7.0/test/pytest.ini ../sshfs-3.7.0/test/test_sshfs.py ../sshfs-3.7.0/test/util.py /var/tmp/portage/net-fs/sshfs-3.7.0/work/sshfs-3.7.0-build/test
[2/7] x86_64-pc-linux-gnu-gcc -Itest/wrong_command.p -Itest -I../sshfs-3.7.0/test -fdiagnostics-color=always -pipe -D_FILE_OFFSET_BITS=64 -Wall -Winvalid-pch -D_REENTRANT -DHAVE_CONFIG_H -Wall -Wextra -Wno-sign-compare -Wmissing-declarations -Wwrite-strings -Wno-unused-result -march=btver2 -mtune=btver2 -O2 -MD -MQ test/wrong_command.p/wrong_command.c.o -MF test/wrong_command.p/wrong_command.c.o.d -o test/wrong_command.p/wrong_command.c.o -c ../sshfs-3.7.0/test/wrong_command.c
[3/7] x86_64-pc-linux-gnu-gcc  -o test/wrong_command test/wrong_command.p/wrong_command.c.o -Wl,--as-needed -Wl,--no-undefined -march=btver2 -mtune=btver2 -O2 -pipe -Wl,-O1 -Wl,--as-needed
[4/7] x86_64-pc-linux-gnu-gcc -Isshfs.p -I. -I../sshfs-3.7.0 -I/usr/include/fuse3 -I/usr/include/glib-2.0 -I/usr/lib64/glib-2.0/include -fdiagnostics-color=always -pipe -D_FILE_OFFSET_BITS=64 -Wall -Winvalid-pch -D_REENTRANT -DHAVE_CONFIG_H -Wall -Wextra -Wno-sign-compare -Wmissing-declarations -Wwrite-strings -Wno-unused-result -march=btver2 -mtune=btver2 -O2 -pthread -DFUSE_USE_VERSION=31 -MD -MQ sshfs.p/cache.c.o -MF sshfs.p/cache.c.o.d -o sshfs.p/cache.c.o -c ../sshfs-3.7.0/cache.c
[5/7] /usr/bin/rst2man.py ../sshfs-3.7.0/sshfs.rst sshfs.1
[6/7] x86_64-pc-linux-gnu-gcc -Isshfs.p -I. -I../sshfs-3.7.0 -I/usr/include/fuse3 -I/usr/include/glib-2.0 -I/usr/lib64/glib-2.0/include -fdiagnostics-color=always -pipe -D_FILE_OFFSET_BITS=64 -Wall -Winvalid-pch -D_REENTRANT -DHAVE_CONFIG_H -Wall -Wextra -Wno-sign-compare -Wmissing-declarations -Wwrite-strings -Wno-unused-result -march=btver2 -mtune=btver2 -O2 -pthread -DFUSE_USE_VERSION=31 -MD -MQ sshfs.p/sshfs.c.o -MF sshfs.p/sshfs.c.o.d -o sshfs.p/sshfs.c.o -c ../sshfs-3.7.0/sshfs.c
[7/7] x86_64-pc-linux-gnu-gcc  -o sshfs sshfs.p/sshfs.c.o sshfs.p/cache.c.o -Wl,--as-needed -Wl,--no-undefined -march=btver2 -mtune=btver2 -O2 -pipe -Wl,-O1 -Wl,--as-needed -Wl,--start-group /usr/lib64/libfuse3.so -lpthread /usr/lib64/libglib-2.0.so /usr/lib64/libgthread-2.0.so -Wl,--end-group -pthread
FAILED: sshfs
x86_64-pc-linux-gnu-gcc  -o sshfs sshfs.p/sshfs.c.o sshfs.p/cache.c.o -Wl,--as-needed -Wl,--no-undefined -march=btver2 -mtune=btver2 -O2 -pipe -Wl,-O1 -Wl,--as-needed -Wl,--start-group /usr/lib64/libfuse3.so -lpthread /usr/lib64/libglib-2.0.so /usr/lib64/libgthread-2.0.so -Wl,--end-group -pthread
/usr/lib/gcc/x86_64-pc-linux-gnu/10.3.0/../../../../x86_64-pc-linux-gnu/bin/ld: sshfs.p/sshfs.c.o: in function `main':
sshfs.c:(.text.startup+0x624): undefined reference to `fuse_new'
collect2: error: ld returned 1 exit status
distcc[53] ERROR: compile (null) on localhost failed
ninja: build stopped: subcommand failed.
 * ERROR: net-fs/sshfs-3.7.0::gentoo failed (compile phase):
 *   ninja -v -j17 -l4 -C /var/tmp/portage/net-fs/sshfs-3.7.0/work/sshfs-3.7.0-build failed
 *
 * Call stack:
 *     ebuild.sh, line  127:  Called src_compile
 *   environment, line 2145:  Called meson_src_compile
 *   environment, line 1506:  Called eninja '-C' '/var/tmp/portage/net-fs/sshfs-3.7.0/work/sshfs-3.7.0-build'
 *   environment, line 1075:  Called die
 * The specific snippet of code:
 *       "$@" || die "${nonfatal_args[@]}" "${*} failed"
 *
 * If you need support, post the output of `emerge --info '=net-fs/sshfs-3.7.0::gentoo'`,
 * the complete build log and the output of `emerge -pqv '=net-fs/sshfs-3.7.0::gentoo'`.
 * The complete build log is located at '/var/tmp/portage/net-fs/sshfs-3.7.0/temp/build.log'.
 * The ebuild environment file is located at '/var/tmp/portage/net-fs/sshfs-3.7.0/temp/environment'.
 * Working directory: '/var/tmp/portage/net-fs/sshfs-3.7.0/work/sshfs-3.7.0'
 * S: '/var/tmp/portage/net-fs/sshfs-3.7.0/work/sshfs-3.7.0'

>>> Failed to emerge net-fs/sshfs-3.7.0, Log file:

>>>  '/var/tmp/portage/net-fs/sshfs-3.7.0/temp/build.log'

 * Messages for package net-fs/sshfs-3.7.0:

 * ERROR: net-fs/sshfs-3.7.0::gentoo failed (compile phase):
 *   ninja -v -j17 -l4 -C /var/tmp/portage/net-fs/sshfs-3.7.0/work/sshfs-3.7.0-build failed
 *
 * Call stack:
 *     ebuild.sh, line  127:  Called src_compile
 *   environment, line 2145:  Called meson_src_compile
 *   environment, line 1506:  Called eninja '-C' '/var/tmp/portage/net-fs/sshfs-3.7.0/work/sshfs-3.7.0-build'
 *   environment, line 1075:  Called die
 * The specific snippet of code:
 *       "$@" || die "${nonfatal_args[@]}" "${*} failed"
 *
 * If you need support, post the output of `emerge --info '=net-fs/sshfs-3.7.0::gentoo'`,
 * the complete build log and the output of `emerge -pqv '=net-fs/sshfs-3.7.0::gentoo'`.
 * The complete build log is located at '/var/tmp/portage/net-fs/sshfs-3.7.0/temp/build.log'.
 * The ebuild environment file is located at '/var/tmp/portage/net-fs/sshfs-3.7.0/temp/environment'.
 * Working directory: '/var/tmp/portage/net-fs/sshfs-3.7.0/work/sshfs-3.7.0'
 * S: '/var/tmp/portage/net-fs/sshfs-3.7.0/work/sshfs-3.7.0'
Back to top
View user's profile Send private message
Jaglover
Watchman
Watchman


Joined: 29 May 2005
Posts: 8033
Location: Saint Amant, Acadiana

PostPosted: Thu Jul 22, 2021 5:06 am    Post subject: Reply with quote

Try with distcc disabled, you can do it from command line
Code:
FEATURES=-distcc emerge -1 sshfs

_________________
My Gentoo installation notes.
Please learn how to denote units correctly!
Back to top
View user's profile Send private message
dmpogo
Advocate
Advocate


Joined: 02 Sep 2004
Posts: 3048
Location: Canada

PostPosted: Thu Jul 22, 2021 7:59 am    Post subject: Reply with quote

Is your sys-fs/fuse updated to version > 3.1 ?
Back to top
View user's profile Send private message
denn0n
n00b
n00b


Joined: 24 May 2020
Posts: 33

PostPosted: Thu Jul 22, 2021 5:02 pm    Post subject: Reply with quote

Jaglover wrote:
Try with distcc disabled, you can do it from command line
Code:
FEATURES=-distcc emerge -1 sshfs

not it didn't work i disable it from
Code:
/etc/portage/make.conf
and this was the result

Code:
emerge -1 sshfs
Calculating dependencies... done!

>>> Verifying ebuild manifests

>>> Emerging (1 of 1) net-fs/sshfs-3.7.0::gentoo
 * sshfs-3.7.0.tar.xz BLAKE2B SHA512 size ;-) ...                                                                                                                                     [ ok ]
>>> Unpacking source...
>>> Unpacking sshfs-3.7.0.tar.xz to /var/tmp/portage/net-fs/sshfs-3.7.0/work
>>> Source unpacked in /var/tmp/portage/net-fs/sshfs-3.7.0/work
>>> Preparing source in /var/tmp/portage/net-fs/sshfs-3.7.0/work/sshfs-3.7.0 ...
>>> Source prepared.
>>> Configuring source in /var/tmp/portage/net-fs/sshfs-3.7.0/work/sshfs-3.7.0 ...
meson setup --buildtype plain --libdir lib64 --localstatedir /var/lib --prefix /usr --sysconfdir /etc --wrap-mode nodownload --build.pkg-config-path /usr/share/pkgconfig --pkg-config-path /usr/share/pkgconfig --native-file /var/tmp/portage/net-fs/sshfs-3.7.0/temp/meson.x86_64-pc-linux-gnu.amd64.ini /var/tmp/portage/net-fs/sshfs-3.7.0/work/sshfs-3.7.0 /var/tmp/portage/net-fs/sshfs-3.7.0/work/sshfs-3.7.0-build
The Meson build system
Version: 0.57.2
Source dir: /var/tmp/portage/net-fs/sshfs-3.7.0/work/sshfs-3.7.0
Build dir: /var/tmp/portage/net-fs/sshfs-3.7.0/work/sshfs-3.7.0-build
Build type: native build
Project name: sshfs
Project version: 3.7.0
C compiler for the host machine: x86_64-pc-linux-gnu-gcc (gcc 10.3.0 "x86_64-pc-linux-gnu-gcc (Gentoo 10.3.0-r2 p3) 10.3.0")
C linker for the host machine: x86_64-pc-linux-gnu-gcc ld.bfd 2.35.2
Host machine cpu family: x86_64
Host machine cpu: x86_64
meson.build:8: WARNING: Consider using the built-in warning_level option instead of using "-Wall".
meson.build:8: WARNING: Consider using the built-in warning_level option instead of using "-Wextra".
Message: Compiler warns about unused result even when casting to void
Program rst2man.py found: YES (/usr/bin/rst2man.py)
Configuring config.h using configuration
Found pkg-config: /usr/bin/x86_64-pc-linux-gnu-pkg-config (1.6.3)
Run-time dependency fuse3 found: YES 3.10.3
Run-time dependency glib-2.0 found: YES 2.68.3
Run-time dependency gthread-2.0 found: YES 2.68.3
Program utils/install_helper.sh found: YES (/var/tmp/portage/net-fs/sshfs-3.7.0/work/sshfs-3.7.0/utils/install_helper.sh)
Build targets in project: 4

Option buildtype is: plain [default: debugoptimized]
Found ninja-1.10.1 at /usr/bin/ninja
>>> Source configured.
>>> Compiling source in /var/tmp/portage/net-fs/sshfs-3.7.0/work/sshfs-3.7.0 ...
ninja -v -j4 -l0 -C /var/tmp/portage/net-fs/sshfs-3.7.0/work/sshfs-3.7.0-build
ninja: Entering directory `/var/tmp/portage/net-fs/sshfs-3.7.0/work/sshfs-3.7.0-build'
[1/7] cp -fPp ../sshfs-3.7.0/test/conftest.py ../sshfs-3.7.0/test/pytest.ini ../sshfs-3.7.0/test/test_sshfs.py ../sshfs-3.7.0/test/util.py /var/tmp/portage/net-fs/sshfs-3.7.0/work/sshfs-3.7.0-build/test
[2/7] x86_64-pc-linux-gnu-gcc -Itest/wrong_command.p -Itest -I../sshfs-3.7.0/test -fdiagnostics-color=always -pipe -D_FILE_OFFSET_BITS=64 -Wall -Winvalid-pch -D_REENTRANT -DHAVE_CONFIG_H -Wall -Wextra -Wno-sign-compare -Wmissing-declarations -Wwrite-strings -Wno-unused-result -march=btver2 -mtune=btver2 -O2 -MD -MQ test/wrong_command.p/wrong_command.c.o -MF test/wrong_command.p/wrong_command.c.o.d -o test/wrong_command.p/wrong_command.c.o -c ../sshfs-3.7.0/test/wrong_command.c
[3/7] x86_64-pc-linux-gnu-gcc  -o test/wrong_command test/wrong_command.p/wrong_command.c.o -Wl,--as-needed -Wl,--no-undefined -march=btver2 -mtune=btver2 -O2 -pipe -Wl,-O1 -Wl,--as-needed
[4/7] /usr/bin/rst2man.py ../sshfs-3.7.0/sshfs.rst sshfs.1
[5/7] x86_64-pc-linux-gnu-gcc -Isshfs.p -I. -I../sshfs-3.7.0 -I/usr/include/fuse3 -I/usr/include/glib-2.0 -I/usr/lib64/glib-2.0/include -fdiagnostics-color=always -pipe -D_FILE_OFFSET_BITS=64 -Wall -Winvalid-pch -D_REENTRANT -DHAVE_CONFIG_H -Wall -Wextra -Wno-sign-compare -Wmissing-declarations -Wwrite-strings -Wno-unused-result -march=btver2 -mtune=btver2 -O2 -pthread -DFUSE_USE_VERSION=31 -MD -MQ sshfs.p/cache.c.o -MF sshfs.p/cache.c.o.d -o sshfs.p/cache.c.o -c ../sshfs-3.7.0/cache.c
[6/7] x86_64-pc-linux-gnu-gcc -Isshfs.p -I. -I../sshfs-3.7.0 -I/usr/include/fuse3 -I/usr/include/glib-2.0 -I/usr/lib64/glib-2.0/include -fdiagnostics-color=always -pipe -D_FILE_OFFSET_BITS=64 -Wall -Winvalid-pch -D_REENTRANT -DHAVE_CONFIG_H -Wall -Wextra -Wno-sign-compare -Wmissing-declarations -Wwrite-strings -Wno-unused-result -march=btver2 -mtune=btver2 -O2 -pthread -DFUSE_USE_VERSION=31 -MD -MQ sshfs.p/sshfs.c.o -MF sshfs.p/sshfs.c.o.d -o sshfs.p/sshfs.c.o -c ../sshfs-3.7.0/sshfs.c
[7/7] x86_64-pc-linux-gnu-gcc  -o sshfs sshfs.p/sshfs.c.o sshfs.p/cache.c.o -Wl,--as-needed -Wl,--no-undefined -march=btver2 -mtune=btver2 -O2 -pipe -Wl,-O1 -Wl,--as-needed -Wl,--start-group /usr/lib64/libfuse3.so -lpthread /usr/lib64/libglib-2.0.so /usr/lib64/libgthread-2.0.so -Wl,--end-group -pthread
FAILED: sshfs
x86_64-pc-linux-gnu-gcc  -o sshfs sshfs.p/sshfs.c.o sshfs.p/cache.c.o -Wl,--as-needed -Wl,--no-undefined -march=btver2 -mtune=btver2 -O2 -pipe -Wl,-O1 -Wl,--as-needed -Wl,--start-group /usr/lib64/libfuse3.so -lpthread /usr/lib64/libglib-2.0.so /usr/lib64/libgthread-2.0.so -Wl,--end-group -pthread
/usr/lib/gcc/x86_64-pc-linux-gnu/10.3.0/../../../../x86_64-pc-linux-gnu/bin/ld: sshfs.p/sshfs.c.o: in function `main':
sshfs.c:(.text.startup+0x624): undefined reference to `fuse_new'
collect2: error: ld returned 1 exit status
ninja: build stopped: subcommand failed.
 * ERROR: net-fs/sshfs-3.7.0::gentoo failed (compile phase):
 *   ninja -v -j4 -l0 -C /var/tmp/portage/net-fs/sshfs-3.7.0/work/sshfs-3.7.0-build failed
 *
 * Call stack:
 *     ebuild.sh, line  127:  Called src_compile
 *   environment, line 2145:  Called meson_src_compile
 *   environment, line 1506:  Called eninja '-C' '/var/tmp/portage/net-fs/sshfs-3.7.0/work/sshfs-3.7.0-build'
 *   environment, line 1075:  Called die
 * The specific snippet of code:
 *       "$@" || die "${nonfatal_args[@]}" "${*} failed"
 *
 * If you need support, post the output of `emerge --info '=net-fs/sshfs-3.7.0::gentoo'`,
 * the complete build log and the output of `emerge -pqv '=net-fs/sshfs-3.7.0::gentoo'`.
 * The complete build log is located at '/var/tmp/portage/net-fs/sshfs-3.7.0/temp/build.log'.
 * The ebuild environment file is located at '/var/tmp/portage/net-fs/sshfs-3.7.0/temp/environment'.
 * Working directory: '/var/tmp/portage/net-fs/sshfs-3.7.0/work/sshfs-3.7.0'
 * S: '/var/tmp/portage/net-fs/sshfs-3.7.0/work/sshfs-3.7.0'

>>> Failed to emerge net-fs/sshfs-3.7.0, Log file:

>>>  '/var/tmp/portage/net-fs/sshfs-3.7.0/temp/build.log'

 * Messages for package net-fs/sshfs-3.7.0:

 * ERROR: net-fs/sshfs-3.7.0::gentoo failed (compile phase):
 *   ninja -v -j4 -l0 -C /var/tmp/portage/net-fs/sshfs-3.7.0/work/sshfs-3.7.0-build failed
 *
 * Call stack:
 *     ebuild.sh, line  127:  Called src_compile
 *   environment, line 2145:  Called meson_src_compile
 *   environment, line 1506:  Called eninja '-C' '/var/tmp/portage/net-fs/sshfs-3.7.0/work/sshfs-3.7.0-build'
 *   environment, line 1075:  Called die
 * The specific snippet of code:
 *       "$@" || die "${nonfatal_args[@]}" "${*} failed"
 *
 * If you need support, post the output of `emerge --info '=net-fs/sshfs-3.7.0::gentoo'`,
 * the complete build log and the output of `emerge -pqv '=net-fs/sshfs-3.7.0::gentoo'`.
 * The complete build log is located at '/var/tmp/portage/net-fs/sshfs-3.7.0/temp/build.log'.
 * The ebuild environment file is located at '/var/tmp/portage/net-fs/sshfs-3.7.0/temp/environment'.
 * Working directory: '/var/tmp/portage/net-fs/sshfs-3.7.0/work/sshfs-3.7.0'
 * S: '/var/tmp/portage/net-fs/sshfs-3.7.0/work/sshfs-3.7.0'


and

Code:
emerge --info '=net-fs/sshfs-3.7.0::gentoo'
Portage 3.0.20 (python 3.9.5-final-0, default/linux/amd64/17.1/desktop/plasma, gcc-10.3.0, glibc-2.33-r1, 5.10.27-gentoo-x86_64 x86_64)
=================================================================
                         System Settings
=================================================================
System uname: Linux-5.10.27-gentoo-x86_64-x86_64-AMD_A8-7410_APU_with_AMD_Radeon_R5_Graphics-with-glibc2.33
KiB Mem:     7047104 total,   6360756 free
KiB Swap:    8388604 total,   8388604 free
Timestamp of repository gentoo: Sun, 18 Jul 2021 04:30:01 +0000
Head commit of repository gentoo: 505fd180e97562c9b68495ad0a6bd24d44e233cf
sh bash 5.1_p8
ld GNU ld (Gentoo 2.35.2 p1) 2.35.2
distcc 3.4 x86_64-pc-linux-gnu [disabled]
app-shells/bash:          5.1_p8::gentoo
dev-lang/perl:            5.32.1::gentoo
dev-lang/python:          2.7.18_p11::gentoo, 3.9.5_p2::gentoo
dev-lang/rust:            1.52.1::gentoo
dev-util/cmake:           3.18.5::gentoo
sys-apps/baselayout:      2.7::gentoo
sys-apps/openrc:          0.42.1-r1::gentoo
sys-apps/sandbox:         2.24::gentoo
sys-devel/autoconf:       2.13-r1::gentoo, 2.69-r5::gentoo
sys-devel/automake:       1.16.3-r1::gentoo
sys-devel/binutils:       2.35.2::gentoo
sys-devel/gcc:            10.3.0-r2::gentoo
sys-devel/gcc-config:     2.4::gentoo
sys-devel/libtool:        2.4.6-r6::gentoo
sys-devel/make:           4.3::gentoo
sys-kernel/linux-headers: 5.10::gentoo (virtual/os-headers)
sys-libs/glibc:           2.33-r1::gentoo
Repositories:

gentoo
    location: /var/db/repos/gentoo
    sync-type: rsync
    sync-uri: rsync://rsync.gentoo.org/gentoo-portage
    priority: -1000
    sync-rsync-verify-max-age: 24
    sync-rsync-verify-metamanifest: yes
    sync-rsync-verify-jobs: 1
    sync-rsync-extra-opts:

ACCEPT_KEYWORDS="amd64"
ACCEPT_LICENSE="@FREE"
CBUILD="x86_64-pc-linux-gnu"
CFLAGS="-march=btver2 -mtune=btver2 -O2 -pipe"
CHOST="x86_64-pc-linux-gnu"
CONFIG_PROTECT="/etc /usr/share/config /usr/share/gnupg/qualified.txt"
CONFIG_PROTECT_MASK="/etc/ca-certificates.conf /etc/dconf /etc/env.d /etc/fonts/fonts.conf /etc/gconf /etc/gentoo-release /etc/sandbox.d /etc/terminfo"
CXXFLAGS="-march=btver2 -mtune=btver2 -O2 -pipe"
DISTDIR="/var/cache/distfiles"
ENV_UNSET="CARGO_HOME DBUS_SESSION_BUS_ADDRESS DISPLAY GOBIN GOPATH PERL5LIB PERL5OPT PERLPREFIX PERL_CORE PERL_MB_OPT PERL_MM_OPT XAUTHORITY XDG_CACHE_HOME XDG_CONFIG_HOME XDG_DATA_HOME XDG_RUNTIME_DIR"
FCFLAGS="-march=btver2 -mtune=btver2 -O2 -pipe"
FEATURES="assume-digests binpkg-docompress binpkg-dostrip binpkg-logs config-protect-if-modified distlocks ebuild-locks fixlafiles ipc-sandbox merge-sync multilib-strict network-sandbox news parallel-fetch pid-sandbox preserve-libs protect-owned qa-unresolved-soname-deps sandbox sfperms strict unknown-features-warn unmerge-logs unmerge-orphans userfetch userpriv usersandbox usersync xattr"
FFLAGS="-march=btver2 -mtune=btver2 -O2 -pipe"
GENTOO_MIRRORS="http://gentoo.mirrors.tera-byte.com/"
LANG="C.UTF8"
LDFLAGS="-Wl,-O1 -Wl,--as-needed"
MAKEOPTS="-j4"
PKGDIR="/var/cache/binpkgs"
PORTAGE_CONFIGROOT="/"
PORTAGE_RSYNC_OPTS="--recursive --links --safe-links --perms --times --omit-dir-times --compress --force --whole-file --delete --stats --human-readable --timeout=180 --exclude=/distfiles --exclude=/local --exclude=/packages --exclude=/.git"
PORTAGE_TMPDIR="/var/tmp"
USE="X a52 aac acl acpi activities alsa amd64 bluetooth branding bzip2 cairo cdda cdr cli crypt cups dbus declarative dri dts dvd dvdr elogind emboss encode exif flac fortran gdbm gif gpm gtk gui iconv icu ipv6 jpeg kde kipi kwallet lcms libglvnd libnotify libtirpc mad mng mp3 mp4 mpeg multilib ncurses nls nptl ogg opengl openmp pam pango pcre pdf phonon plasma png policykit ppds qml qt5 readline sdl seccomp semantic-desktop spell split-usr ssl startup-notification svg tcpd tiff truetype udev udisks unicode upower usb vorbis widgets wxwidgets x264 xattr xcb xml xv xvid zlib" ABI_X86="64" ADA_TARGET="gnat_2018" ALSA_CARDS="ali5451 als4000 atiixp atiixp-modem bt87x ca0106 cmipci emu10k1x ens1370 ens1371 es1938 es1968 fm801 hda-intel intel8x0 intel8x0m maestro3 trident usb-audio via82xx via82xx-modem ymfpci" APACHE2_MODULES="authn_core authz_core socache_shmcb unixd actions alias auth_basic authn_alias authn_anon authn_dbm authn_default authn_file authz_dbm authz_default authz_groupfile authz_host authz_owner authz_user autoindex cache cgi cgid dav dav_fs dav_lock deflate dir disk_cache env expires ext_filter file_cache filter headers include info log_config logio mem_cache mime mime_magic negotiation rewrite setenvif speling status unique_id userdir usertrack vhost_alias" CALLIGRA_FEATURES="karbon sheets words" COLLECTD_PLUGINS="df interface irq load memory rrdtool swap syslog" CPU_FLAGS_X86="mmx mmxext sse sse2" ELIBC="glibc" GPSD_PROTOCOLS="ashtech aivdm earthmate evermore fv18 garmin garmintxt gpsclock greis isync itrax mtk3301 nmea ntrip navcom oceanserver oldstyle oncore rtcm104v2 rtcm104v3 sirf skytraq superstar2 timing tsip tripmate tnt ublox ubx" INPUT_DEVICES="libinput" KERNEL="linux" LCD_DEVICES="bayrad cfontz cfontz633 glk hd44780 lb216 lcdm001 mtxorb ncurses text" LIBREOFFICE_EXTENSIONS="presenter-console presenter-minimizer" LUA_SINGLE_TARGET="lua5-1" LUA_TARGETS="lua5-1" OFFICE_IMPLEMENTATION="libreoffice" PHP_TARGETS="php7-3 php7-4" POSTGRES_TARGETS="postgres10 postgres11" PYTHON_SINGLE_TARGET="python3_9" PYTHON_TARGETS="python3_9" RUBY_TARGETS="ruby26" USERLAND="GNU" VIDEO_CARDS="radeon r300" XTABLES_ADDONS="quota2 psd pknock lscan length2 ipv4options ipset ipp2p iface geoip fuzzy condition tee tarpit sysrq proto steal rawnat logmark ipmark dhcpmac delude chaos account"
Unset:  CC, CPPFLAGS, CTARGET, CXX, EMERGE_DEFAULT_OPTS, INSTALL_MASK, LC_ALL, LINGUAS, PORTAGE_BINHOST, PORTAGE_BUNZIP2_COMMAND, PORTAGE_COMPRESS, PORTAGE_COMPRESS_FLAGS, PORTAGE_RSYNC_EXTRA_OPTS, RUSTFLAGS
Back to top
View user's profile Send private message
denn0n
n00b
n00b


Joined: 24 May 2020
Posts: 33

PostPosted: Thu Jul 22, 2021 5:04 pm    Post subject: Reply with quote

dmpogo wrote:
Is your sys-fs/fuse updated to version > 3.1 ?


this is the version installed

Code:
emerge --search sys-fs/fuse
 
[ Results for search key : sys-fs/fuse ]
Searching...

*  sys-fs/fuse
      Latest version available: 3.10.3
      Latest version installed: 3.10.3
      Size of files: 2499 KiB
      Homepage:      https://github.com/libfuse/libfuse
      Description:   An interface for filesystems implemented in userspace
      License:       GPL-2 LGPL-2.1

*  sys-fs/fuse-common
      Latest version available: 3.10.1
      Latest version installed: 3.10.1
      Size of files: 1855 KiB
      Homepage:      https://github.com/libfuse/libfuse
      Description:   Common files for multiple slots of sys-fs/fuse
      License:       GPL-2 LGPL-2.1

*  sys-fs/fuse-convmvfs [ Masked ]
      Latest version available: 0.2.6-r1
      Latest version installed: [ Not Installed ]
      Size of files: 93 KiB
      Homepage:      http://fuse-convmvfs.sourceforge.net/
      Description:   FUSE file system to convert filename charset
      License:       GPL-2

*  sys-fs/fuse-exfat
      Latest version available: 1.3.0
      Latest version installed: [ Not Installed ]
      Size of files: 158 KiB
      Homepage:      https://github.com/relan/exfat
      Description:   exFAT filesystem FUSE module
      License:       GPL-2+

*  sys-fs/fuse-overlayfs [ Masked ]
      Latest version available: 1.5.0
      Latest version installed: [ Not Installed ]
      Size of files: 101 KiB
      Homepage:      https://github.com/containers/fuse-overlayfs
      Description:   FUSE implementation for overlayfs
      License:       GPL-3

*  sys-fs/fuse-zip [ Masked ]
      Latest version available: 0.7.0
      Latest version installed: [ Not Installed ]
      Size of files: 697 KiB
      Homepage:      https://bitbucket.org/agalanin/fuse-zip
      Description:   FUSE file system to navigate, extract, create and modify ZIP archives
      License:       GPL-3

*  sys-fs/fuseiso
      Latest version available: 20070708-r3
      Latest version installed: [ Not Installed ]
      Size of files: 235 KiB
      Homepage:      https://sourceforge.net/projects/fuseiso
      Description:   Fuse module to mount ISO9660
      License:       GPL-2

[ Applications found : 7 ]
Back to top
View user's profile Send private message
Jaglover
Watchman
Watchman


Joined: 29 May 2005
Posts: 8033
Location: Saint Amant, Acadiana

PostPosted: Thu Jul 22, 2021 6:28 pm    Post subject: Reply with quote

Is there anything in your /usr/local/* which could interfere?
_________________
My Gentoo installation notes.
Please learn how to denote units correctly!
Back to top
View user's profile Send private message
denn0n
n00b
n00b


Joined: 24 May 2020
Posts: 33

PostPosted: Thu Jul 22, 2021 8:59 pm    Post subject: Reply with quote

Jaglover wrote:
Is there anything in your /usr/local/* which could interfere?


I'm not sure

Code:
ls -la  /usr/local/
total 0
drwxr-xr-x  6 root root  53 Jul 11 17:31 .
drwxr-xr-x 12 root root 158 Jul 11 17:33 ..
drwxr-xr-x  2 root root  19 Jul 11 17:31 bin
drwxr-xr-x  2 root root   6 Jul 11 17:31 lib
drwxr-xr-x  2 root root   6 Jul 11 17:31 lib64
drwxr-xr-x  2 root root  19 Jul 11 17:31 sbin
Back to top
View user's profile Send private message
fedeliallalinea
Administrator
Administrator


Joined: 08 Mar 2003
Posts: 26733
Location: here

PostPosted: Fri Jul 23, 2021 4:32 am    Post subject: Reply with quote

Post find /usr/local/ output
_________________
Questions are guaranteed in life; Answers aren't.
Back to top
View user's profile Send private message
denn0n
n00b
n00b


Joined: 24 May 2020
Posts: 33

PostPosted: Fri Jul 23, 2021 11:26 pm    Post subject: Reply with quote

fedeliallalinea wrote:
Post find /usr/local/ output

here it's

Code:
/usr/local/
/usr/local/bin
/usr/local/bin/.keep
/usr/local/lib
/usr/local/sbin
/usr/local/sbin/.keep
/usr/local/lib64
Back to top
View user's profile Send private message
Display posts from previous:   
Reply to topic    Gentoo Forums Forum Index Portage & Programming All times are GMT
Page 1 of 1

 
Jump to:  
You cannot post new topics in this forum
You cannot reply to topics in this forum
You cannot edit your posts in this forum
You cannot delete your posts in this forum
You cannot vote in polls in this forum