Gentoo Forums
Gentoo Forums
Gentoo Forums
Quick Search: in
FIXED: firefox-60.2.0 fails to build on x86
View unanswered posts
View posts from last 24 hours

 
Reply to topic    Gentoo Forums Forum Index Desktop Environments
View previous topic :: View next topic  
Author Message
Erdie
Veteran
Veteran


Joined: 20 May 2004
Posts: 1987
Location: Heidelberg - Germany

PostPosted: Sun Sep 16, 2018 8:01 am    Post subject: FIXED: firefox-60.2.0 fails to build on x86 Reply with quote

Dear all,

I did not get firefox to build completely on my lenovo T60 running on x86:

Code:

/www-client/firefox-60.2.0/work/firefox-60.2.0/config/expandlibs_gen.py -o libxpcom_base.a.desc nsDebugImpl.o Unified_cpp_xpcom_base0.o Unified_cpp_xpcom_base1.o Unified_cpp_xpcom_base2.o^[(B^[[m
^[7^[8^[[1G^[[K^[[34m31:39.31^[(B^[[m gmake[4]: Leaving directory '/var/tmp/portage/www-client/firefox-60.2.0/work/firefox-60.2.0/ff/xpcom/base'^[(B^[[m
^[7^[8^[[1G^[[K^[[34m31:39.31^[(B^[[m gmake[3]: Leaving directory '/var/tmp/portage/www-client/firefox-60.2.0/work/firefox-60.2.0/ff'^[(B^[[m
^[7^[8^[[1G^[[K^[[34m31:39.32^[(B^[[m gmake[2]: *** [/var/tmp/portage/www-client/firefox-60.2.0/work/firefox-60.2.0/config/recurse.mk:33: compile] Error 2^[(B^[[m
^[7^[8^[[1G^[[K^[[34m31:39.32^[(B^[[m gmake[2]: Leaving directory '/var/tmp/portage/www-client/firefox-60.2.0/work/firefox-60.2.0/ff'^[(B^[[m
^[7^[8^[[1G^[[K^[[34m31:39.32^[(B^[[m gmake[1]: *** [/var/tmp/portage/www-client/firefox-60.2.0/work/firefox-60.2.0/config/rules.mk:434: default] Error 2^[(B^[[m
^[7^[8^[[1G^[[K^[[34m31:39.32^[(B^[[m gmake[1]: Leaving directory '/var/tmp/portage/www-client/firefox-60.2.0/work/firefox-60.2.0/ff'^[(B^[[m
^[7^[8^[[1G^[[K^[[34m31:39.32^[(B^[[m gmake: *** [client.mk:168: build] Error 2^[(B^[[m
^[7^[8^[[1G^[[K^[[34m31:39.33^[(B^[[m 0 compiler warnings present.^[(B^[[m
^[7^[8^[[1G^[[K ^[[31;01m*^[[0m ERROR: www-client/firefox-60.2.0::gentoo failed (compile phase):
 ^[[31;01m*^[[0m   (no error message)
 ^[[31;01m*^[[0m
 ^[[31;01m*^[[0m Call stack:
 ^[[31;01m*^[[0m     ebuild.sh, line 124:  Called src_compile
 ^[[31;01m*^[[0m   environment, line 5069:  Called die
 ^[[31;01m*^[[0m The specific snippet of code:
 ^[[31;01m*^[[0m       MOZ_MAKE_FLAGS="${MAKEOPTS}" SHELL="${SHELL:-${EPREFIX}/bin/bash}" MOZ_NOSPAM=1 ./mach build --verbose || die
 ^[[31;01m*^[[0m
 ^[[31;01m*^[[0m If you need support, post the output of `emerge --info '=www-client/firefox-60.2.0::gentoo'`,
 ^[[31;01m*^[[0m the complete build log and the output of `emerge -pqv '=www-client/firefox-60.2.0::gentoo'`.
 ^[[31;01m*^[[0m The complete build log is located at '/var/tmp/portage/www-client/firefox-60.2.0/temp/build.log'.
 ^[[31;01m*^[[0m The ebuild environment file is located at '/var/tmp/portage/www-client/firefox-60.2.0/temp/environment'.
 ^[[31;01m*^[[0m Working directory: '/var/tmp/portage/www-client/firefox-60.2.0/work/firefox-60.2.0'
 ^[[31;01m*^[[0m S: '/var/tmp/portage/www-client/firefox-60.2.0/work/firefox-60.2.0'



This is my "emerge --info":

Code:

Portage 2.3.40 (python 3.6.5-final-0, default/linux/x86/17.0/desktop, gcc-7.3.0, glibc-2.26-r7, 4.14.8-gentoo-r1 i686)                         
=================================================================                                                                             
System uname: Linux-4.14.8-gentoo-r1-i686-Intel-R-_Core-TM-_Duo_CPU_T2400_@_1.83GHz-with-gentoo-2.4.1                                         
KiB Mem:     2583004 total,   1019712 free                                                                                                     
KiB Swap:    2097148 total,   2093052 free                                                                                                     
Timestamp of repository gentoo: Sun, 16 Sep 2018 07:00:01 +0000                                                                               
Head commit of repository gentoo: 72126cd0868f27446a24b0a9123585d06ae0f564                                                                     
sh bash 4.4_p12                                                                                                                               
ld GNU ld (Gentoo 2.30 p2) 2.30.0
app-shells/bash:          4.4_p12::gentoo
dev-lang/perl:            5.24.3-r1::gentoo
dev-lang/python:          2.7.15::gentoo, 3.6.5::gentoo
dev-util/cmake:           3.9.6::gentoo
dev-util/pkgconfig:       0.29.2::gentoo
sys-apps/baselayout:      2.4.1-r2::gentoo
sys-apps/openrc:          0.34.11::gentoo
sys-apps/sandbox:         2.13::gentoo
sys-devel/autoconf:       2.13::gentoo, 2.69-r4::gentoo
sys-devel/automake:       1.15.1-r2::gentoo
sys-devel/binutils:       2.30-r2::gentoo
sys-devel/gcc:            7.3.0-r3::gentoo
sys-devel/gcc-config:     1.8-r1::gentoo
sys-devel/libtool:        2.4.6-r3::gentoo
sys-devel/make:           4.2.1-r4::gentoo
sys-kernel/linux-headers: 4.13::gentoo (virtual/os-headers)
sys-libs/glibc:           2.26-r7::gentoo
Repositories:

gentoo
    location: /usr/portage
    sync-type: rsync
    sync-uri: rsync://rsync.gentoo.org/gentoo-portage
    priority: -1000
    sync-rsync-verify-metamanifest: no
    sync-rsync-verify-jobs: 1
    sync-rsync-extra-opts:
    sync-rsync-verify-max-age: 24

dsr
    location: /var/lib/layman/dsr
    masters: gentoo
    priority: 50

ACCEPT_KEYWORDS="x86"
ACCEPT_LICENSE="* -@EULA teamspeak3"
CBUILD="i686-pc-linux-gnu"
CFLAGS="-O2 -march=native -pipe"
CHOST="i686-pc-linux-gnu"
CONFIG_PROTECT="/etc /usr/share/config /usr/share/gnupg/qualified.txt"
CONFIG_PROTECT_MASK="/etc/ca-certificates.conf /etc/dconf /etc/env.d /etc/fonts/fonts.conf /etc/gconf /etc/gentoo-release /etc/revdep-rebuild /etc/sandbox.d /etc/terminfo"
CXXFLAGS="-O2 -march=i686 -pipe"
DISTDIR="/usr/portage/distfiles"
ENV_UNSET="DBUS_SESSION_BUS_ADDRESS DISPLAY PERL5LIB PERL5OPT PERLPREFIX PERL_CORE PERL_MB_OPT PERL_MM_OPT XAUTHORITY XDG_CACHE_HOME XDG_CONFIG_HOME XDG_DATA_HOME XDG_RUNTIME_DIR"
FCFLAGS="-O2 -march=i686 -pipe"
FEATURES="assume-digests binpkg-logs config-protect-if-modified distlocks ebuild-locks fixlafiles merge-sync multilib-strict news parallel-fetch preserve-libs protect-owned sandbox sfperms strict unknown-features-warn unmerge-logs unmerge-orphans userfetch userpriv usersandbox usersync xattr"
FFLAGS="-O2 -march=i686 -pipe"
GENTOO_MIRRORS="http://gd.tuwien.ac.at/opsys/linux/gentoo/ rsync://mirror.eu.oneandone.net/gentoo/ ftp://ftp.wh2.tu-dresden.de/pub/mirrors/gentoo http://mirror.netcologne.de/gentoo/ rsync://ftp.halifax.rwth-aachen.de/gentoo/"
LDFLAGS="-Wl,-O1 -Wl,--as-needed"
MAKEOPTS="-j3"
PKGDIR="/usr/portage/packages"
PORTAGE_CONFIGROOT="/"
PORTAGE_RSYNC_OPTS="--recursive --links --safe-links --perms --times --omit-dir-times --compress --force --whole-file --delete --stats --human-readable --timeout=180 --exclude=/distfiles --exclude=/local --exclude=/packages --exclude=/.git"
PORTAGE_TMPDIR="/var/tmp"
USE="X a52 aac acl acpi alsa berkdb bluetooth branding bzip2 cairo cdda cdr cli consolekit cpudetection crypt cups cxx dbus dri dts dvd dvdr emboss encode exif fam flac fltk fortran freesound gdbm gif glamor gpm gtk iconv ipv6 jack jpeg lcms ldap libnotify libtirpc lv2 mad mng modules mp3 mp4 mpeg ncurses nls nptl ogg opengl openmp pam pango pcre pdf png policykit powermanagement ppds qt5 readline sddm sdl seccomp spell ssl startup-notification sudo svg tcpd tiff truetype udev udisks unicode upower usb vorbis wxwidgets x264 x86 xattr xcb xml xv xvid zlib" ABI_X86="32" ALSA_CARDS="hda-intel hdsp" APACHE2_MODULES="authn_core authz_core socache_shmcb unixd actions alias auth_basic authn_alias authn_anon authn_dbm authn_default authn_file authz_dbm authz_default authz_groupfile authz_host authz_owner authz_user autoindex cache cgi cgid dav dav_fs dav_lock deflate dir disk_cache env expires ext_filter file_cache filter headers include info log_config logio mem_cache mime mime_magic negotiation rewrite setenvif speling status unique_id userdir usertrack vhost_alias" CALLIGRA_FEATURES="karbon plan sheets stage words" COLLECTD_PLUGINS="df interface irq load memory rrdtool swap syslog" CPU_FLAGS_X86="mmx mmxext sse sse2" ELIBC="glibc" GPSD_PROTOCOLS="ashtech aivdm earthmate evermore fv18 garmin garmintxt gpsclock isync itrax mtk3301 nmea ntrip navcom oceanserver oldstyle oncore rtcm104v2 rtcm104v3 sirf skytraq superstar2 timing tsip tripmate tnt ublox ubx" INPUT_DEVICES="evdev synaptics" KERNEL="linux" LCD_DEVICES="bayrad cfontz cfontz633 glk hd44780 lb216 lcdm001 mtxorb ncurses text" LIBREOFFICE_EXTENSIONS="presenter-console presenter-minimizer" OFFICE_IMPLEMENTATION="libreoffice" PHP_TARGETS="php5-6 php7-0" POSTGRES_TARGETS="postgres9_5 postgres10" PYTHON_SINGLE_TARGET="python3_6" PYTHON_TARGETS="python2_7 python3_6" RUBY_TARGETS="ruby22 ruby23" USERLAND="GNU" VIDEO_CARDS="intel" XTABLES_ADDONS="quota2 psd pknock lscan length2 ipv4options ipset ipp2p iface geoip fuzzy condition tee tarpit sysrq steal rawnat logmark ipmark dhcpmac delude chaos account"
Unset:  CC, CPPFLAGS, CTARGET, CXX, EMERGE_DEFAULT_OPTS, INSTALL_MASK, LANG, LC_ALL, LINGUAS, PORTAGE_BINHOST, PORTAGE_BUNZIP2_COMMAND, PORTAGE_COMPRESS, PORTAGE_COMPRESS_FLAGS, PORTAGE_RSYNC_EXTRA_OPTS


It would be great if someone has an idea how to fix this ;)

thank you very much
Erdie
_________________
Desktop AMD FX-4300 12GB RAM, Asus GF GTX 650. Sound RME Multiface + PCI + Cardbus, 2x RME Quadmic, 1x Behringer ADA8000 + ganz viele Modellflugzeuge, ein Tandem, Rennrad und DFXL ;)
2x IBM Thinkpad T60
Zotag Mag Mini Atom
Raspberry Pi 1 + 2 + Zero W


Last edited by Erdie on Wed Sep 26, 2018 7:06 am; edited 1 time in total
Back to top
View user's profile Send private message
Jaglover
Watchman
Watchman


Joined: 29 May 2005
Posts: 6610
Location: Saint Amant, Acadiana

PostPosted: Sun Sep 16, 2018 10:47 am    Post subject: Reply with quote

I'm guessing there is OOM killer in action, no telling for sure, the snippet of log you have provided is too short.
_________________
Please learn how to denote units correctly!
Back to top
View user's profile Send private message
wrc1944
Advocate
Advocate


Joined: 15 Aug 2002
Posts: 3182
Location: Gainesville, Florida

PostPosted: Sun Sep 16, 2018 4:56 pm    Post subject: Reply with quote

I'd assume on an old laptop your Gentoo partition(s) might be relatively small. Here's some thoughts.

Check if you have enough free disk space so as to allow swapping to function. Is your swap space on a separate partition? What size is your root partition?

Try freeing up some space by cleaning out /var/tmp/portage and make sure your log files haven't gotten huge.

If /var/tmp/portage runs out of free disk space, the compile will fail at that point.

Run eclean to get rid of old distfiles if you keep distfiles on your root partition. This can grow to many, many GB. Even worse than log files.

Look for anything that is unneeded, like old kernel source directories in /usr/src, and remove them, and other trash files.
_________________
Main box- AsRock x370 Gaming K4
Ryzen 1700, 3.0GHz, 16GB GSkill Flare DDR4 3200mhz
Samsung SATA 1000GB, Radeon HD R7 350 2GB DDR5
Gentoo ~amd64 plasma, glibc-2.27-r6, gcc-8.2.0-r3 kernel-4.18.15-gentoo USE=experimental
Back to top
View user's profile Send private message
Erdie
Veteran
Veteran


Joined: 20 May 2004
Posts: 1987
Location: Heidelberg - Germany

PostPosted: Mon Sep 17, 2018 6:20 am    Post subject: Reply with quote

Ok thanks, will try. It is a Lenovo T60 with 256GB SSD. IMHO there is enough disk space but is will investigate this in detail and come back afterwards.
_________________
Desktop AMD FX-4300 12GB RAM, Asus GF GTX 650. Sound RME Multiface + PCI + Cardbus, 2x RME Quadmic, 1x Behringer ADA8000 + ganz viele Modellflugzeuge, ein Tandem, Rennrad und DFXL ;)
2x IBM Thinkpad T60
Zotag Mag Mini Atom
Raspberry Pi 1 + 2 + Zero W
Back to top
View user's profile Send private message
Erdie
Veteran
Veteran


Joined: 20 May 2004
Posts: 1987
Location: Heidelberg - Germany

PostPosted: Tue Sep 18, 2018 9:16 am    Post subject: Reply with quote

I have a big partition with about 250GB of free disk space which includes "/var". This could not be a problem. In terms of RAM memory, I created an additional swap file of 2GB. Anyway it failed. In the evening, I can provide the complete build log file.
_________________
Desktop AMD FX-4300 12GB RAM, Asus GF GTX 650. Sound RME Multiface + PCI + Cardbus, 2x RME Quadmic, 1x Behringer ADA8000 + ganz viele Modellflugzeuge, ein Tandem, Rennrad und DFXL ;)
2x IBM Thinkpad T60
Zotag Mag Mini Atom
Raspberry Pi 1 + 2 + Zero W
Back to top
View user's profile Send private message
ChrisJumper
Advocate
Advocate


Joined: 12 Mar 2005
Posts: 2182
Location: Germany

PostPosted: Tue Sep 18, 2018 11:29 pm    Post subject: Reply with quote

Yes, or some Lines above your log please. On Multi-Core CPUs the Error is sometimes between previous build blocks, which look clean. So you have to scroll some Lines upwards to be sure.

Check your dev-libs/nss too. Even its not stable i would use 3.39, because of security issues. I am not sure if every issue get patched/downgraded in prior stable Versions too (it should because of the esr/Extended Support Release). And rust is important, but 1.28.0 is stable too.
Back to top
View user's profile Send private message
Erdie
Veteran
Veteran


Joined: 20 May 2004
Posts: 1987
Location: Heidelberg - Germany

PostPosted: Thu Sep 20, 2018 5:22 am    Post subject: Reply with quote

The software is unable to display the log file as code block. the code block gets destroyed, the file truncated. Therefore I uploaded the full file to the webspace:

http://www.erdie.de/build.log.gz
_________________
Desktop AMD FX-4300 12GB RAM, Asus GF GTX 650. Sound RME Multiface + PCI + Cardbus, 2x RME Quadmic, 1x Behringer ADA8000 + ganz viele Modellflugzeuge, ein Tandem, Rennrad und DFXL ;)
2x IBM Thinkpad T60
Zotag Mag Mini Atom
Raspberry Pi 1 + 2 + Zero W
Back to top
View user's profile Send private message
Gentlenoob
n00b
n00b


Joined: 10 Apr 2008
Posts: 24

PostPosted: Fri Sep 21, 2018 9:05 pm    Post subject: Reply with quote

similar problem here. Setting "-j1" in make.conf may help to disentangle the build log, in my case resulting in

Code:

...
847:51.48^O    Compiling cfg-if v0.1.2^O
847:51.68^O    Compiling cose v0.1.4^O
847:52.47^O error^O: linking with `/var/tmp/portage/www-client/firefox-60.2.0/work/firefox-60.2.0/build/cargo-linker` failed: exit code: 1^O^O
847:52.47^O   ^O|^O^O
847:52.47^O   ^O= ^Onote^O: "/var/tmp/portage/www-client/firefox-60.2.0/work/firefox-60.2.0/build/cargo-linker" "-Wl,--as-needed" "-Wl,-z,noexecstack" "-m32" "-L" "/usr/lib/rustlib/i686-unknown-linux-gnu/lib" "/var/tmp/portage/www-client/firefox-60.2.0/work/firefox-60.2.0/ff/toolkit/library/release/build/cose-07f74104284ed8a2/build_script_build-07f74104284ed8a2.build_script_build0.rcgu.o" "-o" "/var/tmp/portage/www-client/firefox-60.2.0/work/firefox-60.2.0/ff/toolkit/library/release/build/cose-07f74104284ed8a2/build_script_build-07f74104284ed8a2" "/var/tmp/portage/www-client/firefox-60.2.0/work/firefox-60.2.0/ff/toolkit/library/release/build/cose-07f74104284ed8a2/build_script_build-07f74104284ed8a2.crate.allocator.rcgu.o" "-Wl,--gc-sections" "-pie" "-Wl,-z,relro,-z,now" "-Wl,-O1" "-nodefaultlibs" "-L" "/var/tmp/portage/www-client/firefox-60.2.0/work/firefox-60.2.0/ff/toolkit/library/release/deps" "-L" "/usr/lib/rustlib/i686-unknown-linux-gnu/lib" "-Wl,-Bstatic" "/usr/lib/rustlib/i686-unknown-linux-gnu/lib/libstd-3a04e5487357b9dc.rlib" "/usr/lib/rustlib/i686-unknown-linux-gnu/lib/libpanic_unwind-75baa38f22cc081b.rlib" "/usr/lib/rustlib/i686-unknown-linux-gnu/lib/liballoc_jemalloc-cc6cad7f4861198e.rlib" "/usr/lib/rustlib/i686-unknown-linux-gnu/lib/libunwind-0df808026f9bff72.rlib" "/usr/lib/rustlib/i686-unknown-linux-gnu/lib/liballoc_system-5885ff2e63807fd7.rlib" "/usr/lib/rustlib/i686-unknown-linux-gnu/lib/liblibc-4b46c18a44d67980.rlib" "/usr/lib/rustlib/i686-unknown-linux-gnu/lib/liballoc-22af9bc8b767b147.rlib" "/usr/lib/rustlib/i686-unknown-linux-gnu/lib/libstd_unicode-46e7ab27ec583312.rlib" "/usr/lib/rustlib/i686-unknown-linux-gnu/lib/libcore-b4b9c53c65e9ed4f.rlib" "/usr/lib/rustlib/i686-unknown-linux-gnu/lib/libcompiler_builtins-0bcc823f82eb498d.rlib" "-Wl,-Bdynamic" "-l" "dl" "-l" "rt" "-l" "pthread" "-l" "pthread" "-l" "gcc_s" "-l" "c" "-l" "m" "-l" "rt" "-l" "pthread" "-l" "util" "-l" "util"^O^O
847:52.47^O   ^O= ^Onote^O: /usr/lib/gcc/i686-pc-linux-gnu/7.3.0/../../../../i686-pc-linux-gnu/bin/ld: internal error /var/tmp/portage/sys-devel/binutils-2.30-r2/work/binutils-2.30/ld/ldlang.c 6635^O^O
847:52.48^O           collect2: error: ld returned 1 exit status^O^O
847:52.48^O           ^O^O
847:52.48^O ^O
847:52.48^O error^O: aborting due to previous error^O^O
847:52.48^O ^O
847:52.76^O error: Could not compile `cose`.^O
847:52.76^O warning: build failed, waiting for other jobs to finish...^O
847:55.13^O error: build failed^O
847:55.22^O gmake[4]: *** [/var/tmp/portage/www-client/firefox-60.2.0/work/firefox-60.2.0/config/rules.mk:972: force-cargo-library-build] Error 101^O
847:55.22^O gmake[4]: Leaving directory '/var/tmp/portage/www-client/firefox-60.2.0/work/firefox-60.2.0/ff/toolkit/library/rust'^O
847:55.22^O gmake[3]: *** [/var/tmp/portage/www-client/firefox-60.2.0/work/firefox-60.2.0/config/recurse.mk:73: toolkit/library/rust/target] Error 2^O
847:55.22^O gmake[3]: Leaving directory '/var/tmp/portage/www-client/firefox-60.2.0/work/firefox-60.2.0/ff'^O
847:55.23^O gmake[2]: *** [/var/tmp/portage/www-client/firefox-60.2.0/work/firefox-60.2.0/config/recurse.mk:33: compile] Error 2^O
847:55.23^O gmake[2]: Leaving directory '/var/tmp/portage/www-client/firefox-60.2.0/work/firefox-60.2.0/ff'^O
847:55.23^O gmake[1]: *** [/var/tmp/portage/www-client/firefox-60.2.0/work/firefox-60.2.0/config/rules.mk:434: default] Error 2^O
847:55.23^O gmake[1]: Leaving directory '/var/tmp/portage/www-client/firefox-60.2.0/work/firefox-60.2.0/ff'^O
847:55.23^O gmake: *** [client.mk:168: build] Error 2^O
847:55.23^O 0 compiler warnings present.^O


This is visible in your log as well; I don't know what it means, though. There's also a bugzilla entry, https://bugs.gentoo.org/665664 which looks related. I'll probably just wait a few days and retry eventually, since compiling on this old box takes ages.

Cheers, Ralph
Back to top
View user's profile Send private message
ChrisJumper
Advocate
Advocate


Joined: 12 Mar 2005
Posts: 2182
Location: Germany

PostPosted: Sat Sep 22, 2018 5:31 pm    Post subject: Reply with quote

Hi Erdie,

checked today if i can compile firefox-60.2.0. And it runs through. Here are my Useflags, nss and rust Packages:

dev-lang/rust-1.28.0
dev-util/cargo-0.29.0
dev-libs/nss-3.39 (Unstable) Useflag nss-pem
media-libs/libvpx-1.5.0
dev-libs/icu-60.2
www-client/firefox-60.2.0
Firefox Useflags: custom-cflags custom-optimization dbus gmp-autoupdate pulseaudio screenshot startup-notification system-icu system-jpeg system-libvpx

Not sure why i deactivate this Flags: -system-harfbuzz -system-libevent -system-sqlite hwaccel

Snipped of Emerge Info:
Code:

Portage 2.3.40 (python 3.5.5-final-0, default/linux/amd64/17.0/desktop, gcc-7.3.0, glibc-2.26-r7, 4.17.19-gentoo x86_64)
Timestamp of repository gentoo: Sat, 15 Sep 2018 09:00:01 +0000
Head commit of repository gentoo: 8ef3a5105b0eff7c789d00ebb60c6d204cfc4ade
sh bash 4.4_p12
ld GNU ld (Gentoo 2.29.1 p3) 2.29.1
distcc 3.2rc1 x86_64-pc-linux-gnu [disabled]
app-shells/bash:          4.4_p12::gentoo
dev-java/java-config:     2.2.0-r4::gentoo
dev-lang/perl:            5.24.3-r1::gentoo
dev-lang/python:          2.7.15::gentoo, 3.4.8::gentoo, 3.5.5::gentoo, 3.6.5::gentoo
dev-util/cmake:           3.9.6::gentoo
dev-util/pkgconfig:       0.29.2::gentoo
sys-apps/baselayout:      2.4.1-r2::gentoo
sys-apps/sandbox:         2.13::gentoo
sys-devel/autoconf:       2.13::gentoo, 2.69-r4::gentoo
sys-devel/automake:       1.11.6-r3::gentoo, 1.15.1-r2::gentoo
sys-devel/binutils:       2.29.1-r1::gentoo, 2.30-r2::gentoo
sys-devel/gcc:            6.4.0-r1::gentoo, 7.3.0-r3::gentoo
sys-devel/gcc-config:     1.8-r1::gentoo
sys-devel/libtool:        2.4.6-r3::gentoo
sys-devel/make:           4.2.1-r4::gentoo
sys-kernel/linux-headers: 4.13::gentoo (virtual/os-headers)
sys-libs/glibc:           2.26-r7::gentoo
..
MAKEOPTS="-j5"
..
CFLAGS="-march=ivybridge -mtune=generic -O2 -pipe"


If i use distccd, like a week before to support my powerless Laptop, i was not able to build Firefox (61.0.1 or 62.0-r1).
However, with that configuration i can build Firefox 62.0-r1 too.
Back to top
View user's profile Send private message
Erdie
Veteran
Veteran


Joined: 20 May 2004
Posts: 1987
Location: Heidelberg - Germany

PostPosted: Sat Sep 22, 2018 7:58 pm    Post subject: Reply with quote

I will check and compare. Thanks!
_________________
Desktop AMD FX-4300 12GB RAM, Asus GF GTX 650. Sound RME Multiface + PCI + Cardbus, 2x RME Quadmic, 1x Behringer ADA8000 + ganz viele Modellflugzeuge, ein Tandem, Rennrad und DFXL ;)
2x IBM Thinkpad T60
Zotag Mag Mini Atom
Raspberry Pi 1 + 2 + Zero W
Back to top
View user's profile Send private message
sokhapkin
n00b
n00b


Joined: 13 Jan 2005
Posts: 33
Location: N Ft Myers, FL

PostPosted: Tue Sep 25, 2018 12:18 am    Post subject: Reply with quote

Downgrade binutils to version 2.29. 2.30 and 2.31 fail to build firefox on x86.
_________________
Sergey Okhapkin
http://www.callwithus.com
Back to top
View user's profile Send private message
Erdie
Veteran
Veteran


Joined: 20 May 2004
Posts: 1987
Location: Heidelberg - Germany

PostPosted: Wed Sep 26, 2018 4:29 am    Post subject: Reply with quote

sokhapkin wrote:
Downgrade binutils to version 2.29. 2.30 and 2.31 fail to build firefox on x86.


that was it! Thanks :)

After emerging a 2nd slot for binutils firefox builds, too.
_________________
Desktop AMD FX-4300 12GB RAM, Asus GF GTX 650. Sound RME Multiface + PCI + Cardbus, 2x RME Quadmic, 1x Behringer ADA8000 + ganz viele Modellflugzeuge, ein Tandem, Rennrad und DFXL ;)
2x IBM Thinkpad T60
Zotag Mag Mini Atom
Raspberry Pi 1 + 2 + Zero W
Back to top
View user's profile Send private message
Display posts from previous:   
Reply to topic    Gentoo Forums Forum Index Desktop Environments All times are GMT
Page 1 of 1

 
Jump to:  
You cannot post new topics in this forum
You cannot reply to topics in this forum
You cannot edit your posts in this forum
You cannot delete your posts in this forum
You cannot vote in polls in this forum