Gentoo Forums
Gentoo Forums
Gentoo Forums
Quick Search: in
[solved] stable chromium-69.0.3497.X compile issue
View unanswered posts
View posts from last 24 hours

Goto page 1, 2, 3  Next  
Reply to topic    Gentoo Forums Forum Index Portage & Programming
View previous topic :: View next topic  
Author Message
jagdpanther
Guru
Guru


Joined: 22 Nov 2003
Posts: 476

PostPosted: Thu Sep 13, 2018 5:53 pm    Post subject: [solved] stable chromium-69.0.3497.X compile issue Reply with quote

The latest stable chromium, www-client/chromium-69.0.3497.81 fails during compile time on my Gentoo box. I attempted the following without the '-p':

Code:
 # emerge -p chromium

These are the packages that would be merged, in order:

Calculating dependencies... done!
[ebuild     U  ] www-client/chromium-69.0.3497.81 [68.0.3440.75] USE="(-system-icu*)"


Chromium always takes a long time to compile, but I haven't had an issue with the stable version emerging before.

The end of the compile looks like:
Code:
[15445/16588] x86_64-pc-linux-gnu-clang++ -MMD -MF obj/chrome/browser/ui/ui/relaunch_recommended_bubble_view.o.d -DV8_DEPRECATION_WARNINGS -DUSE_UDEV -DUSE_AURA=1 -DUSE_GLIB=1 -DUSE_NSS_CERTS=1 -DUSE_X11=1 -DNO_TCMALLOC -DFULL_SAFE_BROWSING -DSAFE_BROWSING_CSD -DSAFE_BROWSING_DB_LOCAL -DCHROMIUM_BUILD -D_FILE_OFFSET_BITS=64 -D_LARGEFILE_SOURCE -D_LARGEFILE64_SOURCE -D__STDC_CONSTANT_MACROS -D__STDC_FORMAT_MACROS -DNDEBUG -DNVALGRIND -DDYNAMIC_ANNOTATIONS_ENABLED=0 -DUSE_CUPS -DUSE_GIO -DGLIB_VERSION_MAX_ALLOWED=GLIB_VERSION_2_32 -DGLIB_VERSION_MIN_REQUIRED=GLIB_VERSION_2_26 -DENABLE_IPC_FUZZER -DTOOLKIT_VIEWS=1 -DGL_GLEXT_PROTOTYPES -DUSE_GLX -DUSE_EGL -DVK_NO_PROTOTYPES -DEXPAT_RELATIVE_PATH -DGOOGLE_PROTOBUF_NO_RTTI -DGOOGLE_PROTOBUF_NO_STATIC_INITIALIZER -DHAVE_PTHREAD -DLEVELDB_PLATFORM_CHROMIUM=1 -DU_USING_ICU_NAMESPACE=0 -DU_ENABLE_DYLOAD=0 -DU_STATIC_IMPLEMENTATION -DICU_UTIL_DATA_IMPL=ICU_UTIL_DATA_FILE -DUCHAR_TYPE=uint16_t -DV8_USE_EXTERNAL_STARTUP_DATA -DSK_IGNORE_LINEONLY_AA_CONVEX_PATH_OPTS -DSK_HAS_PNG_LIBRARY -DSK_HAS_WEBP_LIBRARY -DSK_HAS_JPEG_LIBRARY -DSK_VULKAN_HEADER=\"../../skia/config/SkVulkanConfig.h\" -DSK_VULKAN=1 -DSK_SUPPORT_GPU=1 -DSK_GPU_WORKAROUNDS_HEADER=\"gpu/config/gpu_driver_bug_workaround_autogen.h\" -DVK_NO_PROTOTYPES -DWEBRTC_NON_STATIC_TRACE_EVENT_HANDLERS=0 -DGTEST_RELATIVE_PATH -DWEBRTC_CHROMIUM_BUILD -DWEBRTC_POSIX -DWEBRTC_LINUX -DABSL_ALLOCATOR_NOTHROW=1 -DNO_MAIN_THREAD_WRAPPING -DI18N_ADDRESS_VALIDATION_DATA_URL=\"https://chromium-i18n.appspot.com/ssl-aggregate-address/\" -DUSE_SYSTEM_ZLIB=1 -I../.. -Igen -Igen/shim_headers/zlib_shim -Igen/shim_headers/re2_shim -Igen/shim_headers/snappy_shim -Igen/shim_headers/libpng_shim -Igen/shim_headers/libwebp_shim -Igen/shim_headers/libdrm_shim -I../../third_party/khronos -I../../gpu -I../../third_party/libyuv/include -I../../third_party/vulkan/include -Igen/shim_headers/openh264_shim -Igen/shim_headers/minizip_shim -Igen/shim_headers/flac_shim -I../../third_party/webrtc_overrides -I../../testing/gtest/include -I../../third_party/libyuv/include -I../../third_party/usrsctp/usrsctplib -I../../third_party/webrtc -I../../third_party/protobuf/src -Igen/protoc_out -I../../third_party/protobuf/src -I../../third_party/boringssl/src/include -I../../third_party/leveldatabase -I../../third_party/leveldatabase/src -I../../third_party/leveldatabase/src/include -I../../third_party/ced/src -I../../third_party/icu/source/common -I../../third_party/icu/source/i18n -I../../skia/config -I../../skia/ext -I../../third_party/skia/include/c -I../../third_party/skia/include/config -I../../third_party/skia/include/core -I../../third_party/skia/include/effects -I../../third_party/skia/include/encode -I../../third_party/skia/include/gpu -I../../third_party/skia/include/images -I../../third_party/skia/include/lazy -I../../third_party/skia/include/pathops -I../../third_party/skia/include/pdf -I../../third_party/skia/include/pipe -I../../third_party/skia/include/ports -I../../third_party/skia/include/utils -I../../third_party/vulkan/include -I../../third_party/skia/third_party/vulkanmemoryallocator -I../../third_party/skia/src/gpu -I../../third_party/skia/src/sksl -I../../third_party/vulkan/include -I../../third_party/libwebm/source -I../../v8/include -Igen/v8/include -I../../third_party/webrtc_overrides -I../../third_party/webrtc -I../../third_party/perfetto/include -Igen/third_party/perfetto/protos -Igen/third_party/perfetto/protos -Igen/third_party/perfetto/protos -Igen/third_party/metrics_proto -I../../third_party/mesa/src/include -Igen -Igen -I../../third_party/libaddressinput/src/cpp/include -I../../third_party/cacheinvalidation/overrides -I../../third_party/cacheinvalidation/src -I../../third_party/flatbuffers/src/include -I../../third_party/brotli/include -I../../third_party/webrtc_overrides -I../../testing/gtest/include -I../../third_party/webrtc -Igen -Igen -fno-strict-aliasing --param=ssp-buffer-size=4 -fstack-protector -Wno-builtin-macro-redefined -D__DATE__= -D__TIME__= -D__TIMESTAMP__= -funwind-tables -fPIC -pthread -fcolor-diagnostics -fmerge-all-constants -no-canonical-prefixes -Wall -Wextra -Wimplicit-fallthrough -Wthread-safety -Wno-missing-field-initializers -Wno-unused-parameter -Wno-c++11-narrowing -Wno-covered-switch-default -Wno-unneeded-internal-declaration -Wno-undefined-var-template -Wno-address-of-packed-member -Wno-nonportable-include-path -Wno-user-defined-warnings -Wno-unused-lambda-capture -Wno-null-pointer-arithmetic -Wno-enum-compare-switch -fno-omit-frame-pointer -fvisibility=hidden -Wheader-hygiene -Wstring-conversion -Wtautological-overlap-compare -Wno-nonnull -Wexit-time-destructors -isystem../../../../../../../../../usr/include/glib-2.0 -isystem../../../../../../../../../usr/lib64/glib-2.0/include -isystem../../../../../../../../../usr/include/glib-2.0 -isystem../../../../../../../../../usr/lib64/glib-2.0/include -Wno-header-guard -isystem../../../../../../../../../usr/include/nss -isystem../../../../../../../../../usr/include/nspr -isystem ../../third_party/abseil-cpp -Wno-exit-time-destructors -isystem../../../../../../../../../usr/include/dbus-1.0 -isystem../../../../../../../../../usr/lib64/dbus-1.0/include -std=gnu++14 -fno-exceptions -fno-rtti -fvisibility-inlines-hidden -march=native -O2 -pipe -c ../../chrome/browser/ui/views/relaunch_notification/relaunch_recommended_bubble_view.cc -o obj/chrome/browser/ui/ui/relaunch_recommended_bubble_view.o
ninja: build stopped: subcommand failed.
 * ERROR: www-client/chromium-69.0.3497.81::gentoo failed (compile phase):
 *   ninja -v -j24 -l0 -C out/Release chrome chromedriver failed
 *
 * Call stack:
 *     ebuild.sh, line  124:  Called src_compile
 *   environment, line 4999:  Called eninja '-C' 'out/Release' 'chrome' 'chromedriver'
 *   environment, line 1773:  Called die
 * The specific snippet of code:
 *       "$@" || die "${nonfatal_args[@]}" "${*} failed"


more information:

Code:
 emerge --info '=www-client/chromium-69.0.3497.81::gentoo'
Portage 2.3.40 (python 3.6.5-final-0, default/linux/amd64/17.0, gcc-7.3.0, glibc-2.26-r7, 4.18.7-gentoo-01 x86_64)
=================================================================
                         System Settings
=================================================================
System uname: Linux-4.18.7-gentoo-01-x86_64-Intel-R-_Xeon-R-_Gold_6136_CPU_@_3.00GHz-with-gentoo-2.4.1
KiB Mem:    65614584 total,  28892228 free
KiB Swap:   32767992 total,  32767992 free
Timestamp of repository gentoo: Thu, 13 Sep 2018 14:15:01 +0000
Head commit of repository gentoo: 7a50b797d7e239a56cfd3d91ad1eaa2a479a9271
sh bash 4.4_p12
ld GNU ld (Gentoo 2.30 p2) 2.30.0
app-shells/bash:          4.4_p12::gentoo
dev-java/java-config:     2.2.0-r4::gentoo
dev-lang/perl:            5.24.3-r1::gentoo
dev-lang/python:          2.7.15::gentoo, 3.6.5::gentoo
dev-util/cmake:           3.9.6::gentoo
dev-util/pkgconfig:       0.29.2::gentoo
sys-apps/baselayout:      2.4.1-r2::gentoo
sys-apps/openrc:          0.34.11::gentoo
sys-apps/sandbox:         2.13::gentoo
sys-devel/autoconf:       2.13::gentoo, 2.69-r4::gentoo
sys-devel/automake:       1.11.6-r3::gentoo, 1.15.1-r2::gentoo
sys-devel/binutils:       2.30-r2::gentoo
sys-devel/gcc:            7.3.0-r3::gentoo
sys-devel/gcc-config:     1.8-r1::gentoo
sys-devel/libtool:        2.4.6-r3::gentoo
sys-devel/make:           4.2.1-r4::gentoo
sys-kernel/linux-headers: 4.13::gentoo (virtual/os-headers)
sys-libs/glibc:           2.26-r7::gentoo
Repositories:

gentoo
    location: /usr/portage
    sync-type: rsync
    sync-uri: rsync://rsync.us.gentoo.org/gentoo-portage
    priority: -1000
    sync-rsync-verify-max-age: 24
    sync-rsync-verify-jobs: 1
    sync-rsync-verify-metamanifest: no
    sync-rsync-extra-opts:

vmware
    location: /var/lib/layman/vmware
    masters: gentoo
    priority: 50

ACCEPT_KEYWORDS="amd64"
ACCEPT_LICENSE="*"
CBUILD="x86_64-pc-linux-gnu"
CFLAGS="-march=native -O2 -fomit-frame-pointer -pipe -W -Wall"
CHOST="x86_64-pc-linux-gnu"
CONFIG_PROTECT="/etc /usr/lib64/libreoffice/program/sofficerc /usr/share/config /usr/share/easy-rsa /usr/share/gnupg/qualified.txt /usr/share/themes/oxygen-gtk/gtk-2.0"
CONFIG_PROTECT_MASK="/etc/ca-certificates.conf /etc/dconf /etc/env.d /etc/fonts/fonts.conf /etc/gconf /etc/gentoo-release /etc/revdep-rebuild /etc/sandbox.d /etc/terminfo"
CXXFLAGS="-march=native -O2 -fomit-frame-pointer -pipe"
DISTDIR="/usr/portage/distfiles"
ENV_UNSET="DBUS_SESSION_BUS_ADDRESS DISPLAY PERL5LIB PERL5OPT PERLPREFIX PERL_CORE PERL_MB_OPT PERL_MM_OPT XAUTHORITY XDG_CACHE_HOME XDG_CONFIG_HOME XDG_DATA_HOME XDG_RUNTIME_DIR"
FCFLAGS="-O2 -pipe"
FEATURES="assume-digests binpkg-logs config-protect-if-modified distlocks ebuild-locks fixlafiles merge-sync multilib-strict news parallel-fetch preserve-libs protect-owned sandbox sfperms strict unknown-features-warn unmerge-logs unmerge-orphans userfetch userpriv usersandbox usersync"
FFLAGS="-O2 -pipe"
GENTOO_MIRRORS="http://mirrors.rit.edu/gentoo/ http://gentoo.mirrors.pair.com/ ftp://mirrors.tera-byte.com/pub/gentoo ftp://cosmos.illinois.edu/pub/gentoo/ ftp://mirrors.rit.edu/gentoo/"
LANG="en_US"
LDFLAGS="-Wl,-O1 -Wl,--as-needed"
MAKEOPTS="-j24"
PKGDIR="/usr/portage/packages"
PORTAGE_CONFIGROOT="/"
PORTAGE_RSYNC_OPTS="--recursive --links --safe-links --perms --times --omit-dir-times --compress --force --whole-file --delete --stats --human-readable --timeout=180 --exclude=/distfiles --exclude=/local --exclude=/packages --exclude=/.git"
PORTAGE_TMPDIR="/tmp"
USE="X Xaw3d a52 aac acl acpi alsa amd64 apache2 audiofile bash-completion bcmath berkdb bzip2 cairo caps cdparanoia cdr clamav cli cracklib crypt ctype cups cxx dbus dga directfb dri dts dv dvd dvdr encode esd ffmpeg fftw flac foomaticdb fortran gcj gd gdbm gif glut gnutls gphoto2 gpm gtk iconv imagemagick imap imlib ipv6 jpeg libtirpc lm_sensors lzma lzo mad mikmod mjpeg mng modules mp3 mpeg mplayer multilib musepack mysql mysqli nas ncurses nls nptl nvidia offensive ogg openal openexr opengl openmp orc pam pcre pdf perl plasma plotutils png policykit portaudio posix ppds python qt3support qt5 quicktime readline sasl sdl seccomp semantic-desktop slp sndfile sockets sox speex spell ssl svg syslog tcpd theora threads tiff truetype unicode usb vhosts vorbis win32codecs wmf x264 xattr xml xmp xpm xulrunner xvid xvmc zlib" ABI_X86="64 32" ALSA_CARDS="ali5451 als4000 atiixp atiixp-modem bt87x ca0106 cmipci emu10k1x ens1370 ens1371 es1938 es1968 fm801 hda-intel intel8x0 intel8x0m maestro3 trident usb-audio via82xx via82xx-modem ymfpci" APACHE2_MODULES="authn_core authz_core socache_shmcb unixd actions alias auth_basic authn_alias authn_anon authn_dbm authn_default authn_file authz_dbm authz_default authz_groupfile authz_host authz_owner authz_user autoindex cache cgi cgid dav dav_fs dav_lock deflate dir disk_cache env expires ext_filter file_cache filter headers include info log_config logio mem_cache mime mime_magic negotiation rewrite setenvif speling status unique_id userdir usertrack vhost_alias" CALLIGRA_FEATURES="karbon plan sheets stage words" COLLECTD_PLUGINS="df interface irq load memory rrdtool swap syslog" CPU_FLAGS_X86="aes avx avx2 avx512f avx512dq avx512cd avx512bw avx512vl f16c fma3 mmx mmxext pclmul popcnt sse sse2 sse3 sse4_1 sse4_2 ssse3" ELIBC="glibc" GPSD_PROTOCOLS="ashtech aivdm earthmate evermore fv18 garmin garmintxt gpsclock isync itrax mtk3301 nmea ntrip navcom oceanserver oldstyle oncore rtcm104v2 rtcm104v3 sirf skytraq superstar2 timing tsip tripmate tnt ublox ubx" GRUB_PLATFORMS="pc" INPUT_DEVICES="evdev" KERNEL="linux" LCD_DEVICES="bayrad cfontz cfontz633 glk hd44780 lb216 lcdm001 mtxorb ncurses text" LIBREOFFICE_EXTENSIONS="presenter-console presenter-minimizer" OFFICE_IMPLEMENTATION="libreoffice" PHP_TARGETS="php5-6 php7-0" POSTGRES_TARGETS="postgres9_5 postgres10" PYTHON_SINGLE_TARGET="python3_6" PYTHON_TARGETS="python2_7 python3_6" RUBY_TARGETS="ruby23" USERLAND="GNU" VIDEO_CARDS="nvidia nouveau" XTABLES_ADDONS="quota2 psd pknock lscan length2 ipv4options ipset ipp2p iface geoip fuzzy condition tee tarpit sysrq steal rawnat logmark ipmark dhcpmac delude chaos account"
Unset:  CC, CPPFLAGS, CTARGET, CXX, EMERGE_DEFAULT_OPTS, INSTALL_MASK, LC_ALL, LINGUAS, PORTAGE_BINHOST, PORTAGE_BUNZIP2_COMMAND, PORTAGE_COMPRESS, PORTAGE_COMPRESS_FLAGS, PORTAGE_RSYNC_EXTRA_OPTS


Last edited by jagdpanther on Fri Nov 23, 2018 8:01 pm; edited 2 times in total
Back to top
View user's profile Send private message
fedeliallalinea
Bodhisattva
Bodhisattva


Joined: 08 Mar 2003
Posts: 20151
Location: here

PostPosted: Thu Sep 13, 2018 6:19 pm    Post subject: Reply with quote

You should post full build.log

EDIT: or search in build.log keyword 'error:' and post some lines before and after that
_________________
Questions are guaranteed in life; Answers aren't.
Back to top
View user's profile Send private message
frsty
n00b
n00b


Joined: 11 Jul 2016
Posts: 11

PostPosted: Fri Sep 14, 2018 3:44 pm    Post subject: Reply with quote

Sorry to hijack this topic, but i'm having the same problem, or it seems related at least. Build.log:

Code:
clude/glib-2.0 -isystem../../../../../../../../../usr/lib64/glib-2.0/include -Wno-header-guard -isystem../../../../../../../../../usr/include/nss -isystem../../../../../../../../../usr/include/nspr -isystem ../../third_party/abseil-cpp -std=gnu++14 -fno-exceptions -fno-rtti -fvisibility-inlines-hidden -march=native -O2 -pipe -c ../../device/gamepad/gamepad_provider.cc -o obj/device/gamepad/gamepad/gamepad_provider.o
ninja: build stopped: subcommand failed.
 * ERROR: www-client/chromium-69.0.3497.81::gentoo failed (compile phase):
 *   ninja -v -j7 -l0 -C out/Release chrome chromedriver failed
 *
 * Call stack:
 *     ebuild.sh, line  124:  Called src_compile
 *   environment, line 5001:  Called eninja '-C' 'out/Release' 'chrome' 'chromedriver'
 *   environment, line 1775:  Called die
 * The specific snippet of code:
 *       "$@" || die "${nonfatal_args[@]}" "${*} failed"
 *


Only difference is that i'm on GCC 6.4 and we seem to halt compiling at a different location?
Back to top
View user's profile Send private message
fedeliallalinea
Bodhisattva
Bodhisattva


Joined: 08 Mar 2003
Posts: 20151
Location: here

PostPosted: Fri Sep 14, 2018 4:20 pm    Post subject: Reply with quote

frsty wrote:
Only difference is that i'm on GCC 6.4 and we seem to halt compiling at a different location?

Same thing I said to jagdpanther... You should post full build.log or search in build.log keyword 'error:' and post some lines before and after that

If you have low RAM and swap space can be a out of memory error, check dmesg to see it
_________________
Questions are guaranteed in life; Answers aren't.
Back to top
View user's profile Send private message
jagdpanther
Guru
Guru


Joined: 22 Nov 2003
Posts: 476

PostPosted: Fri Sep 14, 2018 8:01 pm    Post subject: Reply with quote

I tried this on my 2nd Gentoo box. Same issue.

Anyone have a suggestion on where to post an 85MB build.log file?
(ok I'll take the hint and post a few lines before and after any instance of "error:" in build.log.)

Look at the following post. This one seems not to publish properly so I deleted it.



deleted


Last edited by jagdpanther on Fri Sep 14, 2018 8:25 pm; edited 1 time in total
Back to top
View user's profile Send private message
jagdpanther
Guru
Guru


Joined: 22 Nov 2003
Posts: 476

PostPosted: Fri Sep 14, 2018 8:23 pm    Post subject: Reply with quote

Let me try that build.log search for "error:" by hand:

Code:
  [853/16903] python ../../mojo/public/tools/bindings/mojom_bindings_generator.py parse --filelist=__extensions_common_api_mojom__parser___build_toolchain_linux_unbundle_default__rule..rsp -o gen -d ../../ --enable_feature is_posix --enable_feature is_linux
[854/16903] python ../../chrome/test/chromedriver/embed_version_in_cpp.py --chromedriver-version-file ../../chrome/test/chromedriver/VERSION --chrome-version-file ../../chrome/VERSION --directory gen/chrome/test/chromedriver
ERROR:root:Git error: rc=128, output=''
[855/16903] touch obj/chrome/test/chromedriver/embed_version_in_cpp.stamp
[856/16903] touch obj/extensions/common/api/mojom__parser.stamp
[857/16903] python ../../chrome/test/chromedriver/embed_js_in_cpp.py --directory gen/chrome/test/chromedriver/chrome ../../chrome/test/chromedriver/js/call_function.js ../../chrome/test/chromedriver/js/dispatch_touch_event.js ../../chrome/test/chromedriver/js/execute_async_script.js ../../chrome/test/chromedriver/js/focus.js ../../chrome/test/chromedriver/js/get_element_region.js ../../chrome/test/chromedriver/js/is_option_element_toggleable.js
[858/16903] touch obj/chrome/test/chromedriver/embed_js_in_cpp.stamp


Code:
  [3231/16894] python ../../mojo/public/tools/bindings/generate_type_mappings.py --output gen/services/identity/public/mojom/mojom__type_mappings --dependency gen/services/identity/public/mojom/constants__type_mappings --dependency gen/mojo/public/mojom/base/base__type_mappings --dependency gen/url/mojom/url_mojom_gurl__type_mappings --start-typemap public_headers=//components/signin/core/browser/account_info.h traits_headers=//services/identity/public/cpp/account_info_mojom_traits.h type_mappings=identity.mojom.AccountInfo=::AccountInfo --start-typemap public_headers=//services/identity/public/cpp/account_state.h traits_headers=//services/identity/public/cpp/account_state_mojom_traits.h type_mappings=identity.mojom.AccountState=identity::AccountState --start-typemap public_headers=//google_apis/gaia/google_service_auth_error.h traits_headers=//services/identity/public/cpp/google_service_auth_error_mojom_traits.h type_mappings=identity.mojom.Captcha=::GoogleServiceAuthError::Captcha type_mappings=identity.mojom.SecondFactor=::GoogleServiceAuthError::SecondFactor type_mappings=identity.mojom.GoogleServiceAuthError=::GoogleServiceAuthError --start-typemap public_headers=//services/identity/public/cpp/scope_set.h traits_headers=//services/identity/public/cpp/scope_set_mojom_traits.h type_mappings=identity.mojom.ScopeSet=::identity::ScopeSet
[3232/16894] touch obj/services/file/public/mojom/mojom__generate_message_ids.stamp
[3233/16894] touch obj/services/identity/public/mojom/mojom__type_mappings.stamp
[3234/16894] touch obj/services/metrics/manifest.stamp
[3235/16894] python ../../services/service_manager/public/tools/manifest/manifest_collator.py --parent=../../services/network/manifest.json --output=gen/services/network/manifest.json --name network


Code:
  [3491/16894] python ../../mojo/public/tools/bindings/generate_type_mappings.py --output gen/content/common/mojo_bindings__type_mappings --dependency gen/components/services/leveldb/public/interfaces/interfaces__type_mappings --dependency gen/content/public/common/interfaces__type_mappings --dependency gen/content/public/common/resource_type_bindings__type_mappings --dependency gen/ipc/mojom_constants__type_mappings --dependency gen/media/mojo/interfaces/interfaces__type_mappings --dependency gen/mojo/public/mojom/base/base__type_mappings --dependency gen/services/network/public/mojom/mojom__type_mappings --dependency gen/services/service_manager/public/mojom/mojom__type_mappings --dependency gen/services/ui/public/interfaces/interfaces__type_mappings --dependency gen/services/ui/public/interfaces/ime/ime__type_mappings --dependency gen/services/video_capture/public/mojom/mojom__type_mappings --dependency gen/services/viz/public/interfaces/interfaces__type_mappings --dependency gen/skia/public/interfaces/interfaces__type_mappings --dependency gen/third_party/blink/public/mojo_bindings__type_mappings --dependency gen/third_party/blink/public/web_feature_mojo_bindings__type_mappings --dependency gen/third_party/blink/public/mojom/mojom_core__type_mappings --dependency gen/ui/base/mojo/mojo__type_mappings --dependency gen/ui/events/mojo/interfaces__type_mappings --dependency gen/ui/gfx/geometry/mojo/mojo__type_mappings --dependency gen/ui/gfx/mojo/mojo__type_mappings --dependency gen/ui/gfx/range/mojo/mojo__type_mappings --dependency gen/ui/latency/mojo/interfaces__type_mappings --dependency gen/url/mojom/url_mojom_gurl__type_mappings --dependency gen/url/mojom/url_mojom_origin__type_mappings --start-typemap public_headers=//content/common/navigation_params.h traits_headers=//content/common/frame_messages.h type_mappings=content.mojom.CommonNavigationParams=content::CommonNavigationParams type_mappings=content.mojom.RequestNavigationParams=content::RequestNavigationParams --start-typemap public_headers=//content/common/frame_messages_forward.h traits_headers=//content/common/frame_messages.h type_mappings=content.mojom.DidCommitProvisionalLoadParams=std::unique_ptr\<::FrameHostMsg_DidCommitProvisionalLoad_Params\>\[move_only,nullable_is_same_type\] --start-typemap public_headers=//content/common/indexed_db/indexed_db_key.h public_headers=//content/common/indexed_db/indexed_db_key_path.h public_headers=//content/common/indexed_db/indexed_db_key_range.h public_headers=//content/common/indexed_db/indexed_db_metadata.h public_headers=//third_party/blink/public/platform/modules/indexeddb/web_idb_types.h traits_headers=//content/common/indexed_db/indexed_db_struct_traits.h type_mappings=indexed_db.mojom.CursorDirection=blink::WebIDBCursorDirection type_mappings=indexed_db.mojom.DatabaseMetadata=content::IndexedDBDatabaseMetadata type_mappings=indexed_db.mojom.DataLoss=blink::WebIDBDataLoss type_mappings=indexed_db.mojom.IndexKeys=content::IndexedDBIndexKeys type_mappings=indexed_db.mojom.IndexMetadata=content::IndexedDBIndexMetadata type_mappings=indexed_db.mojom.Key=content::IndexedDBKey type_mappings=indexed_db.mojom.KeyPath=content::IndexedDBKeyPath type_mappings=indexed_db.mojom.KeyRange=content::IndexedDBKeyRange type_mappings=indexed_db.mojom.ObjectStoreMetadata=content::IndexedDBObjectStoreMetadata type_mappings=indexed_db.mojom.OperationType=blink::WebIDBOperationType type_mappings=indexed_db.mojom.PutMode=blink::WebIDBPutMode type_mappings=indexed_db.mojom.TaskType=blink::WebIDBTaskType type_mappings=indexed_db.mojom.TransactionMode=blink::WebIDBTransactionMode --start-typemap public_headers=//content/common/input/sync_compositor_messages.h traits_headers=//content/common/input/sync_compositor_messages.h type_mappings=content.mojom.SyncCompositorDemandDrawHwParams=content::SyncCompositorDemandDrawHwParams type_mappings=content.mojom.SyncCompositorSetSharedMemoryParams=content::SyncCompositorSetSharedMemoryParams type_mappings=content.mojom.SyncCompositorDemandDrawSwParams=content::SyncCompositorDemandDrawSwParams type_mappings=content.mojom.SyncCompositorCommonRendererParams=content::SyncCompositorCommonRendererParams --start-typemap public_headers=//content/common/media/media_stream_controls.h public_headers=//content/public/common/media_stream_request.h traits_headers=//content/common/media/media_stream_param_traits.h traits_headers=//content/common/media/media_stream_typemap_traits.h type_mappings=content.mojom.MediaStreamDevice=content::MediaStreamDevice type_mappings=content.mojom.MediaStreamRequestResult=content::MediaStreamRequestResult type_mappings=content.mojom.MediaStreamType=content::MediaStreamType type_mappings=content.mojom.StreamControls=content::StreamControls type_mappings=content.mojom.TrackControls=content::TrackControls --start-typemap public_headers=//cc/input/touch_action.h public_headers=//content/common/edit_command.h public_headers=//content/common/frame_owner_properties.h public_headers=//content/common/frame_replication_state.h public_headers=//content/common/input/input_event.h public_headers=//content/common/visual_properties.h public_headers=//content/public/common/input_event_ack_source.h public_headers=//content/public/common/input_event_ack_state.h public_headers=//content/common/cursors/webcursor.h public_headers=//content/common/input/synthetic_pinch_gesture_params.h public_headers=//content/common/input/synthetic_pointer_action_list_params.h public_headers=//content/common/input/synthetic_smooth_drag_gesture_params.h public_headers=//content/common/input/synthetic_smooth_scroll_gesture_params.h public_headers=//content/common/input/synthetic_tap_gesture_params.h public_headers=//content/public/common/renderer_preferences.h public_headers=//content/public/common/web_preferences.h public_headers=//net/base/network_change_notifier.h public_headers=//third_party/blink/public/platform/web_gesture_device.h public_headers=//third_party/blink/public/platform/web_gesture_event.h public_headers=//third_party/blink/public/platform/web_input_event.h public_headers=//third_party/blink/public/platform/web_mouse_wheel_event.h public_headers=//third_party/blink/public/platform/web_pointer_properties.h public_headers=//third_party/blink/public/platform/web_touch_point.h public_headers=//third_party/blink/public/web/web_popup_type.h public_headers=//ui/events/blink/did_overscroll_params.h public_headers=//ui/events/blink/web_input_event_traits.h public_headers=//ui/latency/ipc/latency_info_param_traits.h traits_headers=//content/common/frame_messages.h traits_headers=//content/common/input_messages.h traits_headers=//content/common/input/input_event_struct_traits.h traits_headers=//content/common/input/touch_action_optional_struct_traits.h traits_headers=//content/common/view_messages.h traits_headers=//content/public/common/common_param_traits.h type_mappings=content.mojom.Button=blink::WebPointerProperties::Button type_mappings=content.mojom.Cancelability=blink::WebInputEvent::DispatchType type_mappings=content.mojom.EditCommand=content::EditCommand type_mappings=content.mojom.Event=std::unique_ptr\<content::InputEvent\>\[move_only\] type_mappings=content.mojom.EventType=blink::WebInputEvent::Type type_mappings=content.mojom.FrameOwnerProperties=content::FrameOwnerProperties type_mappings=content.mojom.FrameReplicationState=content::FrameReplicationState type_mappings=content.mojom.GestureDevice=blink::WebGestureDevice type_mappings=content.mojom.InertialPhaseState=blink::WebGestureEvent::InertialPhaseState type_mappings=content.mojom.InputEventAckSource=content::InputEventAckSource type_mappings=content.mojom.InputEventAckState=content::InputEventAckState type_mappings=content.mojom.NetworkConnectionType=net::NetworkChangeNotifier::ConnectionType type_mappings=content.mojom.DidOverscrollParams=ui::DidOverscrollParams type_mappings=content.mojom.PointerType=blink::WebPointerProperties::PointerType type_mappings=content.mojom.RendererPreferences=content::RendererPreferences type_mappings=content.mojom.VisualProperties=content::VisualProperties type_mappings=content.mojom.ScrollUnits=blink::WebGestureEvent::ScrollUnits type_mappings=content.mojom.SyntheticSmoothDrag=content::SyntheticSmoothDragGestureParams type_mappings=content.mojom.SyntheticSmoothScroll=content::SyntheticSmoothScrollGestureParams type_mappings=content.mojom.SyntheticPinch=content::SyntheticPinchGestureParams type_mappings=content.mojom.SyntheticTap=content::SyntheticTapGestureParams type_mappings=content.mojom.SyntheticPointerAction=content::SyntheticPointerActionListParams type_mappings=content.mojom.TouchAction=cc::TouchAction type_mappings=content.mojom.TouchActionOptional=cc::TouchAction type_mappings=content.mojom.TouchState=blink::WebTouchPoint::State type_mappings=content.mojom.WebCursor=content::WebCursor type_mappings=content.mojom.WebPopupType=blink::WebPopupType type_mappings=content.mojom.WebPreferences=content::WebPreferences --start-typemap public_headers=//content/public/common/web_preferences.h traits_headers=//content/public/common/common_param_traits_macros.h type_mappings=content.mojom.V8CacheOptions=content::V8CacheOptions type_mappings=content.mojom.WebPreferences=content::WebPreferences --start-typemap public_headers=//third_party/blink/public/platform/web_mixed_content_context_type.h traits_headers=//content/common/resource_messages.h type_mappings=content.mojom.MixedContentContextType=::blink::WebMixedContentContextType --start-typemap public_headers=//content/public/common/push_subscription_options.h public_headers=//third_party/blink/public/platform/modules/push_messaging/web_push_error.h traits_headers=//content/common/push_messaging_param_traits.h type_mappings=content.mojom.PushErrorType=blink::WebPushError::ErrorType type_mappings=content.mojom.PushSubscriptionOptions=content::PushSubscriptionOptions --start-typemap public_headers=//cc/trees/render_frame_metadata.h traits_headers=//content/common/render_frame_metadata_struct_traits.h type_mappings=content.mojom.RenderFrameMetadata=cc::RenderFrameMetadata --start-typemap public_headers=//content/common/background_fetch/background_fetch_types.h public_headers=//third_party/blink/public/common/service_worker/service_worker_status_code.h public_headers=//content/common/service_worker/service_worker_types.h public_headers=//content/public/common/platform_notification_data.h public_headers=//content/public/common/push_event_payload.h traits_headers=//content/common/platform_notification_param_traits.h traits_headers=//content/common/service_worker/service_worker_messages.h type_mappings=content.mojom.ExtendableMessageEventSource=::content::ExtendableMessageEventSource type_mappings=content.mojom.PlatformNotificationData=::content::PlatformNotificationData type_mappings=content.mojom.PushEventPayload=::content::PushEventPayload type_mappings=content.mojom.ServiceWorkerFetchRequest=::content::ServiceWorkerFetchRequest type_mappings=content.mojom.ServiceWorkerResponse=::content::ServiceWorkerResponse --start-typemap public_headers=//content/common/url_loader_factory_bundle.h traits_headers=//content/common/url_loader_factory_bundle_struct_traits.h type_mappings=content.mojom.URLLoaderFactoryBundle=std::unique_ptr\<content::URLLoaderFactoryBundleInfo\>\[move_only,nullable_is_same_type\]
[3492/16894] python ../../mojo/public/tools/bindings/generate_type_mappings.py --output gen/services/viz/privileged/interfaces/gl/gl__type_mappings --dependency gen/components/arc/common/media__type_mappings --dependency gen/gpu/ipc/common/interfaces__type_mappings --dependency gen/media/mojo/interfaces/interfaces__type_mappings --dependency gen/ui/gfx/geometry/mojo/mojo__type_mappings --dependency gen/ui/gfx/mojo/mojo__type_mappings --dependency gen/url/mojom/url_mojom_gurl__type_mappings --start-typemap public_headers=//gpu/command_buffer/common/constants.h traits_headers=//services/viz/privileged/cpp/context_lost_reason_traits.h type_mappings=viz.mojom.ContextLostReason=gpu::error::ContextLostReason
[3493/16894] touch obj/content/common/mojo_bindings__type_mappings.stamp
[3494/16894] python ../../mojo/public/tools/bindings/mojom_bindings_generator.py parse --filelist=__services_video_capture_public_mojom_constants__parser___build_toolchain_linux_unbundle_default__rule..rsp -o gen -d ../../ --enable_feature is_posix --enable_feature is_linux
[3495/16894] touch obj/services/ui/public/interfaces/input_devices/input_devices__parser.stamp
[3496/16894] touch obj/services/viz/privileged/interfaces/gl/gl__type_mappings.stamp


I guess this is the important one:

Code:
 
[15426/16588] x86_64-pc-linux-gnu-clang++ -MMD -MF obj/chrome/browser/ui/ui/tab.o.d -DV8_DEPRECATION_WARNINGS -DUSE_UDEV -DUSE_AURA=1 -DUSE_GLIB=1 -DUSE_NSS_CERTS=1 -DUSE_X11=1 -DNO_TCMALLOC -DFULL_SAFE_BROWSING -DSAFE_BROWSING_CSD -DSAFE_BROWSING_DB_LOCAL -DCHROMIUM_BUILD -D_FILE_OFFSET_BITS=64 -D_LARGEFILE_SOURCE -D_LARGEFILE64_SOURCE -D__STDC_CONSTANT_MACROS -D__STDC_FORMAT_MACROS -DNDEBUG -DNVALGRIND -DDYNAMIC_ANNOTATIONS_ENABLED=0 -DUSE_CUPS -DUSE_GIO -DGLIB_VERSION_MAX_ALLOWED=GLIB_VERSION_2_32 -DGLIB_VERSION_MIN_REQUIRED=GLIB_VERSION_2_26 -DENABLE_IPC_FUZZER -DTOOLKIT_VIEWS=1 -DGL_GLEXT_PROTOTYPES -DUSE_GLX -DUSE_EGL -DVK_NO_PROTOTYPES -DEXPAT_RELATIVE_PATH -DGOOGLE_PROTOBUF_NO_RTTI -DGOOGLE_PROTOBUF_NO_STATIC_INITIALIZER -DHAVE_PTHREAD -DLEVELDB_PLATFORM_CHROMIUM=1 -DU_USING_ICU_NAMESPACE=0 -DU_ENABLE_DYLOAD=0 -DU_STATIC_IMPLEMENTATION -DICU_UTIL_DATA_IMPL=ICU_UTIL_DATA_FILE -DUCHAR_TYPE=uint16_t -DV8_USE_EXTERNAL_STARTUP_DATA -DSK_IGNORE_LINEONLY_AA_CONVEX_PATH_OPTS -DSK_HAS_PNG_LIBRARY -DSK_HAS_WEBP_LIBRARY -DSK_HAS_JPEG_LIBRARY -DSK_VULKAN_HEADER=\"../../skia/config/SkVulkanConfig.h\" -DSK_VULKAN=1 -DSK_SUPPORT_GPU=1 -DSK_GPU_WORKAROUNDS_HEADER=\"gpu/config/gpu_driver_bug_workaround_autogen.h\" -DVK_NO_PROTOTYPES -DWEBRTC_NON_STATIC_TRACE_EVENT_HANDLERS=0 -DGTEST_RELATIVE_PATH -DWEBRTC_CHROMIUM_BUILD -DWEBRTC_POSIX -DWEBRTC_LINUX -DABSL_ALLOCATOR_NOTHROW=1 -DNO_MAIN_THREAD_WRAPPING -DI18N_ADDRESS_VALIDATION_DATA_URL=\"https://chromium-i18n.appspot.com/ssl-aggregate-address/\" -DUSE_SYSTEM_ZLIB=1 -I../.. -Igen -Igen/shim_headers/zlib_shim -Igen/shim_headers/re2_shim -Igen/shim_headers/snappy_shim -Igen/shim_headers/libpng_shim -Igen/shim_headers/libwebp_shim -Igen/shim_headers/libdrm_shim -I../../third_party/khronos -I../../gpu -I../../third_party/libyuv/include -I../../third_party/vulkan/include -Igen/shim_headers/openh264_shim -Igen/shim_headers/minizip_shim -Igen/shim_headers/flac_shim -I../../third_party/webrtc_overrides -I../../testing/gtest/include -I../../third_party/libyuv/include -I../../third_party/usrsctp/usrsctplib -I../../third_party/webrtc -I../../third_party/protobuf/src -Igen/protoc_out -I../../third_party/protobuf/src -I../../third_party/boringssl/src/include -I../../third_party/leveldatabase -I../../third_party/leveldatabase/src -I../../third_party/leveldatabase/src/include -I../../third_party/ced/src -I../../third_party/icu/source/common -I../../third_party/icu/source/i18n -I../../skia/config -I../../skia/ext -I../../third_party/skia/include/c -I../../third_party/skia/include/config -I../../third_party/skia/include/core -I../../third_party/skia/include/effects -I../../third_party/skia/include/encode -I../../third_party/skia/include/gpu -I../../third_party/skia/include/images -I../../third_party/skia/include/lazy -I../../third_party/skia/include/pathops -I../../third_party/skia/include/pdf -I../../third_party/skia/include/pipe -I../../third_party/skia/include/ports -I../../third_party/skia/include/utils -I../../third_party/vulkan/include -I../../third_party/skia/third_party/vulkanmemoryallocator -I../../third_party/skia/src/gpu -I../../third_party/skia/src/sksl -I../../third_party/vulkan/include -I../../third_party/libwebm/source -I../../v8/include -Igen/v8/include -I../../third_party/webrtc_overrides -I../../third_party/webrtc -I../../third_party/perfetto/include -Igen/third_party/perfetto/protos -Igen/third_party/perfetto/protos -Igen/third_party/perfetto/protos -Igen/third_party/metrics_proto -I../../third_party/mesa/src/include -Igen -Igen -I../../third_party/libaddressinput/src/cpp/include -I../../third_party/cacheinvalidation/overrides -I../../third_party/cacheinvalidation/src -I../../third_party/flatbuffers/src/include -I../../third_party/brotli/include -I../../third_party/webrtc_overrides -I../../testing/gtest/include -I../../third_party/webrtc -Igen -Igen -fno-strict-aliasing --param=ssp-buffer-size=4 -fstack-protector -Wno-builtin-macro-redefined -D__DATE__= -D__TIME__= -D__TIMESTAMP__= -funwind-tables -fPIC -pthread -fcolor-diagnostics -fmerge-all-constants -no-canonical-prefixes -Wall -Wextra -Wimplicit-fallthrough -Wthread-safety -Wno-missing-field-initializers -Wno-unused-parameter -Wno-c++11-narrowing -Wno-covered-switch-default -Wno-unneeded-internal-declaration -Wno-undefined-var-template -Wno-address-of-packed-member -Wno-nonportable-include-path -Wno-user-defined-warnings -Wno-unused-lambda-capture -Wno-null-pointer-arithmetic -Wno-enum-compare-switch -fno-omit-frame-pointer -fvisibility=hidden -Wheader-hygiene -Wstring-conversion -Wtautological-overlap-compare -Wno-nonnull -Wexit-time-destructors -isystem../../../../../../../../../usr/include/glib-2.0 -isystem../../../../../../../../../usr/lib64/glib-2.0/include -isystem../../../../../../../../../usr/include/glib-2.0 -isystem../../../../../../../../../usr/lib64/glib-2.0/include -Wno-header-guard -isystem../../../../../../../../../usr/include/nss -isystem../../../../../../../../../usr/include/nspr -isystem ../../third_party/abseil-cpp -Wno-exit-time-destructors -isystem../../../../../../../../../usr/include/dbus-1.0 -isystem../../../../../../../../../usr/lib64/dbus-1.0/include -std=gnu++14 -fno-exceptions -fno-rtti -fvisibility-inlines-hidden -march=native -O2 -pipe -c ../../chrome/browser/ui/views/tabs/tab.cc -o obj/chrome/browser/ui/ui/tab.o
FAILED: obj/chrome/browser/ui/ui/tab.o
x86_64-pc-linux-gnu-clang++ -MMD -MF obj/chrome/browser/ui/ui/tab.o.d -DV8_DEPRECATION_WARNINGS -DUSE_UDEV -DUSE_AURA=1 -DUSE_GLIB=1 -DUSE_NSS_CERTS=1 -DUSE_X11=1 -DNO_TCMALLOC -DFULL_SAFE_BROWSING -DSAFE_BROWSING_CSD -DSAFE_BROWSING_DB_LOCAL -DCHROMIUM_BUILD -D_FILE_OFFSET_BITS=64 -D_LARGEFILE_SOURCE -D_LARGEFILE64_SOURCE -D__STDC_CONSTANT_MACROS -D__STDC_FORMAT_MACROS -DNDEBUG -DNVALGRIND -DDYNAMIC_ANNOTATIONS_ENABLED=0 -DUSE_CUPS -DUSE_GIO -DGLIB_VERSION_MAX_ALLOWED=GLIB_VERSION_2_32 -DGLIB_VERSION_MIN_REQUIRED=GLIB_VERSION_2_26 -DENABLE_IPC_FUZZER -DTOOLKIT_VIEWS=1 -DGL_GLEXT_PROTOTYPES -DUSE_GLX -DUSE_EGL -DVK_NO_PROTOTYPES -DEXPAT_RELATIVE_PATH -DGOOGLE_PROTOBUF_NO_RTTI -DGOOGLE_PROTOBUF_NO_STATIC_INITIALIZER -DHAVE_PTHREAD -DLEVELDB_PLATFORM_CHROMIUM=1 -DU_USING_ICU_NAMESPACE=0 -DU_ENABLE_DYLOAD=0 -DU_STATIC_IMPLEMENTATION -DICU_UTIL_DATA_IMPL=ICU_UTIL_DATA_FILE -DUCHAR_TYPE=uint16_t -DV8_USE_EXTERNAL_STARTUP_DATA -DSK_IGNORE_LINEONLY_AA_CONVEX_PATH_OPTS -DSK_HAS_PNG_LIBRARY -DSK_HAS_WEBP_LIBRARY -DSK_HAS_JPEG_LIBRARY -DSK_VULKAN_HEADER=\"../../skia/config/SkVulkanConfig.h\" -DSK_VULKAN=1 -DSK_SUPPORT_GPU=1 -DSK_GPU_WORKAROUNDS_HEADER=\"gpu/config/gpu_driver_bug_workaround_autogen.h\" -DVK_NO_PROTOTYPES -DWEBRTC_NON_STATIC_TRACE_EVENT_HANDLERS=0 -DGTEST_RELATIVE_PATH -DWEBRTC_CHROMIUM_BUILD -DWEBRTC_POSIX -DWEBRTC_LINUX -DABSL_ALLOCATOR_NOTHROW=1 -DNO_MAIN_THREAD_WRAPPING -DI18N_ADDRESS_VALIDATION_DATA_URL=\"https://chromium-i18n.appspot.com/ssl-aggregate-address/\" -DUSE_SYSTEM_ZLIB=1 -I../.. -Igen -Igen/shim_headers/zlib_shim -Igen/shim_headers/re2_shim -Igen/shim_headers/snappy_shim -Igen/shim_headers/libpng_shim -Igen/shim_headers/libwebp_shim -Igen/shim_headers/libdrm_shim -I../../third_party/khronos -I../../gpu -I../../third_party/libyuv/include -I../../third_party/vulkan/include -Igen/shim_headers/openh264_shim -Igen/shim_headers/minizip_shim -Igen/shim_headers/flac_shim -I../../third_party/webrtc_overrides -I../../testing/gtest/include -I../../third_party/libyuv/include -I../../third_party/usrsctp/usrsctplib -I../../third_party/webrtc -I../../third_party/protobuf/src -Igen/protoc_out -I../../third_party/protobuf/src -I../../third_party/boringssl/src/include -I../../third_party/leveldatabase -I../../third_party/leveldatabase/src -I../../third_party/leveldatabase/src/include -I../../third_party/ced/src -I../../third_party/icu/source/common -I../../third_party/icu/source/i18n -I../../skia/config -I../../skia/ext -I../../third_party/skia/include/c -I../../third_party/skia/include/config -I../../third_party/skia/include/core -I../../third_party/skia/include/effects -I../../third_party/skia/include/encode -I../../third_party/skia/include/gpu -I../../third_party/skia/include/images -I../../third_party/skia/include/lazy -I../../third_party/skia/include/pathops -I../../third_party/skia/include/pdf -I../../third_party/skia/include/pipe -I../../third_party/skia/include/ports -I../../third_party/skia/include/utils -I../../third_party/vulkan/include -I../../third_party/skia/third_party/vulkanmemoryallocator -I../../third_party/skia/src/gpu -I../../third_party/skia/src/sksl -I../../third_party/vulkan/include -I../../third_party/libwebm/source -I../../v8/include -Igen/v8/include -I../../third_party/webrtc_overrides -I../../third_party/webrtc -I../../third_party/perfetto/include -Igen/third_party/perfetto/protos -Igen/third_party/perfetto/protos -Igen/third_party/perfetto/protos -Igen/third_party/metrics_proto -I../../third_party/mesa/src/include -Igen -Igen -I../../third_party/libaddressinput/src/cpp/include -I../../third_party/cacheinvalidation/overrides -I../../third_party/cacheinvalidation/src -I../../third_party/flatbuffers/src/include -I../../third_party/brotli/include -I../../third_party/webrtc_overrides -I../../testing/gtest/include -I../../third_party/webrtc -Igen -Igen -fno-strict-aliasing --param=ssp-buffer-size=4 -fstack-protector -Wno-builtin-macro-redefined -D__DATE__= -D__TIME__= -D__TIMESTAMP__= -funwind-tables -fPIC -pthread -fcolor-diagnostics -fmerge-all-constants -no-canonical-prefixes -Wall -Wextra -Wimplicit-fallthrough -Wthread-safety -Wno-missing-field-initializers -Wno-unused-parameter -Wno-c++11-narrowing -Wno-covered-switch-default -Wno-unneeded-internal-declaration -Wno-undefined-var-template -Wno-address-of-packed-member -Wno-nonportable-include-path -Wno-user-defined-warnings -Wno-unused-lambda-capture -Wno-null-pointer-arithmetic -Wno-enum-compare-switch -fno-omit-frame-pointer -fvisibility=hidden -Wheader-hygiene -Wstring-conversion -Wtautological-overlap-compare -Wno-nonnull -Wexit-time-destructors -isystem../../../../../../../../../usr/include/glib-2.0 -isystem../../../../../../../../../usr/lib64/glib-2.0/include -isystem../../../../../../../../../usr/include/glib-2.0 -isystem../../../../../../../../../usr/lib64/glib-2.0/include -Wno-header-guard -isystem../../../../../../../../../usr/include/nss -isystem../../../../../../../../../usr/include/nspr -isystem ../../third_party/abseil-cpp -Wno-exit-time-destructors -isystem../../../../../../../../../usr/include/dbus-1.0 -isystem../../../../../../../../../usr/lib64/dbus-1.0/include -std=gnu++14 -fno-exceptions -fno-rtti -fvisibility-inlines-hidden -march=native -O2 -pipe -c ../../chrome/browser/ui/views/tabs/tab.cc -o obj/chrome/browser/ui/ui/tab.o
fatal error: error in backend: Unable to copy EFLAGS physical register!
x86_64-pc-linux-gnu-clang++: error: clang frontend command failed with exit code 70 (use -v to see invocation)
clang version 6.0.1 (tags/RELEASE_601/final)
Target: x86_64-pc-linux-gnu
Thread model: posix
InstalledDir: /usr/lib/llvm/6/bin



Code:

[15453/16588] x86_64-pc-linux-gnu-clang++ -MMD -MF obj/chrome/browser/ui/ui/ime_window.o.d -DV8_DEPRECATION_WARNINGS -DUSE_UDEV -DUSE_AURA=1 -DUSE_GLIB=1 -DUSE_NSS_CERTS=1 -DUSE_X11=1 -DNO_TCMALLOC -DFULL_SAFE_BROWSING -DSAFE_BROWSING_CSD -DSAFE_BROWSING_DB_LOCAL -DCHROMIUM_BUILD -D_FILE_OFFSET_BITS=64 -D_LARGEFILE_SOURCE -D_LARGEFILE64_SOURCE -D__STDC_CONSTANT_MACROS -D__STDC_FORMAT_MACROS -DNDEBUG -DNVALGRIND -DDYNAMIC_ANNOTATIONS_ENABLED=0 -DUSE_CUPS -DUSE_GIO -DGLIB_VERSION_MAX_ALLOWED=GLIB_VERSION_2_32 -DGLIB_VERSION_MIN_REQUIRED=GLIB_VERSION_2_26 -DENABLE_IPC_FUZZER -DTOOLKIT_VIEWS=1 -DGL_GLEXT_PROTOTYPES -DUSE_GLX -DUSE_EGL -DVK_NO_PROTOTYPES -DEXPAT_RELATIVE_PATH -DGOOGLE_PROTOBUF_NO_RTTI -DGOOGLE_PROTOBUF_NO_STATIC_INITIALIZER -DHAVE_PTHREAD -DLEVELDB_PLATFORM_CHROMIUM=1 -DU_USING_ICU_NAMESPACE=0 -DU_ENABLE_DYLOAD=0 -DU_STATIC_IMPLEMENTATION -DICU_UTIL_DATA_IMPL=ICU_UTIL_DATA_FILE -DUCHAR_TYPE=uint16_t -DV8_USE_EXTERNAL_STARTUP_DATA -DSK_IGNORE_LINEONLY_AA_CONVEX_PATH_OPTS -DSK_HAS_PNG_LIBRARY -DSK_HAS_WEBP_LIBRARY -DSK_HAS_JPEG_LIBRARY -DSK_VULKAN_HEADER=\"../../skia/config/SkVulkanConfig.h\" -DSK_VULKAN=1 -DSK_SUPPORT_GPU=1 -DSK_GPU_WORKAROUNDS_HEADER=\"gpu/config/gpu_driver_bug_workaround_autogen.h\" -DVK_NO_PROTOTYPES -DWEBRTC_NON_STATIC_TRACE_EVENT_HANDLERS=0 -DGTEST_RELATIVE_PATH -DWEBRTC_CHROMIUM_BUILD -DWEBRTC_POSIX -DWEBRTC_LINUX -DABSL_ALLOCATOR_NOTHROW=1 -DNO_MAIN_THREAD_WRAPPING -DI18N_ADDRESS_VALIDATION_DATA_URL=\"https://chromium-i18n.appspot.com/ssl-aggregate-address/\" -DUSE_SYSTEM_ZLIB=1 -I../.. -Igen -Igen/shim_headers/zlib_shim -Igen/shim_headers/re2_shim -Igen/shim_headers/snappy_shim -Igen/shim_headers/libpng_shim -Igen/shim_headers/libwebp_shim -Igen/shim_headers/libdrm_shim -I../../third_party/khronos -I../../gpu -I../../third_party/libyuv/include -I../../third_party/vulkan/include -Igen/shim_headers/openh264_shim -Igen/shim_headers/minizip_shim -Igen/shim_headers/flac_shim -I../../third_party/webrtc_overrides -I../../testing/gtest/include -I../../third_party/libyuv/include -I../../third_party/usrsctp/usrsctplib -I../../third_party/webrtc -I../../third_party/protobuf/src -Igen/protoc_out -I../../third_party/protobuf/src -I../../third_party/boringssl/src/include -I../../third_party/leveldatabase -I../../third_party/leveldatabase/src -I../../third_party/leveldatabase/src/include -I../../third_party/ced/src -I../../third_party/icu/source/common -I../../third_party/icu/source/i18n -I../../skia/config -I../../skia/ext -I../../third_party/skia/include/c -I../../third_party/skia/include/config -I../../third_party/skia/include/core -I../../third_party/skia/include/effects -I../../third_party/skia/include/encode -I../../third_party/skia/include/gpu -I../../third_party/skia/include/images -I../../third_party/skia/include/lazy -I../../third_party/skia/include/pathops -I../../third_party/skia/include/pdf -I../../third_party/skia/include/pipe -I../../third_party/skia/include/ports -I../../third_party/skia/include/utils -I../../third_party/vulkan/include -I../../third_party/skia/third_party/vulkanmemoryallocator -I../../third_party/skia/src/gpu -I../../third_party/skia/src/sksl -I../../third_party/vulkan/include -I../../third_party/libwebm/source -I../../v8/include -Igen/v8/include -I../../third_party/webrtc_overrides -I../../third_party/webrtc -I../../third_party/perfetto/include -Igen/third_party/perfetto/protos -Igen/third_party/perfetto/protos -Igen/third_party/perfetto/protos -Igen/third_party/metrics_proto -I../../third_party/mesa/src/include -Igen -Igen -I../../third_party/libaddressinput/src/cpp/include -I../../third_party/cacheinvalidation/overrides -I../../third_party/cacheinvalidation/src -I../../third_party/flatbuffers/src/include -I../../third_party/brotli/include -I../../third_party/webrtc_overrides -I../../testing/gtest/include -I../../third_party/webrtc -Igen -Igen -fno-strict-aliasing --param=ssp-buffer-size=4 -fstack-protector -Wno-builtin-macro-redefined -D__DATE__= -D__TIME__= -D__TIMESTAMP__= -funwind-tables -fPIC -pthread -fcolor-diagnostics -fmerge-all-constants -no-canonical-prefixes -Wall -Wextra -Wimplicit-fallthrough -Wthread-safety -Wno-missing-field-initializers -Wno-unused-parameter -Wno-c++11-narrowing -Wno-covered-switch-default -Wno-unneeded-internal-declaration -Wno-undefined-var-template -Wno-address-of-packed-member -Wno-nonportable-include-path -Wno-user-defined-warnings -Wno-unused-lambda-capture -Wno-null-pointer-arithmetic -Wno-enum-compare-switch -fno-omit-frame-pointer -fvisibility=hidden -Wheader-hygiene -Wstring-conversion -Wtautological-overlap-compare -Wno-nonnull -Wexit-time-destructors -isystem../../../../../../../../../usr/include/glib-2.0 -isystem../../../../../../../../../usr/lib64/glib-2.0/include -isystem../../../../../../../../../usr/include/glib-2.0 -isystem../../../../../../../../../usr/lib64/glib-2.0/include -Wno-header-guard -isystem../../../../../../../../../usr/include/nss -isystem../../../../../../../../../usr/include/nspr -isystem ../../third_party/abseil-cpp -Wno-exit-time-destructors -isystem../../../../../../../../../usr/include/dbus-1.0 -isystem../../../../../../../../../usr/lib64/dbus-1.0/include -std=gnu++14 -fno-exceptions -fno-rtti -fvisibility-inlines-hidden -march=native -O2 -pipe -c ../../chrome/browser/ui/ime/ime_window.cc -o obj/chrome/browser/ui/ui/ime_window.o
ninja: build stopped: subcommand failed.
 * ERROR: www-client/chromium-69.0.3497.81::gentoo failed (compile phase):
 *   ninja -v -j28 -l0 -C out/Release chrome chromedriver failed
 *
 * Call stack:
 *     ebuild.sh, line  124:  Called src_compile
Back to top
View user's profile Send private message
jagdpanther
Guru
Guru


Joined: 22 Nov 2003
Posts: 476

PostPosted: Wed Sep 19, 2018 3:48 pm    Post subject: Reply with quote

Same issue with www-client/chromium-69.0.3497.100 (previous parts of this thread were about 69.0.3497.81)

The following line may be the error (see below for build.log lines just before this):
Code:
fatal error: error in backend: Unable to copy EFLAGS physical register!
x86_64-pc-linux-gnu-clang++: error: clang frontend command failed with exit code 70 (use -v to see invocation)
clang version 6.0.1 (tags/RELEASE_601/final)
Target: x86_64-pc-linux-gnu
Thread model: posix




End of emerge:
Code:
[15444/16588] x86_64-pc-linux-gnu-clang++ -MMD -MF obj/chrome/browser/ui/ui/relaunch_recommended_bubble_view.o.d -DV8_DEPRECATION_WARNINGS -DUSE_UDEV -DUSE_AURA=1 -DUSE_GLIB=1 -DUSE_NSS_CERTS=1 -DUSE_X11=1 -DNO_TCMALLOC -DFULL_SAFE_BROWSING -DSAFE_BROWSING_CSD -DSAFE_BROWSING_DB_LOCAL -DCHROMIUM_BUILD -D_FILE_OFFSET_BITS=64 -D_LARGEFILE_SOURCE -D_LARGEFILE64_SOURCE -D__STDC_CONSTANT_MACROS -D__STDC_FORMAT_MACROS -DNDEBUG -DNVALGRIND -DDYNAMIC_ANNOTATIONS_ENABLED=0 -DUSE_CUPS -DUSE_GIO -DGLIB_VERSION_MAX_ALLOWED=GLIB_VERSION_2_32 -DGLIB_VERSION_MIN_REQUIRED=GLIB_VERSION_2_26 -DENABLE_IPC_FUZZER -DTOOLKIT_VIEWS=1 -DGL_GLEXT_PROTOTYPES -DUSE_GLX -DUSE_EGL -DVK_NO_PROTOTYPES -DEXPAT_RELATIVE_PATH -DGOOGLE_PROTOBUF_NO_RTTI -DGOOGLE_PROTOBUF_NO_STATIC_INITIALIZER -DHAVE_PTHREAD -DLEVELDB_PLATFORM_CHROMIUM=1 -DU_USING_ICU_NAMESPACE=0 -DU_ENABLE_DYLOAD=0 -DU_STATIC_IMPLEMENTATION -DICU_UTIL_DATA_IMPL=ICU_UTIL_DATA_FILE -DUCHAR_TYPE=uint16_t -DV8_USE_EXTERNAL_STARTUP_DATA -DSK_IGNORE_LINEONLY_AA_CONVEX_PATH_OPTS -DSK_HAS_PNG_LIBRARY -DSK_HAS_WEBP_LIBRARY -DSK_HAS_JPEG_LIBRARY -DSK_VULKAN_HEADER=\"../../skia/config/SkVulkanConfig.h\" -DSK_VULKAN=1 -DSK_SUPPORT_GPU=1 -DSK_GPU_WORKAROUNDS_HEADER=\"gpu/config/gpu_driver_bug_workaround_autogen.h\" -DVK_NO_PROTOTYPES -DWEBRTC_NON_STATIC_TRACE_EVENT_HANDLERS=0 -DGTEST_RELATIVE_PATH -DWEBRTC_CHROMIUM_BUILD -DWEBRTC_POSIX -DWEBRTC_LINUX -DABSL_ALLOCATOR_NOTHROW=1 -DNO_MAIN_THREAD_WRAPPING -DI18N_ADDRESS_VALIDATION_DATA_URL=\"https://chromium-i18n.appspot.com/ssl-aggregate-address/\" -DUSE_SYSTEM_ZLIB=1 -I../.. -Igen -Igen/shim_headers/zlib_shim -Igen/shim_headers/re2_shim -Igen/shim_headers/snappy_shim -Igen/shim_headers/libpng_shim -Igen/shim_headers/libwebp_shim -Igen/shim_headers/libdrm_shim -I../../third_party/khronos -I../../gpu -I../../third_party/libyuv/include -I../../third_party/vulkan/include -Igen/shim_headers/openh264_shim -Igen/shim_headers/minizip_shim -Igen/shim_headers/flac_shim -I../../third_party/webrtc_overrides -I../../testing/gtest/include -I../../third_party/libyuv/include -I../../third_party/usrsctp/usrsctplib -I../../third_party/webrtc -I../../third_party/protobuf/src -Igen/protoc_out -I../../third_party/protobuf/src -I../../third_party/boringssl/src/include -I../../third_party/leveldatabase -I../../third_party/leveldatabase/src -I../../third_party/leveldatabase/src/include -I../../third_party/ced/src -I../../third_party/icu/source/common -I../../third_party/icu/source/i18n -I../../skia/config -I../../skia/ext -I../../third_party/skia/include/c -I../../third_party/skia/include/config -I../../third_party/skia/include/core -I../../third_party/skia/include/effects -I../../third_party/skia/include/encode -I../../third_party/skia/include/gpu -I../../third_party/skia/include/images -I../../third_party/skia/include/lazy -I../../third_party/skia/include/pathops -I../../third_party/skia/include/pdf -I../../third_party/skia/include/pipe -I../../third_party/skia/include/ports -I../../third_party/skia/include/utils -I../../third_party/vulkan/include -I../../third_party/skia/third_party/vulkanmemoryallocator -I../../third_party/skia/src/gpu -I../../third_party/skia/src/sksl -I../../third_party/vulkan/include -I../../third_party/libwebm/source -I../../v8/include -Igen/v8/include -I../../third_party/webrtc_overrides -I../../third_party/webrtc -I../../third_party/perfetto/include -Igen/third_party/perfetto/protos -Igen/third_party/perfetto/protos -Igen/third_party/perfetto/protos -Igen/third_party/metrics_proto -I../../third_party/mesa/src/include -Igen -Igen -I../../third_party/libaddressinput/src/cpp/include -I../../third_party/cacheinvalidation/overrides -I../../third_party/cacheinvalidation/src -I../../third_party/flatbuffers/src/include -I../../third_party/brotli/include -I../../third_party/webrtc_overrides -I../../testing/gtest/include -I../../third_party/webrtc -Igen -Igen -fno-strict-aliasing --param=ssp-buffer-size=4 -fstack-protector -Wno-builtin-macro-redefined -D__DATE__= -D__TIME__= -D__TIMESTAMP__= -funwind-tables -fPIC -pthread -fcolor-diagnostics -fmerge-all-constants -no-canonical-prefixes -Wall -Wextra -Wimplicit-fallthrough -Wthread-safety -Wno-missing-field-initializers -Wno-unused-parameter -Wno-c++11-narrowing -Wno-covered-switch-default -Wno-unneeded-internal-declaration -Wno-undefined-var-template -Wno-address-of-packed-member -Wno-nonportable-include-path -Wno-user-defined-warnings -Wno-unused-lambda-capture -Wno-null-pointer-arithmetic -Wno-enum-compare-switch -fno-omit-frame-pointer -fvisibility=hidden -Wheader-hygiene -Wstring-conversion -Wtautological-overlap-compare -Wno-nonnull -Wexit-time-destructors -isystem../../../../../../../../../usr/include/glib-2.0 -isystem../../../../../../../../../usr/lib64/glib-2.0/include -isystem../../../../../../../../../usr/include/glib-2.0 -isystem../../../../../../../../../usr/lib64/glib-2.0/include -Wno-header-guard -isystem../../../../../../../../../usr/include/nss -isystem../../../../../../../../../usr/include/nspr -isystem ../../third_party/abseil-cpp -Wno-exit-time-destructors -isystem../../../../../../../../../usr/include/dbus-1.0 -isystem../../../../../../../../../usr/lib64/dbus-1.0/include -std=gnu++14 -fno-exceptions -fno-rtti -fvisibility-inlines-hidden -march=native -O2 -pipe -c ../../chrome/browser/ui/views/relaunch_notification/relaunch_recommended_bubble_view.cc -o obj/chrome/browser/ui/ui/relaunch_recommended_bubble_view.o
ninja: build stopped: subcommand failed.
 * ERROR: www-client/chromium-69.0.3497.100::gentoo failed (compile phase):
 *   ninja -v -j24 -l0 -C out/Release chrome chromedriver failed
 *
 * Call stack:
 *     ebuild.sh, line  124:  Called src_compile
 *   environment, line 4998:  Called eninja '-C' 'out/Release' 'chrome' 'chromedriver'
 *   environment, line 1772:  Called die
 * The specific snippet of code:
 *       "$@" || die "${nonfatal_args[@]}" "${*} failed"




emerge --info =www-client/chromium-69.0.3497.100::gentoo
Code:
Portage 2.3.49 (python 3.6.5-final-0, default/linux/amd64/17.0, gcc-7.3.0, glibc-2.26-r7, 4.18.8-gentoo-01 x86_64)
=================================================================
                         System Settings
=================================================================
System uname: Linux-4.18.8-gentoo-01-x86_64-Intel-R-_Xeon-R-_Gold_6136_CPU_@_3.00GHz-with-gentoo-2.4.1
KiB Mem:    65614584 total,  48534812 free
KiB Swap:   32767992 total,  32767992 free
Timestamp of repository gentoo: Wed, 19 Sep 2018 13:15:01 +0000
Head commit of repository gentoo: ade171d2ed87156f92698c38f7531f2c4f358c94
sh bash 4.4_p12
ld GNU ld (Gentoo 2.30 p2) 2.30.0
app-shells/bash:          4.4_p12::gentoo
dev-java/java-config:     2.2.0-r4::gentoo
dev-lang/perl:            5.24.3-r1::gentoo
dev-lang/python:          2.7.15::gentoo, 3.6.5::gentoo
dev-util/cmake:           3.9.6::gentoo
dev-util/pkgconfig:       0.29.2::gentoo
sys-apps/baselayout:      2.4.1-r2::gentoo
sys-apps/openrc:          0.34.11::gentoo
sys-apps/sandbox:         2.13::gentoo
sys-devel/autoconf:       2.13::gentoo, 2.69-r4::gentoo
sys-devel/automake:       1.11.6-r3::gentoo, 1.15.1-r2::gentoo
sys-devel/binutils:       2.30-r2::gentoo
sys-devel/gcc:            7.3.0-r3::gentoo
sys-devel/gcc-config:     1.8-r1::gentoo
sys-devel/libtool:        2.4.6-r3::gentoo
sys-devel/make:           4.2.1-r4::gentoo
sys-kernel/linux-headers: 4.13::gentoo (virtual/os-headers)
sys-libs/glibc:           2.26-r7::gentoo
Repositories:

gentoo
    location: /usr/portage
    sync-type: rsync
    sync-uri: rsync://rsync.us.gentoo.org/gentoo-portage
    priority: -1000
    sync-rsync-verify-jobs: 1
    sync-rsync-verify-max-age: 24
    sync-rsync-extra-opts:
    sync-rsync-verify-metamanifest: no

vmware
    location: /var/lib/layman/vmware
    masters: gentoo
    priority: 50

ACCEPT_KEYWORDS="amd64"
ACCEPT_LICENSE="*"
CBUILD="x86_64-pc-linux-gnu"
CFLAGS="-march=native -O2 -fomit-frame-pointer -pipe -W -Wall"
CHOST="x86_64-pc-linux-gnu"
CONFIG_PROTECT="/etc /usr/lib64/libreoffice/program/sofficerc /usr/share/config /usr/share/easy-rsa /usr/share/gnupg/qualified.txt /usr/share/themes/oxygen-gtk/gtk-2.0"
CONFIG_PROTECT_MASK="/etc/ca-certificates.conf /etc/dconf /etc/env.d /etc/fonts/fonts.conf /etc/gconf /etc/gentoo-release /etc/revdep-rebuild /etc/sandbox.d /etc/terminfo"
CXXFLAGS="-march=native -O2 -fomit-frame-pointer -pipe"
DISTDIR="/usr/portage/distfiles"
ENV_UNSET="DBUS_SESSION_BUS_ADDRESS DISPLAY PERL5LIB PERL5OPT PERLPREFIX PERL_CORE PERL_MB_OPT PERL_MM_OPT XAUTHORITY XDG_CACHE_HOME XDG_CONFIG_HOME XDG_DATA_HOME XDG_RUNTIME_DIR"
FCFLAGS="-O2 -pipe"
FEATURES="assume-digests binpkg-logs config-protect-if-modified distlocks ebuild-locks fixlafiles merge-sync multilib-strict news parallel-fetch preserve-libs protect-owned sandbox sfperms strict unknown-features-warn unmerge-logs unmerge-orphans userfetch userpriv usersandbox usersync"
FFLAGS="-O2 -pipe"
GENTOO_MIRRORS="http://mirrors.rit.edu/gentoo/ http://gentoo.mirrors.pair.com/ ftp://mirrors.tera-byte.com/pub/gentoo ftp://cosmos.illinois.edu/pub/gentoo/ ftp://mirrors.rit.edu/gentoo/"
LANG="en_US"
LDFLAGS="-Wl,-O1 -Wl,--as-needed"
MAKEOPTS="-j24"
PKGDIR="/usr/portage/packages"
PORTAGE_CONFIGROOT="/"
PORTAGE_RSYNC_OPTS="--recursive --links --safe-links --perms --times --omit-dir-times --compress --force --whole-file --delete --stats --human-readable --timeout=180 --exclude=/distfiles --exclude=/local --exclude=/packages --exclude=/.git"
PORTAGE_TMPDIR="/tmp"
USE="X Xaw3d a52 aac acl acpi alsa amd64 apache2 audiofile bash-completion bcmath berkdb bzip2 cairo caps cdparanoia cdr clamav cli cracklib crypt ctype cups cxx dbus dga directfb dri dts dv dvd dvdr encode esd ffmpeg fftw flac foomaticdb fortran gcj gd gdbm gif glut gnutls gphoto2 gpm gtk iconv imagemagick imap imlib ipv6 jpeg libtirpc lm_sensors lzma lzo mad mikmod mjpeg mng modules mp3 mpeg mplayer multilib musepack mysql mysqli nas ncurses nls nptl nvidia offensive ogg openal openexr opengl openmp orc pam pcre pdf perl plasma plotutils png policykit portaudio posix ppds python qt3support qt5 quicktime readline sasl sdl seccomp semantic-desktop slp sndfile sockets sox speex spell ssl svg syslog tcpd theora threads tiff truetype unicode usb vhosts vorbis win32codecs wmf x264 xattr xml xmp xpm xulrunner xvid xvmc zlib" ABI_X86="64 32" ALSA_CARDS="ali5451 als4000 atiixp atiixp-modem bt87x ca0106 cmipci emu10k1x ens1370 ens1371 es1938 es1968 fm801 hda-intel intel8x0 intel8x0m maestro3 trident usb-audio via82xx via82xx-modem ymfpci" APACHE2_MODULES="authn_core authz_core socache_shmcb unixd actions alias auth_basic authn_alias authn_anon authn_dbm authn_default authn_file authz_dbm authz_default authz_groupfile authz_host authz_owner authz_user autoindex cache cgi cgid dav dav_fs dav_lock deflate dir disk_cache env expires ext_filter file_cache filter headers include info log_config logio mem_cache mime mime_magic negotiation rewrite setenvif speling status unique_id userdir usertrack vhost_alias" CALLIGRA_FEATURES="karbon plan sheets stage words" COLLECTD_PLUGINS="df interface irq load memory rrdtool swap syslog" CPU_FLAGS_X86="aes avx avx2 avx512f avx512dq avx512cd avx512bw avx512vl f16c fma3 mmx mmxext pclmul popcnt sse sse2 sse3 sse4_1 sse4_2 ssse3" ELIBC="glibc" GPSD_PROTOCOLS="ashtech aivdm earthmate evermore fv18 garmin garmintxt gpsclock isync itrax mtk3301 nmea ntrip navcom oceanserver oldstyle oncore rtcm104v2 rtcm104v3 sirf skytraq superstar2 timing tsip tripmate tnt ublox ubx" GRUB_PLATFORMS="pc" INPUT_DEVICES="evdev" KERNEL="linux" LCD_DEVICES="bayrad cfontz cfontz633 glk hd44780 lb216 lcdm001 mtxorb ncurses text" LIBREOFFICE_EXTENSIONS="presenter-console presenter-minimizer" OFFICE_IMPLEMENTATION="libreoffice" PHP_TARGETS="php5-6 php7-0" POSTGRES_TARGETS="postgres9_5 postgres10" PYTHON_SINGLE_TARGET="python3_6" PYTHON_TARGETS="python2_7 python3_6" RUBY_TARGETS="ruby23" USERLAND="GNU" VIDEO_CARDS="nvidia nouveau" XTABLES_ADDONS="quota2 psd pknock lscan length2 ipv4options ipset ipp2p iface geoip fuzzy condition tee tarpit sysrq steal rawnat logmark ipmark dhcpmac delude chaos account"
Unset:  CC, CPPFLAGS, CTARGET, CXX, EMERGE_DEFAULT_OPTS, INSTALL_MASK, LC_ALL, LINGUAS, PORTAGE_BINHOST, PORTAGE_BUNZIP2_COMMAND, PORTAGE_COMPRESS, PORTAGE_COMPRESS_FLAGS, PORTAGE_RSYNC_EXTRA_OPTS



emerge -pqv '=www-client/chromium-69.0.3497.100::gentoo'
Code:
[ebuild     U ] www-client/chromium-69.0.3497.100 [68.0.3440.75] USE="cups hangouts (pic) proprietary-codecs suid widevine -component-build -custom-cflags -gnome-keyring -jumbo-build -kerberos (-neon) -pulseaudio (-selinux) (-system-ffmpeg) (-system-icu*) (-system-libvpx) (-tcmalloc)" L10N="am ar bg bn ca cs da de el en-GB es es-419 et fa fi fil fr gu he hi hr hu id it ja kn ko lt lv ml mr ms nb nl pl pt-BR pt-PT ro ru sk sl sr sv sw ta te th tr uk vi zh-CN zh-TW"


grep -B 3 -A 3 -i error: build.log

Code:
[832/16903] python ../../tools/json_schema_compiler/compiler.py ../../chrome/common/extensions/api/sessions.json --root=../../ --destdir=gen --namespace=extensions::api::\%\(namespace\)s --generator=cpp --include-rules=extensions/common/api:extensions::api::\%\(namespace\)s
[833/16903] touch obj/chrome/common/extensions/api/api_schema_generator.stamp
[834/16903] python ../../chrome/test/chromedriver/embed_version_in_cpp.py --chromedriver-version-file ../../chrome/test/chromedriver/VERSION --chrome-version-file ../../chrome/VERSION --directory gen/chrome/test/chromedriver
ERROR:root:Git error: rc=128, output=''
[835/16903] python ../../mojo/public/tools/bindings/mojom_bindings_generator.py parse --filelist=__extensions_common_api_mojom__parser___build_toolchain_linux_unbundle_default__rule..rsp -o gen -d ../../ --enable_feature is_posix --enable_feature is_linux
[836/16903] touch obj/chrome/test/chromedriver/embed_version_in_cpp.stamp
[837/16903] python ../../chrome/test/chromedriver/embed_js_in_cpp.py --directory gen/chrome/test/chromedriver/chrome ../../chrome/test/chromedriver/js/call_function.js ../../chrome/test/chromedriver/js/dispatch_touch_event.js ../../chrome/test/chromedriver/js/execute_async_script.js ../../chrome/test/chromedriver/js/focus.js ../../chrome/test/chromedriver/js/get_element_region.js ../../chrome/test/chromedriver/js/is_option_element_toggleable.js
--
[3220/16894] touch obj/services/file/public/mojom/constants_js_data_deps.stamp
[3221/16894] touch obj/services/file/public/mojom/constants_shared__generator.stamp
[3222/16894] touch obj/services/file/public/mojom/constants.inputdeps.stamp
[3223/16894] python ../../mojo/public/tools/bindings/generate_type_mappings.py --output gen/services/identity/public/mojom/mojom__type_mappings --dependency gen/services/identity/public/mojom/constants__type_mappings --dependency gen/mojo/public/mojom/base/base__type_mappings --dependency gen/url/mojom/url_mojom_gurl__type_mappings --start-typemap public_headers=//components/signin/core/browser/account_info.h traits_headers=//services/identity/public/cpp/account_info_mojom_traits.h type_mappings=identity.mojom.AccountInfo=::AccountInfo --start-typemap public_headers=//services/identity/public/cpp/account_state.h traits_headers=//services/identity/public/cpp/account_state_mojom_traits.h type_mappings=identity.mojom.AccountState=identity::AccountState --start-typemap public_headers=//google_apis/gaia/google_service_auth_error.h traits_headers=//services/identity/public/cpp/google_service_auth_error_mojom_traits.h type_mappings=identity.mojom.Captcha=::GoogleServiceAuthError::Captcha type_mappings=identity.mojom.SecondFactor=::GoogleServiceAuthError::SecondFactor type_mappings=identity.mojom.GoogleServiceAuthError=::GoogleServiceAuthError --start-typemap public_headers=//services/identity/public/cpp/scope_set.h traits_headers=//services/identity/public/cpp/scope_set_mojom_traits.h type_mappings=identity.mojom.ScopeSet=::identity::ScopeSet
[3224/16894] touch obj/services/file/public/mojom/constants_shared_cpp_sources.inputdeps.stamp
[3225/16894] python ../../mojo/public/tools/bindings/mojom_bindings_generator.py verify --filelist=__services_file_public_mojom_mojom__verify_deps___build_toolchain_linux_unbundle_default__rule..rsp -f gen/services/file/public/mojom/mojom.deps_sources_list --gen_dir gen --depth ../../
[3226/16894] touch obj/services/file/public/mojom/mojom__verify_deps.stamp
--
[3493/16894] touch obj/third_party/blink/public/android_mojo_bindings.inputdeps.stamp
[3494/16894] touch obj/services/tracing/public/mojom/mojom__parsed.stamp
[3495/16894] python ../../mojo/public/tools/bindings/mojom_bindings_generator.py parse --filelist=__services_video_capture_public_mojom_constants__parser___build_toolchain_linux_unbundle_default__rule..rsp -o gen -d ../../ --enable_feature is_posix --enable_feature is_linux
[3496/16894] python ../../mojo/public/tools/bindings/generate_type_mappings.py --output gen/content/common/mojo_bindings__type_mappings --dependency gen/components/services/leveldb/public/interfaces/interfaces__type_mappings --dependency gen/content/public/common/interfaces__type_mappings --dependency gen/content/public/common/resource_type_bindings__type_mappings --dependency gen/ipc/mojom_constants__type_mappings --dependency gen/media/mojo/interfaces/interfaces__type_mappings --dependency gen/mojo/public/mojom/base/base__type_mappings --dependency gen/services/network/public/mojom/mojom__type_mappings --dependency gen/services/service_manager/public/mojom/mojom__type_mappings --dependency gen/services/ui/public/interfaces/interfaces__type_mappings --dependency gen/services/ui/public/interfaces/ime/ime__type_mappings --dependency gen/services/video_capture/public/mojom/mojom__type_mappings --dependency gen/services/viz/public/interfaces/interfaces__type_mappings --dependency gen/skia/public/interfaces/interfaces__type_mappings --dependency gen/third_party/blink/public/mojo_bindings__type_mappings --dependency gen/third_party/blink/public/web_feature_mojo_bindings__type_mappings --dependency gen/third_party/blink/public/mojom/mojom_core__type_mappings --dependency gen/ui/base/mojo/mojo__type_mappings --dependency gen/ui/events/mojo/interfaces__type_mappings --dependency gen/ui/gfx/geometry/mojo/mojo__type_mappings --dependency gen/ui/gfx/mojo/mojo__type_mappings --dependency gen/ui/gfx/range/mojo/mojo__type_mappings --dependency gen/ui/latency/mojo/interfaces__type_mappings --dependency gen/url/mojom/url_mojom_gurl__type_mappings --dependency gen/url/mojom/url_mojom_origin__type_mappings --start-typemap public_headers=//content/common/navigation_params.h traits_headers=//content/common/frame_messages.h type_mappings=content.mojom.CommonNavigationParams=content::CommonNavigationParams type_mappings=content.mojom.RequestNavigationParams=content::RequestNavigationParams --start-typemap public_headers=//content/common/frame_messages_forward.h traits_headers=//content/common/frame_messages.h type_mappings=content.mojom.DidCommitProvisionalLoadParams=std::unique_ptr\<::FrameHostMsg_DidCommitProvisionalLoad_Params\>\[move_only,nullable_is_same_type\] --start-typemap public_headers=//content/common/indexed_db/indexed_db_key.h public_headers=//content/common/indexed_db/indexed_db_key_path.h public_headers=//content/common/indexed_db/indexed_db_key_range.h public_headers=//content/common/indexed_db/indexed_db_metadata.h public_headers=//third_party/blink/public/platform/modules/indexeddb/web_idb_types.h traits_headers=//content/common/indexed_db/indexed_db_struct_traits.h type_mappings=indexed_db.mojom.CursorDirection=blink::WebIDBCursorDirection type_mappings=indexed_db.mojom.DatabaseMetadata=content::IndexedDBDatabaseMetadata type_mappings=indexed_db.mojom.DataLoss=blink::WebIDBDataLoss type_mappings=indexed_db.mojom.IndexKeys=content::IndexedDBIndexKeys type_mappings=indexed_db.mojom.IndexMetadata=content::IndexedDBIndexMetadata type_mappings=indexed_db.mojom.Key=content::IndexedDBKey type_mappings=indexed_db.mojom.KeyPath=content::IndexedDBKeyPath type_mappings=indexed_db.mojom.KeyRange=content::IndexedDBKeyRange type_mappings=indexed_db.mojom.ObjectStoreMetadata=content::IndexedDBObjectStoreMetadata type_mappings=indexed_db.mojom.OperationType=blink::WebIDBOperationType type_mappings=indexed_db.mojom.PutMode=blink::WebIDBPutMode type_mappings=indexed_db.mojom.TaskType=blink::WebIDBTaskType type_mappings=indexed_db.mojom.TransactionMode=blink::WebIDBTransactionMode --start-typemap public_headers=//content/common/input/sync_compositor_messages.h traits_headers=//content/common/input/sync_compositor_messages.h type_mappings=content.mojom.SyncCompositorDemandDrawHwParams=content::SyncCompositorDemandDrawHwParams type_mappings=content.mojom.SyncCompositorSetSharedMemoryParams=content::SyncCompositorSetSharedMemoryParams type_mappings=content.mojom.SyncCompositorDemandDrawSwParams=content::SyncCompositorDemandDrawSwParams type_mappings=content.mojom.SyncCompositorCommonRendererParams=content::SyncCompositorCommonRendererParams --start-typemap public_headers=//content/common/media/media_stream_controls.h public_headers=//content/public/common/media_stream_request.h traits_headers=//content/common/media/media_stream_param_traits.h traits_headers=//content/common/media/media_stream_typemap_traits.h type_mappings=content.mojom.MediaStreamDevice=content::MediaStreamDevice type_mappings=content.mojom.MediaStreamRequestResult=content::MediaStreamRequestResult type_mappings=content.mojom.MediaStreamType=content::MediaStreamType type_mappings=content.mojom.StreamControls=content::StreamControls type_mappings=content.mojom.TrackControls=content::TrackControls --start-typemap public_headers=//cc/input/touch_action.h public_headers=//content/common/edit_command.h public_headers=//content/common/frame_owner_properties.h public_headers=//content/common/frame_replication_state.h public_headers=//content/common/input/input_event.h public_headers=//content/common/visual_properties.h public_headers=//content/public/common/input_event_ack_source.h public_headers=//content/public/common/input_event_ack_state.h public_headers=//content/common/cursors/webcursor.h public_headers=//content/common/input/synthetic_pinch_gesture_params.h public_headers=//content/common/input/synthetic_pointer_action_list_params.h public_headers=//content/common/input/synthetic_smooth_drag_gesture_params.h public_headers=//content/common/input/synthetic_smooth_scroll_gesture_params.h public_headers=//content/common/input/synthetic_tap_gesture_params.h public_headers=//content/public/common/renderer_preferences.h public_headers=//content/public/common/web_preferences.h public_headers=//net/base/network_change_notifier.h public_headers=//third_party/blink/public/platform/web_gesture_device.h public_headers=//third_party/blink/public/platform/web_gesture_event.h public_headers=//third_party/blink/public/platform/web_input_event.h public_headers=//third_party/blink/public/platform/web_mouse_wheel_event.h public_headers=//third_party/blink/public/platform/web_pointer_properties.h public_headers=//third_party/blink/public/platform/web_touch_point.h public_headers=//third_party/blink/public/web/web_popup_type.h public_headers=//ui/events/blink/did_overscroll_params.h public_headers=//ui/events/blink/web_input_event_traits.h public_headers=//ui/latency/ipc/latency_info_param_traits.h traits_headers=//content/common/frame_messages.h traits_headers=//content/common/input_messages.h traits_headers=//content/common/input/input_event_struct_traits.h traits_headers=//content/common/input/touch_action_optional_struct_traits.h traits_headers=//content/common/view_messages.h traits_headers=//content/public/common/common_param_traits.h type_mappings=content.mojom.Button=blink::WebPointerProperties::Button type_mappings=content.mojom.Cancelability=blink::WebInputEvent::DispatchType type_mappings=content.mojom.EditCommand=content::EditCommand type_mappings=content.mojom.Event=std::unique_ptr\<content::InputEvent\>\[move_only\] type_mappings=content.mojom.EventType=blink::WebInputEvent::Type type_mappings=content.mojom.FrameOwnerProperties=content::FrameOwnerProperties type_mappings=content.mojom.FrameReplicationState=content::FrameReplicationState type_mappings=content.mojom.GestureDevice=blink::WebGestureDevice type_mappings=content.mojom.InertialPhaseState=blink::WebGestureEvent::InertialPhaseState type_mappings=content.mojom.InputEventAckSource=content::InputEventAckSource type_mappings=content.mojom.InputEventAckState=content::InputEventAckState type_mappings=content.mojom.NetworkConnectionType=net::NetworkChangeNotifier::ConnectionType type_mappings=content.mojom.DidOverscrollParams=ui::DidOverscrollParams type_mappings=content.mojom.PointerType=blink::WebPointerProperties::PointerType type_mappings=content.mojom.RendererPreferences=content::RendererPreferences type_mappings=content.mojom.VisualProperties=content::VisualProperties type_mappings=content.mojom.ScrollUnits=blink::WebGestureEvent::ScrollUnits type_mappings=content.mojom.SyntheticSmoothDrag=content::SyntheticSmoothDragGestureParams type_mappings=content.mojom.SyntheticSmoothScroll=content::SyntheticSmoothScrollGestureParams type_mappings=content.mojom.SyntheticPinch=content::SyntheticPinchGestureParams type_mappings=content.mojom.SyntheticTap=content::SyntheticTapGestureParams type_mappings=content.mojom.SyntheticPointerAction=content::SyntheticPointerActionListParams type_mappings=content.mojom.TouchAction=cc::TouchAction type_mappings=content.mojom.TouchActionOptional=cc::TouchAction type_mappings=content.mojom.TouchState=blink::WebTouchPoint::State type_mappings=content.mojom.WebCursor=content::WebCursor type_mappings=content.mojom.WebPopupType=blink::WebPopupType type_mappings=content.mojom.WebPreferences=content::WebPreferences --start-typemap public_headers=//content/public/common/web_preferences.h traits_headers=//content/public/common/common_param_traits_macros.h type_mappings=content.mojom.V8CacheOptions=content::V8CacheOptions type_mappings=content.mojom.WebPreferences=content::WebPreferences --start-typemap public_headers=//third_party/blink/public/platform/web_mixed_content_context_type.h traits_headers=//content/common/resource_messages.h type_mappings=content.mojom.MixedContentContextType=::blink::WebMixedContentContextType --start-typemap public_headers=//content/public/common/push_subscription_options.h public_headers=//third_party/blink/public/platform/modules/push_messaging/web_push_error.h traits_headers=//content/common/push_messaging_param_traits.h type_mappings=content.mojom.PushErrorType=blink::WebPushError::ErrorType type_mappings=content.mojom.PushSubscriptionOptions=content::PushSubscriptionOptions --start-typemap public_headers=//cc/trees/render_frame_metadata.h traits_headers=//content/common/render_frame_metadata_struct_traits.h type_mappings=content.mojom.RenderFrameMetadata=cc::RenderFrameMetadata --start-typemap public_headers=//content/common/background_fetch/background_fetch_types.h public_headers=//third_party/blink/public/common/service_worker/service_worker_status_code.h public_headers=//content/common/service_worker/service_worker_types.h public_headers=//content/public/common/platform_notification_data.h public_headers=//content/public/common/push_event_payload.h traits_headers=//content/common/platform_notification_param_traits.h traits_headers=//content/common/service_worker/service_worker_messages.h type_mappings=content.mojom.ExtendableMessageEventSource=::content::ExtendableMessageEventSource type_mappings=content.mojom.PlatformNotificationData=::content::PlatformNotificationData type_mappings=content.mojom.PushEventPayload=::content::PushEventPayload type_mappings=content.mojom.ServiceWorkerFetchRequest=::content::ServiceWorkerFetchRequest type_mappings=content.mojom.ServiceWorkerResponse=::content::ServiceWorkerResponse --start-typemap public_headers=//content/common/url_loader_factory_bundle.h traits_headers=//content/common/url_loader_factory_bundle_struct_traits.h type_mappings=content.mojom.URLLoaderFactoryBundle=std::unique_ptr\<content::URLLoaderFactoryBundleInfo\>\[move_only,nullable_is_same_type\]
[3497/16894] touch obj/content/common/mojo_bindings__type_mappings.stamp
[3498/16894] touch obj/services/video_capture/public/mojom/constants__parser.stamp
[3499/16894] python ../../mojo/public/tools/bindings/generate_type_mappings.py --output gen/services/viz/privileged/interfaces/gl/gl__type_mappings --dependency gen/components/arc/common/media__type_mappings --dependency gen/gpu/ipc/common/interfaces__type_mappings --dependency gen/media/mojo/interfaces/interfaces__type_mappings --dependency gen/ui/gfx/geometry/mojo/mojo__type_mappings --dependency gen/ui/gfx/mojo/mojo__type_mappings --dependency gen/url/mojom/url_mojom_gurl__type_mappings --start-typemap public_headers=//gpu/command_buffer/common/constants.h traits_headers=//services/viz/privileged/cpp/context_lost_reason_traits.h type_mappings=viz.mojom.ContextLostReason=gpu::error::ContextLostReason
[3500/16894] python ../../services/service_manager/public/tools/manifest/manifest_collator.py --parent=../../content/public/app/mojo/content_packaged_services_manifest.json --output=gen/content/public/app/packaged_services_manifest.json --name content_packaged_services --packaged-services gen/components/services/heap_profiling/manifest.json gen/media/mojo/services/cdm_manifest.json gen/media/mojo/services/media_manifest.json gen/services/audio/manifest.json gen/services/data_decoder/manifest.json gen/services/device/manifest.json gen/services/metrics/manifest.json gen/services/network/manifest.json gen/services/resource_coordinator/manifest.json gen/services/shape_detection/manifest.json gen/services/tracing/manifest.json gen/services/video_capture/manifest.json gen/services/viz/manifest.json gen/components/services/font/manifest.json
[3501/16894] x86_64-pc-linux-gnu-clang++ -MMD -MF obj/services/resource_coordinator/lib/metrics_collector.o.d -DV8_DEPRECATION_WARNINGS -DUSE_UDEV -DUSE_AURA=1 -DUSE_GLIB=1 -DUSE_NSS_CERTS=1 -DUSE_X11=1 -DNO_TCMALLOC -DFULL_SAFE_BROWSING -DSAFE_BROWSING_CSD -DSAFE_BROWSING_DB_LOCAL -DCHROMIUM_BUILD -D_FILE_OFFSET_BITS=64 -D_LARGEFILE_SOURCE -D_LARGEFILE64_SOURCE -D__STDC_CONSTANT_MACROS -D__STDC_FORMAT_MACROS -DNDEBUG -DNVALGRIND -DDYNAMIC_ANNOTATIONS_ENABLED=0 -DGLIB_VERSION_MAX_ALLOWED=GLIB_VERSION_2_32 -DGLIB_VERSION_MIN_REQUIRED=GLIB_VERSION_2_26 -DENABLE_IPC_FUZZER -DU_USING_ICU_NAMESPACE=0 -DU_ENABLE_DYLOAD=0 -DU_STATIC_IMPLEMENTATION -DICU_UTIL_DATA_IMPL=ICU_UTIL_DATA_FILE -DUCHAR_TYPE=uint16_t -I../.. -Igen -I../../third_party/ced/src -I../../third_party/icu/source/common -I../../third_party/icu/source/i18n -fno-strict-aliasing --param=ssp-buffer-size=4 -fstack-protector -Wno-builtin-macro-redefined -D__DATE__= -D__TIME__= -D__TIMESTAMP__= -funwind-tables -fPIC -pthread -fcolor-diagnostics -fmerge-all-constants -no-canonical-prefixes -Wall -Wextra -Wimplicit-fallthrough -Wthread-safety -Wno-missing-field-initializers -Wno-unused-parameter -Wno-c++11-narrowing -Wno-covered-switch-default -Wno-unneeded-internal-declaration -Wno-undefined-var-template -Wno-address-of-packed-member -Wno-nonportable-include-path -Wno-user-defined-warnings -Wno-unused-lambda-capture -Wno-null-pointer-arithmetic -Wno-enum-compare-switch -fno-omit-frame-pointer -fvisibility=hidden -Wheader-hygiene -Wstring-conversion -Wtautological-overlap-compare -isystem../../../../../../../../../usr/include/glib-2.0 -isystem../../../../../../../../../usr/lib64/glib-2.0/include -std=gnu++14 -fno-exceptions -fno-rtti -fvisibility-inlines-hidden -march=native -O2 -pipe -c ../../services/resource_coordinator/observers/metrics_collector.cc -o obj/services/resource_coordinator/lib/metrics_collector.o
[3502/16894] touch obj/content/public/app/packaged_services_manifest.stamp
--
[15421/16588] x86_64-pc-linux-gnu-clang++ -MMD -MF obj/chrome/browser/ui/ui/tab.o.d -DV8_DEPRECATION_WARNINGS -DUSE_UDEV -DUSE_AURA=1 -DUSE_GLIB=1 -DUSE_NSS_CERTS=1 -DUSE_X11=1 -DNO_TCMALLOC -DFULL_SAFE_BROWSING -DSAFE_BROWSING_CSD -DSAFE_BROWSING_DB_LOCAL -DCHROMIUM_BUILD -D_FILE_OFFSET_BITS=64 -D_LARGEFILE_SOURCE -D_LARGEFILE64_SOURCE -D__STDC_CONSTANT_MACROS -D__STDC_FORMAT_MACROS -DNDEBUG -DNVALGRIND -DDYNAMIC_ANNOTATIONS_ENABLED=0 -DUSE_CUPS -DUSE_GIO -DGLIB_VERSION_MAX_ALLOWED=GLIB_VERSION_2_32 -DGLIB_VERSION_MIN_REQUIRED=GLIB_VERSION_2_26 -DENABLE_IPC_FUZZER -DTOOLKIT_VIEWS=1 -DGL_GLEXT_PROTOTYPES -DUSE_GLX -DUSE_EGL -DVK_NO_PROTOTYPES -DEXPAT_RELATIVE_PATH -DGOOGLE_PROTOBUF_NO_RTTI -DGOOGLE_PROTOBUF_NO_STATIC_INITIALIZER -DHAVE_PTHREAD -DLEVELDB_PLATFORM_CHROMIUM=1 -DU_USING_ICU_NAMESPACE=0 -DU_ENABLE_DYLOAD=0 -DU_STATIC_IMPLEMENTATION -DICU_UTIL_DATA_IMPL=ICU_UTIL_DATA_FILE -DUCHAR_TYPE=uint16_t -DV8_USE_EXTERNAL_STARTUP_DATA -DSK_IGNORE_LINEONLY_AA_CONVEX_PATH_OPTS -DSK_HAS_PNG_LIBRARY -DSK_HAS_WEBP_LIBRARY -DSK_HAS_JPEG_LIBRARY -DSK_VULKAN_HEADER=\"../../skia/config/SkVulkanConfig.h\" -DSK_VULKAN=1 -DSK_SUPPORT_GPU=1 -DSK_GPU_WORKAROUNDS_HEADER=\"gpu/config/gpu_driver_bug_workaround_autogen.h\" -DVK_NO_PROTOTYPES -DWEBRTC_NON_STATIC_TRACE_EVENT_HANDLERS=0 -DGTEST_RELATIVE_PATH -DWEBRTC_CHROMIUM_BUILD -DWEBRTC_POSIX -DWEBRTC_LINUX -DABSL_ALLOCATOR_NOTHROW=1 -DNO_MAIN_THREAD_WRAPPING -DI18N_ADDRESS_VALIDATION_DATA_URL=\"https://chromium-i18n.appspot.com/ssl-aggregate-address/\" -DUSE_SYSTEM_ZLIB=1 -I../.. -Igen -Igen/shim_headers/zlib_shim -Igen/shim_headers/re2_shim -Igen/shim_headers/snappy_shim -Igen/shim_headers/libpng_shim -Igen/shim_headers/libwebp_shim -Igen/shim_headers/libdrm_shim -I../../third_party/khronos -I../../gpu -I../../third_party/libyuv/include -I../../third_party/vulkan/include -Igen/shim_headers/openh264_shim -Igen/shim_headers/minizip_shim -Igen/shim_headers/flac_shim -I../../third_party/webrtc_overrides -I../../testing/gtest/include -I../../third_party/libyuv/include -I../../third_party/usrsctp/usrsctplib -I../../third_party/webrtc -I../../third_party/protobuf/src -Igen/protoc_out -I../../third_party/protobuf/src -I../../third_party/boringssl/src/include -I../../third_party/leveldatabase -I../../third_party/leveldatabase/src -I../../third_party/leveldatabase/src/include -I../../third_party/ced/src -I../../third_party/icu/source/common -I../../third_party/icu/source/i18n -I../../skia/config -I../../skia/ext -I../../third_party/skia/include/c -I../../third_party/skia/include/config -I../../third_party/skia/include/core -I../../third_party/skia/include/effects -I../../third_party/skia/include/encode -I../../third_party/skia/include/gpu -I../../third_party/skia/include/images -I../../third_party/skia/include/lazy -I../../third_party/skia/include/pathops -I../../third_party/skia/include/pdf -I../../third_party/skia/include/pipe -I../../third_party/skia/include/ports -I../../third_party/skia/include/utils -I../../third_party/vulkan/include -I../../third_party/skia/third_party/vulkanmemoryallocator -I../../third_party/skia/src/gpu -I../../third_party/skia/src/sksl -I../../third_party/vulkan/include -I../../third_party/libwebm/source -I../../v8/include -Igen/v8/include -I../../third_party/webrtc_overrides -I../../third_party/webrtc -I../../third_party/perfetto/include -Igen/third_party/perfetto/protos -Igen/third_party/perfetto/protos -Igen/third_party/perfetto/protos -Igen/third_party/metrics_proto -I../../third_party/mesa/src/include -Igen -Igen -I../../third_party/libaddressinput/src/cpp/include -I../../third_party/cacheinvalidation/overrides -I../../third_party/cacheinvalidation/src -I../../third_party/flatbuffers/src/include -I../../third_party/brotli/include -I../../third_party/webrtc_overrides -I../../testing/gtest/include -I../../third_party/webrtc -Igen -Igen -fno-strict-aliasing --param=ssp-buffer-size=4 -fstack-protector -Wno-builtin-macro-redefined -D__DATE__= -D__TIME__= -D__TIMESTAMP__= -funwind-tables -fPIC -pthread -fcolor-diagnostics -fmerge-all-constants -no-canonical-prefixes -Wall -Wextra -Wimplicit-fallthrough -Wthread-safety -Wno-missing-field-initializers -Wno-unused-parameter -Wno-c++11-narrowing -Wno-covered-switch-default -Wno-unneeded-internal-declaration -Wno-undefined-var-template -Wno-address-of-packed-member -Wno-nonportable-include-path -Wno-user-defined-warnings -Wno-unused-lambda-capture -Wno-null-pointer-arithmetic -Wno-enum-compare-switch -fno-omit-frame-pointer -fvisibility=hidden -Wheader-hygiene -Wstring-conversion -Wtautological-overlap-compare -Wno-nonnull -Wexit-time-destructors -isystem../../../../../../../../../usr/include/glib-2.0 -isystem../../../../../../../../../usr/lib64/glib-2.0/include -isystem../../../../../../../../../usr/include/glib-2.0 -isystem../../../../../../../../../usr/lib64/glib-2.0/include -Wno-header-guard -isystem../../../../../../../../../usr/include/nss -isystem../../../../../../../../../usr/include/nspr -isystem ../../third_party/abseil-cpp -Wno-exit-time-destructors -isystem../../../../../../../../../usr/include/dbus-1.0 -isystem../../../../../../../../../usr/lib64/dbus-1.0/include -std=gnu++14 -fno-exceptions -fno-rtti -fvisibility-inlines-hidden -march=native -O2 -pipe -c ../../chrome/browser/ui/views/tabs/tab.cc -o obj/chrome/browser/ui/ui/tab.o
FAILED: obj/chrome/browser/ui/ui/tab.o
x86_64-pc-linux-gnu-clang++ -MMD -MF obj/chrome/browser/ui/ui/tab.o.d -DV8_DEPRECATION_WARNINGS -DUSE_UDEV -DUSE_AURA=1 -DUSE_GLIB=1 -DUSE_NSS_CERTS=1 -DUSE_X11=1 -DNO_TCMALLOC -DFULL_SAFE_BROWSING -DSAFE_BROWSING_CSD -DSAFE_BROWSING_DB_LOCAL -DCHROMIUM_BUILD -D_FILE_OFFSET_BITS=64 -D_LARGEFILE_SOURCE -D_LARGEFILE64_SOURCE -D__STDC_CONSTANT_MACROS -D__STDC_FORMAT_MACROS -DNDEBUG -DNVALGRIND -DDYNAMIC_ANNOTATIONS_ENABLED=0 -DUSE_CUPS -DUSE_GIO -DGLIB_VERSION_MAX_ALLOWED=GLIB_VERSION_2_32 -DGLIB_VERSION_MIN_REQUIRED=GLIB_VERSION_2_26 -DENABLE_IPC_FUZZER -DTOOLKIT_VIEWS=1 -DGL_GLEXT_PROTOTYPES -DUSE_GLX -DUSE_EGL -DVK_NO_PROTOTYPES -DEXPAT_RELATIVE_PATH -DGOOGLE_PROTOBUF_NO_RTTI -DGOOGLE_PROTOBUF_NO_STATIC_INITIALIZER -DHAVE_PTHREAD -DLEVELDB_PLATFORM_CHROMIUM=1 -DU_USING_ICU_NAMESPACE=0 -DU_ENABLE_DYLOAD=0 -DU_STATIC_IMPLEMENTATION -DICU_UTIL_DATA_IMPL=ICU_UTIL_DATA_FILE -DUCHAR_TYPE=uint16_t -DV8_USE_EXTERNAL_STARTUP_DATA -DSK_IGNORE_LINEONLY_AA_CONVEX_PATH_OPTS -DSK_HAS_PNG_LIBRARY -DSK_HAS_WEBP_LIBRARY -DSK_HAS_JPEG_LIBRARY -DSK_VULKAN_HEADER=\"../../skia/config/SkVulkanConfig.h\" -DSK_VULKAN=1 -DSK_SUPPORT_GPU=1 -DSK_GPU_WORKAROUNDS_HEADER=\"gpu/config/gpu_driver_bug_workaround_autogen.h\" -DVK_NO_PROTOTYPES -DWEBRTC_NON_STATIC_TRACE_EVENT_HANDLERS=0 -DGTEST_RELATIVE_PATH -DWEBRTC_CHROMIUM_BUILD -DWEBRTC_POSIX -DWEBRTC_LINUX -DABSL_ALLOCATOR_NOTHROW=1 -DNO_MAIN_THREAD_WRAPPING -DI18N_ADDRESS_VALIDATION_DATA_URL=\"https://chromium-i18n.appspot.com/ssl-aggregate-address/\" -DUSE_SYSTEM_ZLIB=1 -I../.. -Igen -Igen/shim_headers/zlib_shim -Igen/shim_headers/re2_shim -Igen/shim_headers/snappy_shim -Igen/shim_headers/libpng_shim -Igen/shim_headers/libwebp_shim -Igen/shim_headers/libdrm_shim -I../../third_party/khronos -I../../gpu -I../../third_party/libyuv/include -I../../third_party/vulkan/include -Igen/shim_headers/openh264_shim -Igen/shim_headers/minizip_shim -Igen/shim_headers/flac_shim -I../../third_party/webrtc_overrides -I../../testing/gtest/include -I../../third_party/libyuv/include -I../../third_party/usrsctp/usrsctplib -I../../third_party/webrtc -I../../third_party/protobuf/src -Igen/protoc_out -I../../third_party/protobuf/src -I../../third_party/boringssl/src/include -I../../third_party/leveldatabase -I../../third_party/leveldatabase/src -I../../third_party/leveldatabase/src/include -I../../third_party/ced/src -I../../third_party/icu/source/common -I../../third_party/icu/source/i18n -I../../skia/config -I../../skia/ext -I../../third_party/skia/include/c -I../../third_party/skia/include/config -I../../third_party/skia/include/core -I../../third_party/skia/include/effects -I../../third_party/skia/include/encode -I../../third_party/skia/include/gpu -I../../third_party/skia/include/images -I../../third_party/skia/include/lazy -I../../third_party/skia/include/pathops -I../../third_party/skia/include/pdf -I../../third_party/skia/include/pipe -I../../third_party/skia/include/ports -I../../third_party/skia/include/utils -I../../third_party/vulkan/include -I../../third_party/skia/third_party/vulkanmemoryallocator -I../../third_party/skia/src/gpu -I../../third_party/skia/src/sksl -I../../third_party/vulkan/include -I../../third_party/libwebm/source -I../../v8/include -Igen/v8/include -I../../third_party/webrtc_overrides -I../../third_party/webrtc -I../../third_party/perfetto/include -Igen/third_party/perfetto/protos -Igen/third_party/perfetto/protos -Igen/third_party/perfetto/protos -Igen/third_party/metrics_proto -I../../third_party/mesa/src/include -Igen -Igen -I../../third_party/libaddressinput/src/cpp/include -I../../third_party/cacheinvalidation/overrides -I../../third_party/cacheinvalidation/src -I../../third_party/flatbuffers/src/include -I../../third_party/brotli/include -I../../third_party/webrtc_overrides -I../../testing/gtest/include -I../../third_party/webrtc -Igen -Igen -fno-strict-aliasing --param=ssp-buffer-size=4 -fstack-protector -Wno-builtin-macro-redefined -D__DATE__= -D__TIME__= -D__TIMESTAMP__= -funwind-tables -fPIC -pthread -fcolor-diagnostics -fmerge-all-constants -no-canonical-prefixes -Wall -Wextra -Wimplicit-fallthrough -Wthread-safety -Wno-missing-field-initializers -Wno-unused-parameter -Wno-c++11-narrowing -Wno-covered-switch-default -Wno-unneeded-internal-declaration -Wno-undefined-var-template -Wno-address-of-packed-member -Wno-nonportable-include-path -Wno-user-defined-warnings -Wno-unused-lambda-capture -Wno-null-pointer-arithmetic -Wno-enum-compare-switch -fno-omit-frame-pointer -fvisibility=hidden -Wheader-hygiene -Wstring-conversion -Wtautological-overlap-compare -Wno-nonnull -Wexit-time-destructors -isystem../../../../../../../../../usr/include/glib-2.0 -isystem../../../../../../../../../usr/lib64/glib-2.0/include -isystem../../../../../../../../../usr/include/glib-2.0 -isystem../../../../../../../../../usr/lib64/glib-2.0/include -Wno-header-guard -isystem../../../../../../../../../usr/include/nss -isystem../../../../../../../../../usr/include/nspr -isystem ../../third_party/abseil-cpp -Wno-exit-time-destructors -isystem../../../../../../../../../usr/include/dbus-1.0 -isystem../../../../../../../../../usr/lib64/dbus-1.0/include -std=gnu++14 -fno-exceptions -fno-rtti -fvisibility-inlines-hidden -march=native -O2 -pipe -c ../../chrome/browser/ui/views/tabs/tab.cc -o obj/chrome/browser/ui/ui/tab.o
fatal error: error in backend: Unable to copy EFLAGS physical register!
x86_64-pc-linux-gnu-clang++: error: clang frontend command failed with exit code 70 (use -v to see invocation)
clang version 6.0.1 (tags/RELEASE_601/final)
Target: x86_64-pc-linux-gnu
Thread model: posix
--
[15443/16588] x86_64-pc-linux-gnu-clang++ -MMD -MF obj/chrome/browser/ui/ui/chrome_browser_main_extra_parts_views_linux.o.d -DV8_DEPRECATION_WARNINGS -DUSE_UDEV -DUSE_AURA=1 -DUSE_GLIB=1 -DUSE_NSS_CERTS=1 -DUSE_X11=1 -DNO_TCMALLOC -DFULL_SAFE_BROWSING -DSAFE_BROWSING_CSD -DSAFE_BROWSING_DB_LOCAL -DCHROMIUM_BUILD -D_FILE_OFFSET_BITS=64 -D_LARGEFILE_SOURCE -D_LARGEFILE64_SOURCE -D__STDC_CONSTANT_MACROS -D__STDC_FORMAT_MACROS -DNDEBUG -DNVALGRIND -DDYNAMIC_ANNOTATIONS_ENABLED=0 -DUSE_CUPS -DUSE_GIO -DGLIB_VERSION_MAX_ALLOWED=GLIB_VERSION_2_32 -DGLIB_VERSION_MIN_REQUIRED=GLIB_VERSION_2_26 -DENABLE_IPC_FUZZER -DTOOLKIT_VIEWS=1 -DGL_GLEXT_PROTOTYPES -DUSE_GLX -DUSE_EGL -DVK_NO_PROTOTYPES -DEXPAT_RELATIVE_PATH -DGOOGLE_PROTOBUF_NO_RTTI -DGOOGLE_PROTOBUF_NO_STATIC_INITIALIZER -DHAVE_PTHREAD -DLEVELDB_PLATFORM_CHROMIUM=1 -DU_USING_ICU_NAMESPACE=0 -DU_ENABLE_DYLOAD=0 -DU_STATIC_IMPLEMENTATION -DICU_UTIL_DATA_IMPL=ICU_UTIL_DATA_FILE -DUCHAR_TYPE=uint16_t -DV8_USE_EXTERNAL_STARTUP_DATA -DSK_IGNORE_LINEONLY_AA_CONVEX_PATH_OPTS -DSK_HAS_PNG_LIBRARY -DSK_HAS_WEBP_LIBRARY -DSK_HAS_JPEG_LIBRARY -DSK_VULKAN_HEADER=\"../../skia/config/SkVulkanConfig.h\" -DSK_VULKAN=1 -DSK_SUPPORT_GPU=1 -DSK_GPU_WORKAROUNDS_HEADER=\"gpu/config/gpu_driver_bug_workaround_autogen.h\" -DVK_NO_PROTOTYPES -DWEBRTC_NON_STATIC_TRACE_EVENT_HANDLERS=0 -DGTEST_RELATIVE_PATH -DWEBRTC_CHROMIUM_BUILD -DWEBRTC_POSIX -DWEBRTC_LINUX -DABSL_ALLOCATOR_NOTHROW=1 -DNO_MAIN_THREAD_WRAPPING -DI18N_ADDRESS_VALIDATION_DATA_URL=\"https://chromium-i18n.appspot.com/ssl-aggregate-address/\" -DUSE_SYSTEM_ZLIB=1 -I../.. -Igen -Igen/shim_headers/zlib_shim -Igen/shim_headers/re2_shim -Igen/shim_headers/snappy_shim -Igen/shim_headers/libpng_shim -Igen/shim_headers/libwebp_shim -Igen/shim_headers/libdrm_shim -I../../third_party/khronos -I../../gpu -I../../third_party/libyuv/include -I../../third_party/vulkan/include -Igen/shim_headers/openh264_shim -Igen/shim_headers/minizip_shim -Igen/shim_headers/flac_shim -I../../third_party/webrtc_overrides -I../../testing/gtest/include -I../../third_party/libyuv/include -I../../third_party/usrsctp/usrsctplib -I../../third_party/webrtc -I../../third_party/protobuf/src -Igen/protoc_out -I../../third_party/protobuf/src -I../../third_party/boringssl/src/include -I../../third_party/leveldatabase -I../../third_party/leveldatabase/src -I../../third_party/leveldatabase/src/include -I../../third_party/ced/src -I../../third_party/icu/source/common -I../../third_party/icu/source/i18n -I../../skia/config -I../../skia/ext -I../../third_party/skia/include/c -I../../third_party/skia/include/config -I../../third_party/skia/include/core -I../../third_party/skia/include/effects -I../../third_party/skia/include/encode -I../../third_party/skia/include/gpu -I../../third_party/skia/include/images -I../../third_party/skia/include/lazy -I../../third_party/skia/include/pathops -I../../third_party/skia/include/pdf -I../../third_party/skia/include/pipe -I../../third_party/skia/include/ports -I../../third_party/skia/include/utils -I../../third_party/vulkan/include -I../../third_party/skia/third_party/vulkanmemoryallocator -I../../third_party/skia/src/gpu -I../../third_party/skia/src/sksl -I../../third_party/vulkan/include -I../../third_party/libwebm/source -I../../v8/include -Igen/v8/include -I../../third_party/webrtc_overrides -I../../third_party/webrtc -I../../third_party/perfetto/include -Igen/third_party/perfetto/protos -Igen/third_party/perfetto/protos -Igen/third_party/perfetto/protos -Igen/third_party/metrics_proto -I../../third_party/mesa/src/include -Igen -Igen -I../../third_party/libaddressinput/src/cpp/include -I../../third_party/cacheinvalidation/overrides -I../../third_party/cacheinvalidation/src -I../../third_party/flatbuffers/src/include -I../../third_party/brotli/include -I../../third_party/webrtc_overrides -I../../testing/gtest/include -I../../third_party/webrtc -Igen -Igen -fno-strict-aliasing --param=ssp-buffer-size=4 -fstack-protector -Wno-builtin-macro-redefined -D__DATE__= -D__TIME__= -D__TIMESTAMP__= -funwind-tables -fPIC -pthread -fcolor-diagnostics -fmerge-all-constants -no-canonical-prefixes -Wall -Wextra -Wimplicit-fallthrough -Wthread-safety -Wno-missing-field-initializers -Wno-unused-parameter -Wno-c++11-narrowing -Wno-covered-switch-default -Wno-unneeded-internal-declaration -Wno-undefined-var-template -Wno-address-of-packed-member -Wno-nonportable-include-path -Wno-user-defined-warnings -Wno-unused-lambda-capture -Wno-null-pointer-arithmetic -Wno-enum-compare-switch -fno-omit-frame-pointer -fvisibility=hidden -Wheader-hygiene -Wstring-conversion -Wtautological-overlap-compare -Wno-nonnull -Wexit-time-destructors -isystem../../../../../../../../../usr/include/glib-2.0 -isystem../../../../../../../../../usr/lib64/glib-2.0/include -isystem../../../../../../../../../usr/include/glib-2.0 -isystem../../../../../../../../../usr/lib64/glib-2.0/include -Wno-header-guard -isystem../../../../../../../../../usr/include/nss -isystem../../../../../../../../../usr/include/nspr -isystem ../../third_party/abseil-cpp -Wno-exit-time-destructors -isystem../../../../../../../../../usr/include/dbus-1.0 -isystem../../../../../../../../../usr/lib64/dbus-1.0/include -std=gnu++14 -fno-exceptions -fno-rtti -fvisibility-inlines-hidden -march=native -O2 -pipe -c ../../chrome/browser/ui/views/chrome_browser_main_extra_parts_views_linux.cc -o obj/chrome/browser/ui/ui/chrome_browser_main_extra_parts_views_linux.o
[15444/16588] x86_64-pc-linux-gnu-clang++ -MMD -MF obj/chrome/browser/ui/ui/relaunch_recommended_bubble_view.o.d -DV8_DEPRECATION_WARNINGS -DUSE_UDEV -DUSE_AURA=1 -DUSE_GLIB=1 -DUSE_NSS_CERTS=1 -DUSE_X11=1 -DNO_TCMALLOC -DFULL_SAFE_BROWSING -DSAFE_BROWSING_CSD -DSAFE_BROWSING_DB_LOCAL -DCHROMIUM_BUILD -D_FILE_OFFSET_BITS=64 -D_LARGEFILE_SOURCE -D_LARGEFILE64_SOURCE -D__STDC_CONSTANT_MACROS -D__STDC_FORMAT_MACROS -DNDEBUG -DNVALGRIND -DDYNAMIC_ANNOTATIONS_ENABLED=0 -DUSE_CUPS -DUSE_GIO -DGLIB_VERSION_MAX_ALLOWED=GLIB_VERSION_2_32 -DGLIB_VERSION_MIN_REQUIRED=GLIB_VERSION_2_26 -DENABLE_IPC_FUZZER -DTOOLKIT_VIEWS=1 -DGL_GLEXT_PROTOTYPES -DUSE_GLX -DUSE_EGL -DVK_NO_PROTOTYPES -DEXPAT_RELATIVE_PATH -DGOOGLE_PROTOBUF_NO_RTTI -DGOOGLE_PROTOBUF_NO_STATIC_INITIALIZER -DHAVE_PTHREAD -DLEVELDB_PLATFORM_CHROMIUM=1 -DU_USING_ICU_NAMESPACE=0 -DU_ENABLE_DYLOAD=0 -DU_STATIC_IMPLEMENTATION -DICU_UTIL_DATA_IMPL=ICU_UTIL_DATA_FILE -DUCHAR_TYPE=uint16_t -DV8_USE_EXTERNAL_STARTUP_DATA -DSK_IGNORE_LINEONLY_AA_CONVEX_PATH_OPTS -DSK_HAS_PNG_LIBRARY -DSK_HAS_WEBP_LIBRARY -DSK_HAS_JPEG_LIBRARY -DSK_VULKAN_HEADER=\"../../skia/config/SkVulkanConfig.h\" -DSK_VULKAN=1 -DSK_SUPPORT_GPU=1 -DSK_GPU_WORKAROUNDS_HEADER=\"gpu/config/gpu_driver_bug_workaround_autogen.h\" -DVK_NO_PROTOTYPES -DWEBRTC_NON_STATIC_TRACE_EVENT_HANDLERS=0 -DGTEST_RELATIVE_PATH -DWEBRTC_CHROMIUM_BUILD -DWEBRTC_POSIX -DWEBRTC_LINUX -DABSL_ALLOCATOR_NOTHROW=1 -DNO_MAIN_THREAD_WRAPPING -DI18N_ADDRESS_VALIDATION_DATA_URL=\"https://chromium-i18n.appspot.com/ssl-aggregate-address/\" -DUSE_SYSTEM_ZLIB=1 -I../.. -Igen -Igen/shim_headers/zlib_shim -Igen/shim_headers/re2_shim -Igen/shim_headers/snappy_shim -Igen/shim_headers/libpng_shim -Igen/shim_headers/libwebp_shim -Igen/shim_headers/libdrm_shim -I../../third_party/khronos -I../../gpu -I../../third_party/libyuv/include -I../../third_party/vulkan/include -Igen/shim_headers/openh264_shim -Igen/shim_headers/minizip_shim -Igen/shim_headers/flac_shim -I../../third_party/webrtc_overrides -I../../testing/gtest/include -I../../third_party/libyuv/include -I../../third_party/usrsctp/usrsctplib -I../../third_party/webrtc -I../../third_party/protobuf/src -Igen/protoc_out -I../../third_party/protobuf/src -I../../third_party/boringssl/src/include -I../../third_party/leveldatabase -I../../third_party/leveldatabase/src -I../../third_party/leveldatabase/src/include -I../../third_party/ced/src -I../../third_party/icu/source/common -I../../third_party/icu/source/i18n -I../../skia/config -I../../skia/ext -I../../third_party/skia/include/c -I../../third_party/skia/include/config -I../../third_party/skia/include/core -I../../third_party/skia/include/effects -I../../third_party/skia/include/encode -I../../third_party/skia/include/gpu -I../../third_party/skia/include/images -I../../third_party/skia/include/lazy -I../../third_party/skia/include/pathops -I../../third_party/skia/include/pdf -I../../third_party/skia/include/pipe -I../../third_party/skia/include/ports -I../../third_party/skia/include/utils -I../../third_party/vulkan/include -I../../third_party/skia/third_party/vulkanmemoryallocator -I../../third_party/skia/src/gpu -I../../third_party/skia/src/sksl -I../../third_party/vulkan/include -I../../third_party/libwebm/source -I../../v8/include -Igen/v8/include -I../../third_party/webrtc_overrides -I../../third_party/webrtc -I../../third_party/perfetto/include -Igen/third_party/perfetto/protos -Igen/third_party/perfetto/protos -Igen/third_party/perfetto/protos -Igen/third_party/metrics_proto -I../../third_party/mesa/src/include -Igen -Igen -I../../third_party/libaddressinput/src/cpp/include -I../../third_party/cacheinvalidation/overrides -I../../third_party/cacheinvalidation/src -I../../third_party/flatbuffers/src/include -I../../third_party/brotli/include -I../../third_party/webrtc_overrides -I../../testing/gtest/include -I../../third_party/webrtc -Igen -Igen -fno-strict-aliasing --param=ssp-buffer-size=4 -fstack-protector -Wno-builtin-macro-redefined -D__DATE__= -D__TIME__= -D__TIMESTAMP__= -funwind-tables -fPIC -pthread -fcolor-diagnostics -fmerge-all-constants -no-canonical-prefixes -Wall -Wextra -Wimplicit-fallthrough -Wthread-safety -Wno-missing-field-initializers -Wno-unused-parameter -Wno-c++11-narrowing -Wno-covered-switch-default -Wno-unneeded-internal-declaration -Wno-undefined-var-template -Wno-address-of-packed-member -Wno-nonportable-include-path -Wno-user-defined-warnings -Wno-unused-lambda-capture -Wno-null-pointer-arithmetic -Wno-enum-compare-switch -fno-omit-frame-pointer -fvisibility=hidden -Wheader-hygiene -Wstring-conversion -Wtautological-overlap-compare -Wno-nonnull -Wexit-time-destructors -isystem../../../../../../../../../usr/include/glib-2.0 -isystem../../../../../../../../../usr/lib64/glib-2.0/include -isystem../../../../../../../../../usr/include/glib-2.0 -isystem../../../../../../../../../usr/lib64/glib-2.0/include -Wno-header-guard -isystem../../../../../../../../../usr/include/nss -isystem../../../../../../../../../usr/include/nspr -isystem ../../third_party/abseil-cpp -Wno-exit-time-destructors -isystem../../../../../../../../../usr/include/dbus-1.0 -isystem../../../../../../../../../usr/lib64/dbus-1.0/include -std=gnu++14 -fno-exceptions -fno-rtti -fvisibility-inlines-hidden -march=native -O2 -pipe -c ../../chrome/browser/ui/views/relaunch_notification/relaunch_recommended_bubble_view.cc -o obj/chrome/browser/ui/ui/relaunch_recommended_bubble_view.o
ninja: build stopped: subcommand failed.
 * ERROR: www-client/chromium-69.0.3497.100::gentoo failed (compile phase):
 *   ninja -v -j24 -l0 -C out/Release chrome chromedriver failed
 *
 * Call stack:
Back to top
View user's profile Send private message
Fog_Watch
Apprentice
Apprentice


Joined: 24 Jul 2006
Posts: 201
Location: Utility Muffin Research Kitchen

PostPosted: Fri Sep 21, 2018 2:09 am    Post subject: Reply with quote

No "fatal error" here - just didn't finish:
Code:
tail -n 26 build.log
[16588/16588] python "../../build/toolchain/gcc_link_wrapper.py" --output="./chrome" -- x86_64-pc-linux-gnu-clang++ -pie -Wl,--version-script=../../build/linux/chrome.map -fPIC -Wl,-z,noexecstack -Wl,-z,now -Wl,-z,relro -Wl,-z,defs -Wl,--as-needed -rdynamic -Wl,-rpath-link=. -Wl,--disable-new-dtags -Wl,-O1 -Wl,--as-needed -o "./chrome" -Wl,--start-group @"./chrome.rsp"  -Wl,--end-group   -latomic -ldl -lpthread -lrt -lX11 -lX11-xcb -lxcb -lXcomposite -lXcursor -lXdamage -lXext -lXfixes -lXi -lXrender -lXtst -lgmodule-2.0 -lgobject-2.0 -lgthread-2.0 -lglib-2.0 -lsmime3 -lnss3 -lnssutil3 -lplds4 -lplc4 -lnspr4 -lcups -lz -lm -lcrypt -lxml2 -lexpat -lfontconfig -ldbus-1 -lXss -lpng16 -lwebpdemux -lwebpmux -lwebp -lfreetype -ljpeg -lharfbuzz -ldrm -lXrandr -lresolv -lgio-2.0 -lre2 -lsnappy -lpci -lasound -lpangocairo-1.0 -lpango-1.0 -lcairo -latk-1.0 -latk-bridge-2.0 -lminizip -lFLAC -lopenh264 -lgtk-3 -lgdk-3 -lcairo-gobject -lgdk_pixbuf-2.0 -lxslt
FAILED: chrome
python "../../build/toolchain/gcc_link_wrapper.py" --output="./chrome" -- x86_64-pc-linux-gnu-clang++ -pie -Wl,--version-script=../../build/linux/chrome.map -fPIC -Wl,-z,noexecstack -Wl,-z,now -Wl,-z,relro -Wl,-z,defs -Wl,--as-needed -rdynamic -Wl,-rpath-link=. -Wl,--disable-new-dtags -Wl,-O1 -Wl,--as-needed -o "./chrome" -Wl,--start-group @"./chrome.rsp"  -Wl,--end-group   -latomic -ldl -lpthread -lrt -lX11 -lX11-xcb -lxcb -lXcomposite -lXcursor -lXdamage -lXext -lXfixes -lXi -lXrender -lXtst -lgmodule-2.0 -lgobject-2.0 -lgthread-2.0 -lglib-2.0 -lsmime3 -lnss3 -lnssutil3 -lplds4 -lplc4 -lnspr4 -lcups -lz -lm -lcrypt -lxml2 -lexpat -lfontconfig -ldbus-1 -lXss -lpng16 -lwebpdemux -lwebpmux -lwebp -lfreetype -ljpeg -lharfbuzz -ldrm -lXrandr -lresolv -lgio-2.0 -lre2 -lsnappy -lpci -lasound -lpangocairo-1.0 -lpango-1.0 -lcairo -latk-1.0 -latk-bridge-2.0 -lminizip -lFLAC -lopenh264 -lgtk-3 -lgdk-3 -lcairo-gobject -lgdk_pixbuf-2.0 -lxslt
clang-6.0: error: unable to execute command: Killed
clang-6.0: error: linker command failed due to signal (use -v to see invocation)
ninja: build stopped: subcommand failed.
 * ERROR: www-client/chromium-69.0.3497.81::gentoo failed (compile phase):
 *   ninja -v -j4 -l0 -C out/Release chrome chromedriver failed
 *
 * Call stack:
 *     ebuild.sh, line  124:  Called src_compile
 *   environment, line 5001:  Called eninja '-C' 'out/Release' 'chrome' 'chromedriver'
 *   environment, line 1775:  Called die
 * The specific snippet of code:
 *       "$@" || die "${nonfatal_args[@]}" "${*} failed"
 *
 * If you need support, post the output of `emerge --info '=www-client/chromium-69.0.3497.81::gentoo'`,
 * the complete build log and the output of `emerge -pqv '=www-client/chromium-69.0.3497.81::gentoo'`.
 *
 * MemTotal:        8063396 kB
 * SwapTotal:       8388604 kB
 *
 * The complete build log is located at '/var/tmp/portage/www-client/chromium-69.0.3497.81/temp/build.log'.
 * The ebuild environment file is located at '/var/tmp/portage/www-client/chromium-69.0.3497.81/temp/environment'.
 * Working directory: '/var/tmp/portage/www-client/chromium-69.0.3497.81/work/chromium-69.0.3497.81'
 * S: '/var/tmp/portage/www-client/chromium-69.0.3497.81/work/chromium-69.0.3497.81'


Code:
emerge --info
Portage 2.3.49 (python 3.6.5-final-0, default/linux/amd64/17.0/desktop, gcc-7.3.0, glibc-2.26-r7, 4.12.5-gentoo x86_64)
=================================================================
System uname: Linux-4.12.5-gentoo-x86_64-Intel-R-_Core-TM-_i5-7400_CPU_@_3.00GHz-with-gentoo-2.4.1
KiB Mem:     8063396 total,    928556 free
KiB Swap:    8388604 total,   8388604 free
Timestamp of repository gentoo: Thu, 20 Sep 2018 13:15:01 +0000
Head commit of repository gentoo: 0b5b4b4c8770a61a9eb28ca5fc45ceca65a7ee6d
sh bash 4.4_p12
ld GNU ld (Gentoo 2.29.1 p3) 2.29.1
app-shells/bash:          4.4_p12::gentoo
dev-java/java-config:     2.2.0-r4::gentoo
dev-lang/perl:            5.24.3-r1::gentoo
dev-lang/python:          2.7.15::gentoo, 3.5.5::gentoo, 3.6.5::gentoo
dev-util/cmake:           3.9.6::gentoo
dev-util/pkgconfig:       0.29.2::gentoo
sys-apps/baselayout:      2.4.1-r2::gentoo
sys-apps/openrc:          0.34.11::gentoo
sys-apps/sandbox:         2.13::gentoo
sys-devel/autoconf:       2.13::gentoo, 2.69-r4::gentoo
sys-devel/automake:       1.11.6-r3::gentoo, 1.15.1-r2::gentoo
sys-devel/binutils:       2.29.1-r1::gentoo, 2.30-r2::gentoo
sys-devel/gcc:            5.4.0-r4::gentoo, 6.4.0-r1::gentoo, 7.3.0-r3::gentoo
sys-devel/gcc-config:     1.8-r1::gentoo
sys-devel/libtool:        2.4.6-r3::gentoo
sys-devel/make:           4.2.1-r4::gentoo
sys-kernel/linux-headers: 4.13::gentoo (virtual/os-headers)
sys-libs/glibc:           2.26-r7::gentoo
Repositories:

gentoo
    location: /mnt/auto/portage
    sync-type: rsync
    sync-uri: rsync://rsync1.au.gentoo.org/gentoo-portage/
    priority: -1000
    sync-rsync-extra-opts:
    sync-rsync-verify-jobs: 1
    sync-rsync-verify-max-age: 24
    sync-rsync-verify-metamanifest: yes

argent-main
    location: /mnt/auto/layman/argent-main
    priority: 50

idb
    location: /mnt/auto/layman/idb
    masters: gentoo
    priority: 50

laurentb
    location: /mnt/auto/layman/laurentb
    masters: gentoo
    priority: 50

ACCEPT_KEYWORDS="amd64"
ACCEPT_LICENSE="* -@EULA Oracle-BCLA-JavaSE"
CBUILD="x86_64-pc-linux-gnu"
CFLAGS="-march=native"
CHOST="x86_64-pc-linux-gnu"
CONFIG_PROTECT="/etc /usr/lib64/libreoffice/program/sofficerc /usr/share/config /usr/share/gnupg/qualified.txt"
CONFIG_PROTECT_MASK="/etc/ca-certificates.conf /etc/dconf /etc/env.d /etc/fonts/fonts.conf /etc/gconf /etc/gentoo-release /etc/revdep-rebuild /etc/sandbox.d /etc/terminfo /etc/texmf/language.dat.d /etc/texmf/language.def.d /etc/texmf/updmap.d /etc/texmf/web2c"
CXXFLAGS="-march=native"
DISTDIR="/usr/portage/distfiles"
ENV_UNSET="DBUS_SESSION_BUS_ADDRESS DISPLAY PERL5LIB PERL5OPT PERLPREFIX PERL_CORE PERL_MB_OPT PERL_MM_OPT XAUTHORITY XDG_CACHE_HOME XDG_CONFIG_HOME XDG_DATA_HOME XDG_RUNTIME_DIR"
FCFLAGS="-O2 -pipe"
FEATURES="assume-digests binpkg-logs config-protect-if-modified distlocks ebuild-locks fixlafiles merge-sync multilib-strict news parallel-fetch preserve-libs protect-owned sandbox sfperms strict unknown-features-warn unmerge-logs unmerge-orphans userfetch userpriv usersandbox usersync xattr"
FFLAGS="-O2 -pipe"
GENTOO_MIRRORS="http://mirror.exetel.com.au/pub/gentoo/"
LANG="en_US.utf8"
LDFLAGS="-Wl,-O1 -Wl,--as-needed"
LINGUAS="en"
MAKEOPTS="-j4"
PKGDIR="/usr/portage/packages"
PORTAGE_CONFIGROOT="/"
PORTAGE_RSYNC_OPTS="--recursive --links --safe-links --perms --times --omit-dir-times --compress --force --whole-file --delete --stats --human-readable --timeout=180 --exclude=/distfiles --exclude=/local --exclude=/packages --exclude=/.git"
PORTAGE_TMPDIR="/var/tmp"
USE="X a52 aac acl acpi alsa amd64 berkdb branding bzip2 cairo cdda cdr cli consolekit crypt cups cxx dri dts dvd dvdr emboss encode exif fam flac fortran gdbm gif glamor gpm gtk iconv jpeg lcms libnotify libtirpc mad mmx mng modules mp3 mp4 mpeg multilib ncurses nls nptl ogg opengl openmp pam pango pcre pdf png policykit ppds qt5 readline sdl seccomp spell sse sse2 ssl startup-notification svg tcpd tiff truetype udev udisks unicode upower usb vorbis wxwidgets x264 xattr xcb xml xv xvid zlib" ABI_X86="64" ALSA_CARDS="ali5451 als4000 atiixp atiixp-modem bt87x ca0106 cmipci emu10k1x ens1370 ens1371 es1938 es1968 fm801 hda-intel intel8x0 intel8x0m maestro3 trident usb-audio via82xx via82xx-modem ymfpci" APACHE2_MODULES="authn_core authz_core socache_shmcb unixd actions alias auth_basic authn_alias authn_anon authn_dbm authn_default authn_file authz_dbm authz_default authz_groupfile authz_host authz_owner authz_user autoindex cache cgi cgid dav dav_fs dav_lock deflate dir disk_cache env expires ext_filter file_cache filter headers include info log_config logio mem_cache mime mime_magic negotiation rewrite setenvif speling status unique_id userdir usertrack vhost_alias" CALLIGRA_FEATURES="karbon plan sheets stage words" COLLECTD_PLUGINS="df interface irq load memory rrdtool swap syslog" CPU_FLAGS_X86="mmx mmxext sse sse2" ELIBC="glibc" GPSD_PROTOCOLS="ashtech aivdm earthmate evermore fv18 garmin garmintxt gpsclock isync itrax mtk3301 nmea ntrip navcom oceanserver oldstyle oncore rtcm104v2 rtcm104v3 sirf skytraq superstar2 timing tsip tripmate tnt ublox ubx" GRUB_PLATFORMS="efi-64" INPUT_DEVICES="libinput" KERNEL="linux" LCD_DEVICES="bayrad cfontz cfontz633 glk hd44780 lb216 lcdm001 mtxorb ncurses text" LIBREOFFICE_EXTENSIONS="presenter-console presenter-minimizer" OFFICE_IMPLEMENTATION="libreoffice" PHP_TARGETS="php5-6 php7-0" POSTGRES_TARGETS="postgres9_5 postgres10" PYTHON_SINGLE_TARGET="python3_6" PYTHON_TARGETS="python2_7 python3_6" RUBY_TARGETS="ruby23" SANE_BACKENDS="net" USERLAND="GNU" VIDEO_CARDS="i965 i915 intel" XTABLES_ADDONS="quota2 psd pknock lscan length2 ipv4options ipset ipp2p iface geoip fuzzy condition tee tarpit sysrq steal rawnat logmark ipmark dhcpmac delude chaos account"
Unset:  CC, CPPFLAGS, CTARGET, CXX, EMERGE_DEFAULT_OPTS, INSTALL_MASK, LC_ALL, PORTAGE_BINHOST, PORTAGE_BUNZIP2_COMMAND, PORTAGE_COMPRESS, PORTAGE_COMPRESS_FLAGS, PORTAGE_RSYNC_EXTRA_OPTS
Back to top
View user's profile Send private message
jagdpanther
Guru
Guru


Joined: 22 Nov 2003
Posts: 476

PostPosted: Fri Sep 21, 2018 2:33 am    Post subject: Reply with quote

Fog_watch:

Did you grep the build.log for "fatal error"? Strangely, the "fatal error" message I received was not at the very end of my build log. (Which may be caused by chromium building in parallel.)
Back to top
View user's profile Send private message
Fog_Watch
Apprentice
Apprentice


Joined: 24 Jul 2006
Posts: 201
Location: Utility Muffin Research Kitchen

PostPosted: Fri Sep 21, 2018 2:46 am    Post subject: Reply with quote

grep -i "fatal error" build.log returns nothing.
Back to top
View user's profile Send private message
frsty
n00b
n00b


Joined: 11 Jul 2016
Posts: 11

PostPosted: Fri Sep 21, 2018 8:16 am    Post subject: Reply with quote

I had a similar error, but also not a very clear error. Switching to gcc-7.3 solved my issue. But since you're already on gcc-7.3 that's strange.

Did you follow these steps from the handbook? https://wiki.gentoo.org/wiki/Upgrading_GCC
Back to top
View user's profile Send private message
jagdpanther
Guru
Guru


Joined: 22 Nov 2003
Posts: 476

PostPosted: Fri Sep 21, 2018 3:37 pm    Post subject: Reply with quote

frsty:

Thanks for the suggestion. Yes on my older Gentoo system, I followed that wiki page. On my newer system (2 months old) gcc-7.3.0 is the only version of gcc that was ever on it. I have the chromium issue on both systems.
Back to top
View user's profile Send private message
Fog_Watch
Apprentice
Apprentice


Joined: 24 Jul 2006
Posts: 201
Location: Utility Muffin Research Kitchen

PostPosted: Sat Sep 22, 2018 11:37 pm    Post subject: Reply with quote

frsty wrote:
Did you follow these steps from the handbook? https://wiki.gentoo.org/wiki/Upgrading_GCC

I went through these steps and again, compiled version 69 and came up with the same error. I'm now trying =www-client/chromium-70.0.3538.16.

<Slightly off topic>
With jumbo-build I get the error in about a third of the time.
</Slightly off topic>
EDIT
Which returned a sparkly new platform_jumbo_6.o error, but maybe not so new:

Code:
[9345/9995] touch obj/media/mojo/interfaces/interfaces_blink.inputdeps.stamp
[9346/9995] x86_64-pc-linux-gnu-clang++ -MMD -MF obj/third_party/blink/renderer/platform/platform/platform_jumbo_6.o.d -DV8_DEPRECATION_WARNINGS -DUSE_UDEV -DUSE_AURA=1 -DUSE_GLIB=1 -DUSE_NSS_CERTS=1 -DUSE_X11=1 -DNO_TCMALLOC -DFULL_SAFE_BROWSING -DSAFE_BROWSING_CSD -DSAFE_BROWSING_DB_LOCAL -DCHROMIUM_BUILD -D_FILE_OFFSET_BITS=64 -D_LARGEFILE_SOURCE -D_LARGEFILE64_SOURCE -D_GNU_SOURCE -D__STDC_CONSTANT_MACROS -D__STDC_FORMAT_MACROS -DNDEBUG -DNVALGRIND -DDYNAMIC_ANNOTATIONS_ENABLED=0 -DBLINK_IMPLEMENTATION=1 -DINSIDE_BLINK -DBLINK_PLATFORM_IMPLEMENTATION=1 -DGLIB_VERSION_MAX_ALLOWED=GLIB_VERSION_2_32 -DGLIB_VERSION_MIN_REQUIRED=GLIB_VERSION_2_26 -DENABLE_IPC_FUZZER -DGL_GLEXT_PROTOTYPES -DUSE_GLX -DUSE_EGL -DVK_NO_PROTOTYPES -DWTF_USE_WEBAUDIO_FFMPEG=1 -DSUPPORT_WEBGL2_COMPUTE_CONTEXT=1 -DWTF_USE_DEFAULT_RENDER_THEME=1 -DSK_IGNORE_LINEONLY_AA_CONVEX_PATH_OPTS -DSK_HAS_PNG_LIBRARY -DSK_HAS_WEBP_LIBRARY -DSK_HAS_JPEG_LIBRARY -DSK_VULKAN_HEADER=\"../../skia/config/SkVulkanConfig.h\" -DSK_VULKAN=1 -DSK_SUPPORT_GPU=1 -DSK_GPU_WORKAROUNDS_HEADER=\"gpu/config/gpu_driver_bug_workaround_autogen.h\" -DVK_NO_PROTOTYPES -DGOOGLE_PROTOBUF_NO_RTTI -DGOOGLE_PROTOBUF_NO_STATIC_INITIALIZER -DHAVE_PTHREAD -DU_USING_ICU_NAMESPACE=0 -DU_ENABLE_DYLOAD=0 -DU_STATIC_IMPLEMENTATION -DICU_UTIL_DATA_IMPL=ICU_UTIL_DATA_FILE -DUCHAR_TYPE=uint16_t -DWEBRTC_NON_STATIC_TRACE_EVENT_HANDLERS=0 -DWEBRTC_CHROMIUM_BUILD -DWEBRTC_POSIX -DWEBRTC_LINUX -DABSL_ALLOCATOR_NOTHROW=1 -DNO_MAIN_THREAD_WRAPPING -DUSE_SYSTEM_LIBJPEG -DV8_DEPRECATION_WARNINGS -DV8_DEPRECATION_WARNINGS -DLEVELDB_PLATFORM_CHROMIUM=1 -I../../third_party/ffmpeg -I. -I../.. -Igen -Igen/shim_headers/libpng_shim -Igen/shim_headers/libwebp_shim -Igen/shim_headers/zlib_shim -I../../third_party/khronos -I../../gpu -Igen/shim_headers/libdrm_shim -I../../third_party/libyuv/include -I../../third_party/vulkan/include -Igen/shim_headers/re2_shim -Igen/shim_headers/snappy_shim -Igen/shim_headers/openh264_shim -I../../skia/config -I../../skia/ext -I../../third_party/skia/include/c -I../../third_party/skia/include/config -I../../third_party/skia/include/core -I../../third_party/skia/include/effects -I../../third_party/skia/include/encode -I../../third_party/skia/include/gpu -I../../third_party/skia/include/images -I../../third_party/skia/include/lazy -I../../third_party/skia/include/pathops -I../../third_party/skia/include/pdf -I../../third_party/skia/include/pipe -I../../third_party/skia/include/ports -I../../third_party/skia/include/utils -I../../third_party/vulkan/include -I../../third_party/skia/third_party/vulkanmemoryallocator -I../../third_party/skia/src/gpu -I../../third_party/skia/src/sksl -I../../third_party/skia/modules/skottie/include -I../../third_party/vulkan/include -I../../third_party/protobuf/src -Igen/protoc_out -I../../third_party/protobuf/src -I../../third_party/boringssl/src/include -I../../third_party/icu/source/common -I../../third_party/icu/source/i18n -I../../third_party/ced/src -I../../third_party/webrtc_overrides -I../../third_party/webrtc -I../../third_party/abseil-cpp -I../../v8/include -Igen/v8/include -I../../third_party/iccjpeg -I../../third_party/ots/include -I../../v8/include -Igen/v8/include -I../../third_party/libwebm/source -I../../third_party/leveldatabase -I../../third_party/leveldatabase/src -I../../third_party/leveldatabase/src/include -I../../third_party/ffmpeg/chromium/config/Chrome/linux/x64 -I../../third_party/ffmpeg -fno-strict-aliasing --param=ssp-buffer-size=4 -fstack-protector -Wno-builtin-macro-redefined -D__DATE__= -D__TIME__= -D__TIMESTAMP__= -funwind-tables -fPIC -pthread -fcolor-diagnostics -fmerge-all-constants -no-canonical-prefixes -Wall -Wextra -Wimplicit-fallthrough -Wthread-safety -Wno-missing-field-initializers -Wno-unused-parameter -Wno-c++11-narrowing -Wno-covered-switch-default -Wno-unneeded-internal-declaration -Wno-undefined-var-template -Wno-nonportable-include-path -Wno-user-defined-warnings -Wno-unused-lambda-capture -Wno-null-pointer-arithmetic -Wno-enum-compare-switch -fno-omit-frame-pointer -fvisibility=hidden -Wheader-hygiene -Wstring-conversion -Wtautological-overlap-compare -Wglobal-constructors -I/usr/include/glib-2.0 -I/usr/lib64/glib-2.0/include -Wno-header-guard -I/usr/include/nss -I/usr/include/nspr -I/usr/include/libpng16 -I/usr/include/freetype2 -I/usr/include/harfbuzz -I/usr/include/glib-2.0 -I/usr/lib64/glib-2.0/include -std=c++14 -fno-exceptions -fno-rtti -fvisibility-inlines-hidden -march=native -c gen/third_party/blink/renderer/platform/platform_jumbo_6.cc -o obj/third_party/blink/renderer/platform/platform/platform_jumbo_6.o
FAILED: obj/third_party/blink/renderer/platform/platform/platform_jumbo_6.o
x86_64-pc-linux-gnu-clang++ -MMD -MF obj/third_party/blink/renderer/platform/platform/platform_jumbo_6.o.d -DV8_DEPRECATION_WARNINGS -DUSE_UDEV -DUSE_AURA=1 -DUSE_GLIB=1 -DUSE_NSS_CERTS=1 -DUSE_X11=1 -DNO_TCMALLOC -DFULL_SAFE_BROWSING -DSAFE_BROWSING_CSD -DSAFE_BROWSING_DB_LOCAL -DCHROMIUM_BUILD -D_FILE_OFFSET_BITS=64 -D_LARGEFILE_SOURCE -D_LARGEFILE64_SOURCE -D_GNU_SOURCE -D__STDC_CONSTANT_MACROS -D__STDC_FORMAT_MACROS -DNDEBUG -DNVALGRIND -DDYNAMIC_ANNOTATIONS_ENABLED=0 -DBLINK_IMPLEMENTATION=1 -DINSIDE_BLINK -DBLINK_PLATFORM_IMPLEMENTATION=1 -DGLIB_VERSION_MAX_ALLOWED=GLIB_VERSION_2_32 -DGLIB_VERSION_MIN_REQUIRED=GLIB_VERSION_2_26 -DENABLE_IPC_FUZZER -DGL_GLEXT_PROTOTYPES -DUSE_GLX -DUSE_EGL -DVK_NO_PROTOTYPES -DWTF_USE_WEBAUDIO_FFMPEG=1 -DSUPPORT_WEBGL2_COMPUTE_CONTEXT=1 -DWTF_USE_DEFAULT_RENDER_THEME=1 -DSK_IGNORE_LINEONLY_AA_CONVEX_PATH_OPTS -DSK_HAS_PNG_LIBRARY -DSK_HAS_WEBP_LIBRARY -DSK_HAS_JPEG_LIBRARY -DSK_VULKAN_HEADER=\"../../skia/config/SkVulkanConfig.h\" -DSK_VULKAN=1 -DSK_SUPPORT_GPU=1 -DSK_GPU_WORKAROUNDS_HEADER=\"gpu/config/gpu_driver_bug_workaround_autogen.h\" -DVK_NO_PROTOTYPES -DGOOGLE_PROTOBUF_NO_RTTI -DGOOGLE_PROTOBUF_NO_STATIC_INITIALIZER -DHAVE_PTHREAD -DU_USING_ICU_NAMESPACE=0 -DU_ENABLE_DYLOAD=0 -DU_STATIC_IMPLEMENTATION -DICU_UTIL_DATA_IMPL=ICU_UTIL_DATA_FILE -DUCHAR_TYPE=uint16_t -DWEBRTC_NON_STATIC_TRACE_EVENT_HANDLERS=0 -DWEBRTC_CHROMIUM_BUILD -DWEBRTC_POSIX -DWEBRTC_LINUX -DABSL_ALLOCATOR_NOTHROW=1 -DNO_MAIN_THREAD_WRAPPING -DUSE_SYSTEM_LIBJPEG -DV8_DEPRECATION_WARNINGS -DV8_DEPRECATION_WARNINGS -DLEVELDB_PLATFORM_CHROMIUM=1 -I../../third_party/ffmpeg -I. -I../.. -Igen -Igen/shim_headers/libpng_shim -Igen/shim_headers/libwebp_shim -Igen/shim_headers/zlib_shim -I../../third_party/khronos -I../../gpu -Igen/shim_headers/libdrm_shim -I../../third_party/libyuv/include -I../../third_party/vulkan/include -Igen/shim_headers/re2_shim -Igen/shim_headers/snappy_shim -Igen/shim_headers/openh264_shim -I../../skia/config -I../../skia/ext -I../../third_party/skia/include/c -I../../third_party/skia/include/config -I../../third_party/skia/include/core -I../../third_party/skia/include/effects -I../../third_party/skia/include/encode -I../../third_party/skia/include/gpu -I../../third_party/skia/include/images -I../../third_party/skia/include/lazy -I../../third_party/skia/include/pathops -I../../third_party/skia/include/pdf -I../../third_party/skia/include/pipe -I../../third_party/skia/include/ports -I../../third_party/skia/include/utils -I../../third_party/vulkan/include -I../../third_party/skia/third_party/vulkanmemoryallocator -I../../third_party/skia/src/gpu -I../../third_party/skia/src/sksl -I../../third_party/skia/modules/skottie/include -I../../third_party/vulkan/include -I../../third_party/protobuf/src -Igen/protoc_out -I../../third_party/protobuf/src -I../../third_party/boringssl/src/include -I../../third_party/icu/source/common -I../../third_party/icu/source/i18n -I../../third_party/ced/src -I../../third_party/webrtc_overrides -I../../third_party/webrtc -I../../third_party/abseil-cpp -I../../v8/include -Igen/v8/include -I../../third_party/iccjpeg -I../../third_party/ots/include -I../../v8/include -Igen/v8/include -I../../third_party/libwebm/source -I../../third_party/leveldatabase -I../../third_party/leveldatabase/src -I../../third_party/leveldatabase/src/include -I../../third_party/ffmpeg/chromium/config/Chrome/linux/x64 -I../../third_party/ffmpeg -fno-strict-aliasing --param=ssp-buffer-size=4 -fstack-protector -Wno-builtin-macro-redefined -D__DATE__= -D__TIME__= -D__TIMESTAMP__= -funwind-tables -fPIC -pthread -fcolor-diagnostics -fmerge-all-constants -no-canonical-prefixes -Wall -Wextra -Wimplicit-fallthrough -Wthread-safety -Wno-missing-field-initializers -Wno-unused-parameter -Wno-c++11-narrowing -Wno-covered-switch-default -Wno-unneeded-internal-declaration -Wno-undefined-var-template -Wno-nonportable-include-path -Wno-user-defined-warnings -Wno-unused-lambda-capture -Wno-null-pointer-arithmetic -Wno-enum-compare-switch -fno-omit-frame-pointer -fvisibility=hidden -Wheader-hygiene -Wstring-conversion -Wtautological-overlap-compare -Wglobal-constructors -I/usr/include/glib-2.0 -I/usr/lib64/glib-2.0/include -Wno-header-guard -I/usr/include/nss -I/usr/include/nspr -I/usr/include/libpng16 -I/usr/include/freetype2 -I/usr/include/harfbuzz -I/usr/include/glib-2.0 -I/usr/lib64/glib-2.0/include -std=c++14 -fno-exceptions -fno-rtti -fvisibility-inlines-hidden -march=native -c gen/third_party/blink/renderer/platform/platform_jumbo_6.cc -o obj/third_party/blink/renderer/platform/platform/platform_jumbo_6.o
In file included from gen/third_party/blink/renderer/platform/platform_jumbo_6.cc:20:
../../third_party/ffmpeg/../../third_party/blink/renderer/platform/fonts/shaping/harfbuzz_face.cc:320:5: error: use of undeclared identifier 'hb_font_funcs_set_glyph_h_advances_func'; did you mean 'hb_font_funcs_set_glyph_h_advance_func'?
    hb_font_funcs_set_glyph_h_advances_func(
    ^~~~~~~~~~~~~~~~~~~~~~~~~~~~~~~~~~~~~~~
    hb_font_funcs_set_glyph_h_advance_func
/usr/include/harfbuzz/hb-font.h:247:1: note: 'hb_font_funcs_set_glyph_h_advance_func' declared here
hb_font_funcs_set_glyph_h_advance_func (hb_font_funcs_t *ffuncs,
^
In file included from gen/third_party/blink/renderer/platform/platform_jumbo_6.cc:20:
../../third_party/ffmpeg/../../third_party/blink/renderer/platform/fonts/shaping/harfbuzz_face.cc:321:16: error: cannot initialize a parameter of type 'hb_font_get_glyph_h_advance_func_t' (aka 'int (*)(hb_font_t *, void *, unsigned int, void *)') with an lvalue of type 'void (hb_font_t *, void *, unsigned int, hb_codepoint_t *, unsigned int, hb_position_t *, unsigned int, void *)' (aka 'void (hb_font_t *, void *, unsigned int, unsigned int *, unsigned int, int *, unsigned int, void *)'): different number of parameters (4 vs 8)
        funcs, HarfBuzzGetGlyphHorizontalAdvances, nullptr, nullptr);
               ^~~~~~~~~~~~~~~~~~~~~~~~~~~~~~~~~~
/usr/include/harfbuzz/hb-font.h:248:41: note: passing argument to parameter 'func' here
                                        hb_font_get_glyph_h_advance_func_t func,
                                                                           ^
2 errors generated.
[9347/9995] x86_64-pc-linux-gnu-clang++ -MMD -MF obj/media/capture/mojom/video_capture_blink/video_capture_blink_jumbo_1.o.d -DV8_DEPRECATION_WARNINGS -DUSE_UDEV -DUSE_AURA=1 -DUSE_GLIB=1 -DUSE_NSS_CERTS=1 -DUSE_X11=1 -DNO_TCMALLOC -DFULL_SAFE_BROWSING -DSAFE_BROWSING_CSD -DSAFE_BROWSING_DB_LOCAL -DCHROMIUM_BUILD -D_FILE_OFFSET_BITS=64 -D_LARGEFILE_SOURCE -D_LARGEFILE64_SOURCE -D_GNU_SOURCE -D__STDC_CONSTANT_MACROS -D__STDC_FORMAT_MACROS -DNDEBUG -DNVALGRIND -DDYNAMIC_ANNOTATIONS_ENABLED=0 -DENABLE_IPC_FUZZER -DGLIB_VERSION_MAX_ALLOWED=GLIB_VERSION_2_32 -DGLIB_VERSION_MIN_REQUIRED=GLIB_VERSION_2_26 -DGL_GLEXT_PROTOTYPES -DUSE_GLX -DUSE_EGL -DVK_NO_PROTOTYPES -DU_USING_ICU_NAMESPACE=0 -DU_ENABLE_DYLOAD=0 -DU_STATIC_IMPLEMENTATION -DICU_UTIL_DATA_IMPL=ICU_UTIL_DATA_FILE -DUCHAR_TYPE=uint16_t -DGOOGLE_PROTOBUF_NO_RTTI -DGOOGLE_PROTOBUF_NO_STATIC_INITIALIZER -DHAVE_PTHREAD -DWTF_USE_WEBAUDIO_FFMPEG=1 -DSUPPORT_WEBGL2_COMPUTE_CONTEXT=1 -DWTF_USE_DEFAULT_RENDER_THEME=1 -DSK_IGNORE_LINEONLY_AA_CONVEX_PATH_OPTS -DSK_HAS_PNG_LIBRARY -DSK_HAS_WEBP_LIBRARY -DSK_HAS_JPEG_LIBRARY -DSK_VULKAN_HEADER=\"../../skia/config/SkVulkanConfig.h\" -DSK_VULKAN=1 -DSK_SUPPORT_GPU=1 -DSK_GPU_WORKAROUNDS_HEADER=\"gpu/config/gpu_driver_bug_workaround_autogen.h\" -DVK_NO_PROTOTYPES -I. -I../.. -Igen -Igen/shim_headers/zlib_shim -Igen/shim_headers/libpng_shim -Igen/shim_headers/libwebp_shim -Igen/shim_headers/libdrm_shim -I../../third_party/libyuv/include -Igen/shim_headers/re2_shim -Igen/shim_headers/snappy_shim -I../../third_party/khronos -I../../gpu -I../../third_party/vulkan/include -Igen/shim_headers/openh264_shim -I../../third_party/ced/src -I../../third_party/icu/source/common -I../../third_party/icu/source/i18n -I../../third_party/protobuf/src -I../../skia/config -I../../skia/ext -I../../third_party/skia/include/c -I../../third_party/skia/include/config -I../../third_party/skia/include/core -I../../third_party/skia/include/effects -I../../third_party/skia/include/encode -I../../third_party/skia/include/gpu -I../../third_party/skia/include/images -I../../third_party/skia/include/lazy -I../../third_party/skia/include/pathops -I../../third_party/skia/include/pdf -I../../third_party/skia/include/pipe -I../../third_party/skia/include/ports -I../../third_party/skia/include/utils -I../../third_party/vulkan/include -I../../third_party/skia/third_party/vulkanmemoryallocator -I../../third_party/skia/src/gpu -I../../third_party/skia/src/sksl -I../../third_party/skia/modules/skottie/include -I../../third_party/vulkan/include -fno-strict-aliasing --param=ssp-buffer-size=4 -fstack-protector -Wno-builtin-macro-redefined -D__DATE__= -D__TIME__= -D__TIMESTAMP__= -funwind-tables -fPIC -pthread -fcolor-diagnostics -fmerge-all-constants -no-canonical-prefixes -Wall -Wextra -Wimplicit-fallthrough -Wthread-safety -Wno-missing-field-initializers -Wno-unused-parameter -Wno-c++11-narrowing -Wno-covered-switch-default -Wno-unneeded-internal-declaration -Wno-undefined-var-template -Wno-nonportable-include-path -Wno-user-defined-warnings -Wno-unused-lambda-capture -Wno-null-pointer-arithmetic -Wno-enum-compare-switch -fno-omit-frame-pointer -fvisibility=hidden -Wheader-hygiene -Wstring-conversion -Wtautological-overlap-compare -I/usr/include/glib-2.0 -I/usr/lib64/glib-2.0/include -std=c++14 -fno-exceptions -fno-rtti -fvisibility-inlines-hidden -march=native -c gen/media/capture/mojom/video_capture_blink_jumbo_1.cc -o obj/media/capture/mojom/video_capture_blink/video_capture_blink_jumbo_1.o
[9348/9995] x86_64-pc-linux-gnu-clang++ -MMD -MF obj/third_party/blink/renderer/platform/heap/heap/heap_jumbo_1.o.d -DV8_DEPRECATION_WARNINGS -DUSE_UDEV -DUSE_AURA=1 -DUSE_GLIB=1 -DUSE_NSS_CERTS=1 -DUSE_X11=1 -DNO_TCMALLOC -DFULL_SAFE_BROWSING -DSAFE_BROWSING_CSD -DSAFE_BROWSING_DB_LOCAL -DCHROMIUM_BUILD -D_FILE_OFFSET_BITS=64 -D_LARGEFILE_SOURCE -D_LARGEFILE64_SOURCE -D_GNU_SOURCE -D__STDC_CONSTANT_MACROS -D__STDC_FORMAT_MACROS -DNDEBUG -DNVALGRIND -DDYNAMIC_ANNOTATIONS_ENABLED=0 -DBLINK_IMPLEMENTATION=1 -DINSIDE_BLINK -DBLINK_IMPLEMENTATION=1 -DINSIDE_BLINK -DBLINK_PLATFORM_IMPLEMENTATION=1 -DGLIB_VERSION_MAX_ALLOWED=GLIB_VERSION_2_32 -DGLIB_VERSION_MIN_REQUIRED=GLIB_VERSION_2_26 -DENABLE_IPC_FUZZER -DGL_GLEXT_PROTOTYPES -DUSE_GLX -DUSE_EGL -DVK_NO_PROTOTYPES -DWTF_USE_WEBAUDIO_FFMPEG=1 -DSUPPORT_WEBGL2_COMPUTE_CONTEXT=1 -DWTF_USE_DEFAULT_RENDER_THEME=1 -DSK_IGNORE_LINEONLY_AA_CONVEX_PATH_OPTS -DSK_HAS_PNG_LIBRARY -DSK_HAS_WEBP_LIBRARY -DSK_HAS_JPEG_LIBRARY -DSK_VULKAN_HEADER=\"../../skia/config/SkVulkanConfig.h\" -DSK_VULKAN=1 -DSK_SUPPORT_GPU=1 -DSK_GPU_WORKAROUNDS_HEADER=\"gpu/config/gpu_driver_bug_workaround_autogen.h\" -DVK_NO_PROTOTYPES -DGOOGLE_PROTOBUF_NO_RTTI -DGOOGLE_PROTOBUF_NO_STATIC_INITIALIZER -DHAVE_PTHREAD -DU_USING_ICU_NAMESPACE=0 -DU_ENABLE_DYLOAD=0 -DU_STATIC_IMPLEMENTATION -DICU_UTIL_DATA_IMPL=ICU_UTIL_DATA_FILE -DUCHAR_TYPE=uint16_t -DWEBRTC_NON_STATIC_TRACE_EVENT_HANDLERS=0 -DWEBRTC_CHROMIUM_BUILD -DWEBRTC_POSIX -DWEBRTC_LINUX -DABSL_ALLOCATOR_NOTHROW=1 -DNO_MAIN_THREAD_WRAPPING -DUSE_SYSTEM_LIBJPEG -DV8_DEPRECATION_WARNINGS -DV8_DEPRECATION_WARNINGS -I. -I../.. -Igen -Igen/shim_headers/libpng_shim -Igen/shim_headers/libwebp_shim -Igen/shim_headers/zlib_shim -I../../third_party/khronos -I../../gpu -Igen/shim_headers/libdrm_shim -I../../third_party/libyuv/include -I../../third_party/vulkan/include -Igen/shim_headers/re2_shim -Igen/shim_headers/snappy_shim -Igen/shim_headers/openh264_shim -I../../skia/config -I../../skia/ext -I../../third_party/skia/include/c -I../../third_party/skia/include/config -I../../third_party/skia/include/core -I../../third_party/skia/include/effects -I../../third_party/skia/include/encode -I../../third_party/skia/include/gpu -I../../third_party/skia/include/images -I../../third_party/skia/include/lazy -I../../third_party/skia/include/pathops -I../../third_party/skia/include/pdf -I../../third_party/skia/include/pipe -I../../third_party/skia/include/ports -I../../third_party/skia/include/utils -I../../third_party/vulkan/include -I../../third_party/skia/third_party/vulkanmemoryallocator -I../../third_party/skia/src/gpu -I../../third_party/skia/src/sksl -I../../third_party/skia/modules/skottie/include -I../../third_party/vulkan/include -I../../third_party/protobuf/src -Igen/protoc_out -I../../third_party/protobuf/src -I../../third_party/boringssl/src/include -I../../third_party/icu/source/common -I../../third_party/icu/source/i18n -I../../third_party/ced/src -I../../third_party/webrtc_overrides -I../../third_party/webrtc -I../../third_party/abseil-cpp -I../../v8/include -Igen/v8/include -I../../third_party/iccjpeg -I../../third_party/ots/include -I../../v8/include -Igen/v8/include -fno-strict-aliasing --param=ssp-buffer-size=4 -fstack-protector -Wno-builtin-macro-redefined -D__DATE__= -D__TIME__= -D__TIMESTAMP__= -funwind-tables -fPIC -pthread -fcolor-diagnostics -fmerge-all-constants -no-canonical-prefixes -Wall -Wextra -Wimplicit-fallthrough -Wthread-safety -Wno-missing-field-initializers -Wno-unused-parameter -Wno-c++11-narrowing -Wno-covered-switch-default -Wno-unneeded-internal-declaration -Wno-undefined-var-template -Wno-nonportable-include-path -Wno-user-defined-warnings -Wno-unused-lambda-capture -Wno-null-pointer-arithmetic -Wno-enum-compare-switch -fno-omit-frame-pointer -fvisibility=hidden -Wheader-hygiene -Wstring-conversion -Wtautological-overlap-compare -Wexit-time-destructors -Wglobal-constructors -I/usr/include/glib-2.0 -I/usr/lib64/glib-2.0/include -Wno-header-guard -I/usr/include/nss -I/usr/include/nspr -I/usr/include/libpng16 -std=c++14 -fno-exceptions -fno-rtti -fvisibility-inlines-hidden -march=native -c gen/third_party/blink/renderer/platform/heap/heap_jumbo_1.cc -o obj/third_party/blink/renderer/platform/heap/heap/heap_jumbo_1.o
[9349/9995] x86_64-pc-linux-gnu-clang++ -MMD -MF obj/media/mojo/interfaces/interfaces_blink/interfaces_blink_jumbo_1.o.d -DV8_DEPRECATION_WARNINGS -DUSE_UDEV -DUSE_AURA=1 -DUSE_GLIB=1 -DUSE_NSS_CERTS=1 -DUSE_X11=1 -DNO_TCMALLOC -DFULL_SAFE_BROWSING -DSAFE_BROWSING_CSD -DSAFE_BROWSING_DB_LOCAL -DCHROMIUM_BUILD -D_FILE_OFFSET_BITS=64 -D_LARGEFILE_SOURCE -D_LARGEFILE64_SOURCE -D_GNU_SOURCE -D__STDC_CONSTANT_MACROS -D__STDC_FORMAT_MACROS -DNDEBUG -DNVALGRIND -DDYNAMIC_ANNOTATIONS_ENABLED=0 -DENABLE_IPC_FUZZER -DGLIB_VERSION_MAX_ALLOWED=GLIB_VERSION_2_32 -DGLIB_VERSION_MIN_REQUIRED=GLIB_VERSION_2_26 -DGL_GLEXT_PROTOTYPES -DUSE_GLX -DUSE_EGL -DVK_NO_PROTOTYPES -DU_USING_ICU_NAMESPACE=0 -DU_ENABLE_DYLOAD=0 -DU_STATIC_IMPLEMENTATION -DICU_UTIL_DATA_IMPL=ICU_UTIL_DATA_FILE -DUCHAR_TYPE=uint16_t -DGOOGLE_PROTOBUF_NO_RTTI -DGOOGLE_PROTOBUF_NO_STATIC_INITIALIZER -DHAVE_PTHREAD -DWTF_USE_WEBAUDIO_FFMPEG=1 -DSUPPORT_WEBGL2_COMPUTE_CONTEXT=1 -DWTF_USE_DEFAULT_RENDER_THEME=1 -DSK_IGNORE_LINEONLY_AA_CONVEX_PATH_OPTS -DSK_HAS_PNG_LIBRARY -DSK_HAS_WEBP_LIBRARY -DSK_HAS_JPEG_LIBRARY -DSK_VULKAN_HEADER=\"../../skia/config/SkVulkanConfig.h\" -DSK_VULKAN=1 -DSK_SUPPORT_GPU=1 -DSK_GPU_WORKAROUNDS_HEADER=\"gpu/config/gpu_driver_bug_workaround_autogen.h\" -DVK_NO_PROTOTYPES -I. -I../.. -Igen -Igen/shim_headers/zlib_shim -Igen/shim_headers/libpng_shim -Igen/shim_headers/libwebp_shim -Igen/shim_headers/libdrm_shim -I../../third_party/libyuv/include -Igen/shim_headers/re2_shim -Igen/shim_headers/snappy_shim -I../../third_party/khronos -I../../gpu -I../../third_party/vulkan/include -Igen/shim_headers/openh264_shim -I../../third_party/ced/src -I../../third_party/icu/source/common -I../../third_party/icu/source/i18n -I../../third_party/protobuf/src -I../../skia/config -I../../skia/ext -I../../third_party/skia/include/c -I../../third_party/skia/include/config -I../../third_party/skia/include/core -I../../third_party/skia/include/effects -I../../third_party/skia/include/encode -I../../third_party/skia/include/gpu -I../../third_party/skia/include/images -I../../third_party/skia/include/lazy -I../../third_party/skia/include/pathops -I../../third_party/skia/include/pdf -I../../third_party/skia/include/pipe -I../../third_party/skia/include/ports -I../../third_party/skia/include/utils -I../../third_party/vulkan/include -I../../third_party/skia/third_party/vulkanmemoryallocator -I../../third_party/skia/src/gpu -I../../third_party/skia/src/sksl -I../../third_party/skia/modules/skottie/include -I../../third_party/vulkan/include -fno-strict-aliasing --param=ssp-buffer-size=4 -fstack-protector -Wno-builtin-macro-redefined -D__DATE__= -D__TIME__= -D__TIMESTAMP__= -funwind-tables -fPIC -pthread -fcolor-diagnostics -fmerge-all-constants -no-canonical-prefixes -Wall -Wextra -Wimplicit-fallthrough -Wthread-safety -Wno-missing-field-initializers -Wno-unused-parameter -Wno-c++11-narrowing -Wno-covered-switch-default -Wno-unneeded-internal-declaration -Wno-undefined-var-template -Wno-nonportable-include-path -Wno-user-defined-warnings -Wno-unused-lambda-capture -Wno-null-pointer-arithmetic -Wno-enum-compare-switch -fno-omit-frame-pointer -fvisibility=hidden -Wheader-hygiene -Wstring-conversion -Wtautological-overlap-compare -I/usr/include/glib-2.0 -I/usr/lib64/glib-2.0/include -std=c++14 -fno-exceptions -fno-rtti -fvisibility-inlines-hidden -march=native -c gen/media/mojo/interfaces/interfaces_blink_jumbo_1.cc -o obj/media/mojo/interfaces/interfaces_blink/interfaces_blink_jumbo_1.o
ninja: build stopped: subcommand failed.
 * ERROR: www-client/chromium-70.0.3538.16::gentoo failed (compile phase):
 *   ninja -v -j4 -l0 -C out/Release v8_context_snapshot_generator failed
 *
 * Call stack:
 *     ebuild.sh, line  124:  Called src_compile
 *   environment, line 4998:  Called eninja '-C' 'out/Release' 'v8_context_snapshot_generator'
 *   environment, line 1776:  Called die
 * The specific snippet of code:
 *       "$@" || die "${nonfatal_args[@]}" "${*} failed"
 *
 * If you need support, post the output of `emerge --info '=www-client/chromium-70.0.3538.16::gentoo'`,
 * the complete build log and the output of `emerge -pqv '=www-client/chromium-70.0.3538.16::gentoo'`.
 *
 * MemTotal:        8063396 kB
 * SwapTotal:       8388604 kB
 *
 * The complete build log is located at '/var/tmp/portage/www-client/chromium-70.0.3538.16/temp/build.log'.
 * The ebuild environment file is located at '/var/tmp/portage/www-client/chromium-70.0.3538.16/temp/environment'.
 * Working directory: '/var/tmp/portage/www-client/chromium-70.0.3538.16/work/chromium-70.0.3538.16'
 * S: '/var/tmp/portage/www-client/chromium-70.0.3538.16/work/chromium-70.0.3538.16'


[Moderator edit: changed [quote] tags to [code] tags to preserve output layout. -Hu]
Back to top
View user's profile Send private message
Fog_Watch
Apprentice
Apprentice


Joined: 24 Jul 2006
Posts: 201
Location: Utility Muffin Research Kitchen

PostPosted: Fri Sep 28, 2018 1:55 am    Post subject: Reply with quote

Unmasking sys-devel/clang:7 didn't help:
Code:
# tail -n 26 /var/tmp/portage/www-client/chromium-69.0.3497.100/temp/build.log
[12322/12322] python "../../build/toolchain/gcc_link_wrapper.py" --output="./chrome" -- x86_64-pc-linux-gnu-clang++ -pie -Wl,--version-script=../../build/linux/chrome.map -fPIC -Wl,-z,noexecstack -Wl,-z,now -Wl,-z,relro -Wl,-z,defs -Wl,--as-needed -rdynamic -Wl,-rpath-link=. -Wl,--disable-new-dtags -Wl,-O1 -Wl,--as-needed -o "./chrome" -Wl,--start-group @"./chrome.rsp"  -Wl,--end-group   -latomic -ldl -lpthread -lrt -lX11 -lX11-xcb -lxcb -lXcomposite -lXcursor -lXdamage -lXext -lXfixes -lXi -lXrender -lXtst -lgmodule-2.0 -lgobject-2.0 -lgthread-2.0 -lglib-2.0 -lsmime3 -lnss3 -lnssutil3 -lplds4 -lplc4 -lnspr4 -lcups -lz -lm -lcrypt -lxml2 -lexpat -lfontconfig -ldbus-1 -lXss -lpng16 -lwebpdemux -lwebpmux -lwebp -lfreetype -ljpeg -lharfbuzz -ldrm -lXrandr -lresolv -lgio-2.0 -lre2 -lsnappy -lpci -lasound -lpangocairo-1.0 -lpango-1.0 -lcairo -latk-1.0 -latk-bridge-2.0 -lminizip -lFLAC -lopenh264 -lgtk-3 -lgdk-3 -lcairo-gobject -lgdk_pixbuf-2.0 -lxslt
FAILED: chrome
python "../../build/toolchain/gcc_link_wrapper.py" --output="./chrome" -- x86_64-pc-linux-gnu-clang++ -pie -Wl,--version-script=../../build/linux/chrome.map -fPIC -Wl,-z,noexecstack -Wl,-z,now -Wl,-z,relro -Wl,-z,defs -Wl,--as-needed -rdynamic -Wl,-rpath-link=. -Wl,--disable-new-dtags -Wl,-O1 -Wl,--as-needed -o "./chrome" -Wl,--start-group @"./chrome.rsp"  -Wl,--end-group   -latomic -ldl -lpthread -lrt -lX11 -lX11-xcb -lxcb -lXcomposite -lXcursor -lXdamage -lXext -lXfixes -lXi -lXrender -lXtst -lgmodule-2.0 -lgobject-2.0 -lgthread-2.0 -lglib-2.0 -lsmime3 -lnss3 -lnssutil3 -lplds4 -lplc4 -lnspr4 -lcups -lz -lm -lcrypt -lxml2 -lexpat -lfontconfig -ldbus-1 -lXss -lpng16 -lwebpdemux -lwebpmux -lwebp -lfreetype -ljpeg -lharfbuzz -ldrm -lXrandr -lresolv -lgio-2.0 -lre2 -lsnappy -lpci -lasound -lpangocairo-1.0 -lpango-1.0 -lcairo -latk-1.0 -latk-bridge-2.0 -lminizip -lFLAC -lopenh264 -lgtk-3 -lgdk-3 -lcairo-gobject -lgdk_pixbuf-2.0 -lxslt
clang-7: error: unable to execute command: Killed
clang-7: error: linker command failed due to signal (use -v to see invocation)
ninja: build stopped: subcommand failed.
 * ERROR: www-client/chromium-69.0.3497.100::gentoo failed (compile phase):
 *   ninja -v -j4 -l0 -C out/Release chrome chromedriver failed
 *
 * Call stack:
 *     ebuild.sh, line  124:  Called src_compile
 *   environment, line 5002:  Called eninja '-C' 'out/Release' 'chrome' 'chromedriver'
 *   environment, line 1776:  Called die
 * The specific snippet of code:
 *       "$@" || die "${nonfatal_args[@]}" "${*} failed"
 *
 * If you need support, post the output of `emerge --info '=www-client/chromium-69.0.3497.100::gentoo'`,
 * the complete build log and the output of `emerge -pqv '=www-client/chromium-69.0.3497.100::gentoo'`.
 *
 * MemTotal:        8063396 kB
 * SwapTotal:       8388604 kB
 *
 * The complete build log is located at '/var/tmp/portage/www-client/chromium-69.0.3497.100/temp/build.log'.
 * The ebuild environment file is located at '/var/tmp/portage/www-client/chromium-69.0.3497.100/temp/environment'.
 * Working directory: '/var/tmp/portage/www-client/chromium-69.0.3497.100/work/chromium-69.0.3497.100'
 * S: '/var/tmp/portage/www-client/chromium-69.0.3497.100/work/chromium-69.0.3497.100'
Back to top
View user's profile Send private message
jagdpanther
Guru
Guru


Joined: 22 Nov 2003
Posts: 476

PostPosted: Sun Oct 07, 2018 5:18 pm    Post subject: Reply with quote

I just tried the "unstable" chromium-70.0.3538.35. Same issue ... after about an hour of compiling the build fails.
Back to top
View user's profile Send private message
fedeliallalinea
Bodhisattva
Bodhisattva


Joined: 08 Mar 2003
Posts: 20151
Location: here

PostPosted: Sun Oct 07, 2018 5:58 pm    Post subject: Reply with quote

Code:
 clang-7: error: unable to execute command: Killed

This seems an out of memory error. Try with a lower MAKEOPTS
_________________
Questions are guaranteed in life; Answers aren't.
Back to top
View user's profile Send private message
mir3x
Guru
Guru


Joined: 02 Jun 2012
Posts: 419

PostPosted: Sun Oct 07, 2018 7:09 pm    Post subject: Reply with quote

I had similar issue, then I noticed that sys-devel/llvm llvm-common llvmgold were built by clang. I rebuilt them with gcc and then compiled chromium ok ( Im building chromium with clang)
Emerging sys-libs/compiler-rt was also failing when llvm was built by clang, but it emerged ok after rebuilding.
_________________
Installation aborted to prevent system self-destruction
Back to top
View user's profile Send private message
jagdpanther
Guru
Guru


Joined: 22 Nov 2003
Posts: 476

PostPosted: Mon Oct 08, 2018 12:53 am    Post subject: Reply with quote

mir3x: Thanks for the suggestion but it did not help my build. I re-emerged llvm and llvm-common (llvmgold is not on my system.) I noticed that gcc was being used for the llvm build. Emerging chromium eventually gave the same error:

Code:
[15474/16588] x86_64-pc-linux-gnu-clang++ -MMD -MF obj/chrome/browser/ui/ui/ime_window.o.d -DV8_DEPRECATION_WARNINGS -DUSE_UDEV -DUSE_AURA=1 -DUSE_GLIB=1 -DUSE_NSS_CERTS=1 -DUSE_X11=1 -DNO_TCMALLOC -DFULL_SAFE_BROWSING -DSAFE_BROWSING_CSD -DSAFE_BROWSING_DB_LOCAL -DCHROMIUM_BUILD -D_FILE_OFFSET_BITS=64 -D_LARGEFILE_SOURCE -D_LARGEFILE64_SOURCE -D__STDC_CONSTANT_MACROS -D__STDC_FORMAT_MACROS -DNDEBUG -DNVALGRIND -DDYNAMIC_ANNOTATIONS_ENABLED=0 -DUSE_CUPS -DUSE_GIO -DGLIB_VERSION_MAX_ALLOWED=GLIB_VERSION_2_32 -DGLIB_VERSION_MIN_REQUIRED=GLIB_VERSION_2_26 -DENABLE_IPC_FUZZER -DTOOLKIT_VIEWS=1 -DGL_GLEXT_PROTOTYPES -DUSE_GLX -DUSE_EGL -DVK_NO_PROTOTYPES -DEXPAT_RELATIVE_PATH -DGOOGLE_PROTOBUF_NO_RTTI -DGOOGLE_PROTOBUF_NO_STATIC_INITIALIZER -DHAVE_PTHREAD -DLEVELDB_PLATFORM_CHROMIUM=1 -DU_USING_ICU_NAMESPACE=0 -DU_ENABLE_DYLOAD=0 -DU_STATIC_IMPLEMENTATION -DICU_UTIL_DATA_IMPL=ICU_UTIL_DATA_FILE -DUCHAR_TYPE=uint16_t -DV8_USE_EXTERNAL_STARTUP_DATA -DSK_IGNORE_LINEONLY_AA_CONVEX_PATH_OPTS -DSK_HAS_PNG_LIBRARY -DSK_HAS_WEBP_LIBRARY -DSK_HAS_JPEG_LIBRARY -DSK_VULKAN_HEADER=\"../../skia/config/SkVulkanConfig.h\" -DSK_VULKAN=1 -DSK_SUPPORT_GPU=1 -DSK_GPU_WORKAROUNDS_HEADER=\"gpu/config/gpu_driver_bug_workaround_autogen.h\" -DVK_NO_PROTOTYPES -DWEBRTC_NON_STATIC_TRACE_EVENT_HANDLERS=0 -DGTEST_RELATIVE_PATH -DWEBRTC_CHROMIUM_BUILD -DWEBRTC_POSIX -DWEBRTC_LINUX -DABSL_ALLOCATOR_NOTHROW=1 -DNO_MAIN_THREAD_WRAPPING -DI18N_ADDRESS_VALIDATION_DATA_URL=\"https://chromium-i18n.appspot.com/ssl-aggregate-address/\" -DUSE_SYSTEM_ZLIB=1 -I../.. -Igen -Igen/shim_headers/zlib_shim -Igen/shim_headers/re2_shim -Igen/shim_headers/snappy_shim -Igen/shim_headers/libpng_shim -Igen/shim_headers/libwebp_shim -Igen/shim_headers/libdrm_shim -I../../third_party/khronos -I../../gpu -I../../third_party/libyuv/include -I../../third_party/vulkan/include -Igen/shim_headers/openh264_shim -Igen/shim_headers/minizip_shim -Igen/shim_headers/flac_shim -I../../third_party/webrtc_overrides -I../../testing/gtest/include -I../../third_party/libyuv/include -I../../third_party/usrsctp/usrsctplib -I../../third_party/webrtc -I../../third_party/protobuf/src -Igen/protoc_out -I../../third_party/protobuf/src -I../../third_party/boringssl/src/include -I../../third_party/leveldatabase -I../../third_party/leveldatabase/src -I../../third_party/leveldatabase/src/include -I../../third_party/ced/src -I../../third_party/icu/source/common -I../../third_party/icu/source/i18n -I../../skia/config -I../../skia/ext -I../../third_party/skia/include/c -I../../third_party/skia/include/config -I../../third_party/skia/include/core -I../../third_party/skia/include/effects -I../../third_party/skia/include/encode -I../../third_party/skia/include/gpu -I../../third_party/skia/include/images -I../../third_party/skia/include/lazy -I../../third_party/skia/include/pathops -I../../third_party/skia/include/pdf -I../../third_party/skia/include/pipe -I../../third_party/skia/include/ports -I../../third_party/skia/include/utils -I../../third_party/vulkan/include -I../../third_party/skia/third_party/vulkanmemoryallocator -I../../third_party/skia/src/gpu -I../../third_party/skia/src/sksl -I../../third_party/vulkan/include -I../../third_party/libwebm/source -I../../v8/include -Igen/v8/include -I../../third_party/webrtc_overrides -I../../third_party/webrtc -I../../third_party/perfetto/include -Igen/third_party/perfetto/protos -Igen/third_party/perfetto/protos -Igen/third_party/perfetto/protos -Igen/third_party/metrics_proto -I../../third_party/mesa/src/include -Igen -Igen -I../../third_party/libaddressinput/src/cpp/include -I../../third_party/cacheinvalidation/overrides -I../../third_party/cacheinvalidation/src -I../../third_party/flatbuffers/src/include -I../../third_party/brotli/include -I../../third_party/webrtc_overrides -I../../testing/gtest/include -I../../third_party/webrtc -Igen -Igen -fno-strict-aliasing --param=ssp-buffer-size=4 -fstack-protector -Wno-builtin-macro-redefined -D__DATE__= -D__TIME__= -D__TIMESTAMP__= -funwind-tables -fPIC -pthread -fcolor-diagnostics -fmerge-all-constants -no-canonical-prefixes -Wall -Wextra -Wimplicit-fallthrough -Wthread-safety -Wno-missing-field-initializers -Wno-unused-parameter -Wno-c++11-narrowing -Wno-covered-switch-default -Wno-unneeded-internal-declaration -Wno-undefined-var-template -Wno-address-of-packed-member -Wno-nonportable-include-path -Wno-user-defined-warnings -Wno-unused-lambda-capture -Wno-null-pointer-arithmetic -Wno-enum-compare-switch -fno-omit-frame-pointer -fvisibility=hidden -Wheader-hygiene -Wstring-conversion -Wtautological-overlap-compare -Wno-nonnull -Wexit-time-destructors -isystem../../../../../../../../../usr/include/glib-2.0 -isystem../../../../../../../../../usr/lib64/glib-2.0/include -isystem../../../../../../../../../usr/include/glib-2.0 -isystem../../../../../../../../../usr/lib64/glib-2.0/include -Wno-header-guard -isystem../../../../../../../../../usr/include/nss -isystem../../../../../../../../../usr/include/nspr -isystem ../../third_party/abseil-cpp -Wno-exit-time-destructors -isystem../../../../../../../../../usr/include/dbus-1.0 -isystem../../../../../../../../../usr/lib64/dbus-1.0/include -std=gnu++14 -fno-exceptions -fno-rtti -fvisibility-inlines-hidden -march=native -O2 -pipe -c ../../chrome/browser/ui/ime/ime_window.cc -o obj/chrome/browser/ui/ui/ime_window.o
ninja: build stopped: subcommand failed.
 * ERROR: www-client/chromium-69.0.3497.100::gentoo failed (compile phase):
 *   ninja -v -j28 -l0 -C out/Release chrome chromedriver failed
 *
 * Call stack:
 *     ebuild.sh, line  124:  Called src_compile
 *   environment, line 4997:  Called eninja '-C' 'out/Release' 'chrome' 'chromedriver'
 *   environment, line 1770:  Called die
 * The specific snippet of code:
 *       "$@" || die "${nonfatal_args[@]}" "${*} failed"
Back to top
View user's profile Send private message
fedeliallalinea
Bodhisattva
Bodhisattva


Joined: 08 Mar 2003
Posts: 20151
Location: here

PostPosted: Mon Oct 08, 2018 5:44 am    Post subject: Reply with quote

@jagdpanther: you shuld post full build.log because in your compilation output chunck there isn't real error
_________________
Questions are guaranteed in life; Answers aren't.
Back to top
View user's profile Send private message
mir3x
Guru
Guru


Joined: 02 Jun 2012
Posts: 419

PostPosted: Mon Oct 08, 2018 6:34 am    Post subject: Reply with quote

jagdpanther:
When you use -jX - then compiler compiles X files, so error is in the last X commands.
If you have eg -j8 -then it would be in last 8 commands. Search for for "error" "fail", anything which looks suspicious.

that looks like real error:
Code:
fatal error: error in backend: Unable to copy EFLAGS physical register!
x86_64-pc-linux-gnu-clang++: error: clang frontend command failed with exit code 70 (use -v to see invocation)


I googled it but nothing useful found.
_________________
Installation aborted to prevent system self-destruction
Back to top
View user's profile Send private message
Josef.95
Advocate
Advocate


Joined: 03 Sep 2007
Posts: 3518
Location: Germany

PostPosted: Mon Oct 08, 2018 8:44 am    Post subject: Reply with quote

jagdpanther wrote:
Code:
 *   ninja -v -j28 -l0 -C out/Release chrome chromedriver failed

Yes, for a better readable build.log I would prefer try:
Code:
USE="-jumbo-build" MAKEOPTS="-j1" emerge -av1 chromium


/edit,
and please check if enough space free in PORTAGE_TMPDIR
Code:
df -h `portageq envvar PORTAGE_TMPDIR`/portage
Back to top
View user's profile Send private message
jagdpanther
Guru
Guru


Joined: 22 Nov 2003
Posts: 476

PostPosted: Tue Oct 09, 2018 2:10 am    Post subject: Reply with quote

Quote:
Yes, for a better readable build.log I would prefer try:
Code:
USE="-jumbo-build" MAKEOPTS="-j1" emerge -av1 chromium


Ok. I'll post the output in a day or so. (I have MAKEOPTS="-j28" in make.conf for my 14-core Intel which usually compiles chromium in about an hour. With just one thread, I expect a little more time will be needed for the emerge. The failure was well into the build.)

I didn't know about the "jumbo-build" use flag. Will it really make the build faster? Does it make a difference for a "normal" multi-threaded build?
Edit: never mind about this last question. I just found:
https://forums.gentoo.org/viewtopic-t-1074724.html
Back to top
View user's profile Send private message
jagdpanther
Guru
Guru


Joined: 22 Nov 2003
Posts: 476

PostPosted: Wed Oct 10, 2018 2:52 am    Post subject: Reply with quote

Here are the error messages of my latest chromium build attempt after re-emerging llvm and llvm-common.
I searched for "error: " and "fatal: "

Code:
[832/16903] touch obj/chrome/test/chromedriver/embed_user_data_dir_in_cpp.stamp
[833/16903] python ../../chrome/test/chromedriver/embed_version_in_cpp.py --chromedriver-version-file ../../chrome/test/chromedriver/VERSION --chrome-version-file ../../chrome/VERSION --directory gen/chrome/test/chromedriver
ERROR:root:Git error: rc=128, output=''
[834/16903] touch obj/chrome/test/chromedriver/embed_version_in_cpp.stamp
[835/16903] python ../../chrome/test/chromedriver/embed_js_in_cpp.py --directory gen/chrome/test/chromedriver/chrome ../../chrome/test/chromedriver/js/call_function.js ../../chrome/test/chromedriver/js/dispatch_touch_event.js ../../chrome/test/chromedriver/js/execute_async_script.js ../../chrome/test/chromedriver/js/focus.js ../../chrome/test/chromedriver/js/get_element_region.js ../../chrome/test/chromedriver/js/is_option_element_toggleable.js
[836/16903] touch obj/chrome/test/chromedriver/embed_js_in_cpp.stamp

...

[3892/16894] x86_64-pc-linux-gnu-clang -MMD -MF obj/third_party/brotli/brotli/metablock.o.d -DV8_DEPRECATION_WARNINGS -DUSE_UDEV -DUSE_AURA=1 -DUSE_GLIB=1 -DUSE_NSS_CERTS=1 -DUSE_X11=1 -DNO_TCMALLOC -DFULL_SAFE_BROWSING -DSAFE_BROWSING_CSD -DSAFE_BROWSING_DB_LOCAL -DCHROMIUM_BUILD -D_FILE_OFFSET_BITS=64 -D_LARGEFILE_SOURCE -D_LARGEFILE64_SOURCE -D__STDC_CONSTANT_MACROS -D__STDC_FORMAT_MACROS -DNDEBUG -DNVALGRIND -DDYNAMIC_ANNOTATIONS_ENABLED=0 -I../.. -Igen -I../../third_party/brotli/include -fno-strict-aliasing --param=ssp-buffer-size=4 -fstack-protector -Wno-builtin-macro-redefined -D__DATE__= -D__TIME__= -D__TIMESTAMP__= -funwind-tables -fPIC -pthread -fcolor-diagnostics -fmerge-all-constants -no-canonical-prefixes -Wall -Wextra -Wimplicit-fallthrough -Wthread-safety -Wno-missing-field-initializers -Wno-unused-parameter -Wno-c++11-narrowing -Wno-covered-switch-default -Wno-unneeded-internal-declaration -Wno-undefined-var-template -Wno-address-of-packed-member -Wno-nonportable-include-path -Wno-user-defined-warnings -Wno-unused-lambda-capture -Wno-null-pointer-arithmetic -Wno-enum-compare-switch -fno-omit-frame-pointer -fvisibility=hidden -Wheader-hygiene -Wstring-conversion -Wtautological-overlap-compare -std=gnu11 -march=native -O2 -pipe -c ../../third_party/brotli/enc/metablock.c -o obj/third_party/brotli/brotli/metablock.o
[3893/16894] x86_64-pc-linux-gnu-clang -MMD -MF obj/third_party/brotli/brotli/static_dict.o.d -DV8_DEPRECATION_WARNINGS -DUSE_UDEV -DUSE_AURA=1 -DUSE_GLIB=1 -DUSE_NSS_CERTS=1 -DUSE_X11=1 -DNO_TCMALLOC -DFULL_SAFE_BROWSING -DSAFE_BROWSING_CSD -DSAFE_BROWSING_DB_LOCAL -DCHROMIUM_BUILD -D_FILE_OFFSET_BITS=64 -D_LARGEFILE_SOURCE -D_LARGEFILE64_SOURCE -D__STDC_CONSTANT_MACROS -D__STDC_FORMAT_MACROS -DNDEBUG -DNVALGRIND -DDYNAMIC_ANNOTATIONS_ENABLED=0 -I../.. -Igen -I../../third_party/brotli/include -fno-strict-aliasing --param=ssp-buffer-size=4 -fstack-protector -Wno-builtin-macro-redefined -D__DATE__= -D__TIME__= -D__TIMESTAMP__= -funwind-tables -fPIC -pthread -fcolor-diagnostics -fmerge-all-constants -no-canonical-prefixes -Wall -Wextra -Wimplicit-fallthrough -Wthread-safety -Wno-missing-field-initializers -Wno-unused-parameter -Wno-c++11-narrowing -Wno-covered-switch-default -Wno-unneeded-internal-declaration -Wno-undefined-var-template -Wno-address-of-packed-member -Wno-nonportable-include-path -Wno-user-defined-warnings -Wno-unused-lambda-capture -Wno-null-pointer-arithmetic -Wno-enum-compare-switch -fno-omit-frame-pointer -fvisibility=hidden -Wheader-hygiene -Wstring-conversion -Wtautological-overlap-compare -std=gnu11 -march=native -O2 -pipe -c ../../third_party/brotli/enc/static_dict.c -o obj/third_party/brotli/brotli/static_dict.o
FAILED: obj/third_party/brotli/brotli/static_dict.o
x86_64-pc-linux-gnu-clang -MMD -MF obj/third_party/brotli/brotli/static_dict.o.d -DV8_DEPRECATION_WARNINGS -DUSE_UDEV -DUSE_AURA=1 -DUSE_GLIB=1 -DUSE_NSS_CERTS=1 -DUSE_X11=1 -DNO_TCMALLOC -DFULL_SAFE_BROWSING -DSAFE_BROWSING_CSD -DSAFE_BROWSING_DB_LOCAL -DCHROMIUM_BUILD -D_FILE_OFFSET_BITS=64 -D_LARGEFILE_SOURCE -D_LARGEFILE64_SOURCE -D__STDC_CONSTANT_MACROS -D__STDC_FORMAT_MACROS -DNDEBUG -DNVALGRIND -DDYNAMIC_ANNOTATIONS_ENABLED=0 -I../.. -Igen -I../../third_party/brotli/include -fno-strict-aliasing --param=ssp-buffer-size=4 -fstack-protector -Wno-builtin-macro-redefined -D__DATE__= -D__TIME__= -D__TIMESTAMP__= -funwind-tables -fPIC -pthread -fcolor-diagnostics -fmerge-all-constants -no-canonical-prefixes -Wall -Wextra -Wimplicit-fallthrough -Wthread-safety -Wno-missing-field-initializers -Wno-unused-parameter -Wno-c++11-narrowing -Wno-covered-switch-default -Wno-unneeded-internal-declaration -Wno-undefined-var-template -Wno-address-of-packed-member -Wno-nonportable-include-path -Wno-user-defined-warnings -Wno-unused-lambda-capture -Wno-null-pointer-arithmetic -Wno-enum-compare-switch -fno-omit-frame-pointer -fvisibility=hidden -Wheader-hygiene -Wstring-conversion -Wtautological-overlap-compare -std=gnu11 -march=native -O2 -pipe -c ../../third_party/brotli/enc/static_dict.c -o obj/third_party/brotli/brotli/static_dict.o
x86_64-pc-linux-gnu-clang: error: no such file or directory: '../../third_party/brotli/enc/static_dict.c'
x86_64-pc-linux-gnu-clang: error: no input files
ninja: build stopped: subcommand failed.
 * ERROR: www-client/chromium-69.0.3497.100::gentoo failed (compile phase):
 *   ninja -v -j1 -l0 -C out/Release chrome chromedriver failed
 *
 * Call stack:
 *     ebuild.sh, line  124:  Called src_compile
 *   environment, line 4997:  Called eninja '-C' 'out/Release' 'chrome' 'chromedriver'
 *   environment, line 1770:  Called die
 * The specific snippet of code:
 *       "$@" || die "${nonfatal_args[@]}" "${*} failed"
[/code]


Code:
]$ emerge --info '=www-client/chromium-69.0.3497.100::gentoo'
Portage 2.3.49 (python 3.6.5-final-0, default/linux/amd64/17.0, gcc-7.3.0, glibc-2.26-r7, 4.18.12-gentoo-02 x86_64)
=================================================================
                         System Settings
=================================================================
System uname: Linux-4.18.12-gentoo-02-x86_64-Intel-R-_Core-TM-_i9-7940X_CPU_@_3.10GHz-with-gentoo-2.4.1
KiB Mem:    65674144 total,  24189168 free
KiB Swap:   65535996 total,  65535996 free
Timestamp of repository gentoo: Wed, 10 Oct 2018 02:30:01 +0000
Head commit of repository gentoo: 19f9bef3016141f1f4d7e3e5caa87b89d0c780c7
sh bash 4.4_p12
ld GNU ld (Gentoo 2.30 p5) 2.30.0
app-shells/bash:          4.4_p12::gentoo
dev-java/java-config:     2.2.0-r4::gentoo
dev-lang/perl:            5.24.3-r1::gentoo
dev-lang/python:          2.7.15::gentoo, 3.6.5::gentoo
dev-util/cmake:           3.9.6::gentoo
dev-util/pkgconfig:       0.29.2::gentoo
sys-apps/baselayout:      2.4.1-r2::gentoo
sys-apps/openrc:          0.38.2::gentoo
sys-apps/sandbox:         2.13::gentoo
sys-devel/autoconf:       2.13::gentoo, 2.69-r4::gentoo
sys-devel/automake:       1.11.6-r3::gentoo, 1.13.4-r2::gentoo, 1.15.1-r2::gentoo
sys-devel/binutils:       2.30-r4::gentoo
sys-devel/gcc:            7.3.0-r3::gentoo
sys-devel/gcc-config:     1.8-r1::gentoo
sys-devel/libtool:        2.4.6-r3::gentoo
sys-devel/make:           4.2.1-r4::gentoo
sys-kernel/linux-headers: 4.17::gentoo (virtual/os-headers)
sys-libs/glibc:           2.26-r7::gentoo
Repositories:

steam-overlay
    location: /var/lib/layman/steam-overlay
    masters: gentoo
    priority: 50

vmware
    location: /var/lib/layman/vmware
    masters: gentoo
    priority: 50

gentoo
    location: /usr/portage
    sync-type: rsync
    sync-uri: rsync://rsync.gentoo.org/gentoo-portage
    priority: 9999
    sync-rsync-verify-max-age: 24
    sync-rsync-verify-metamanifest: no
    sync-rsync-verify-jobs: 1
    sync-rsync-extra-opts:

Installed sets: @esteam
ACCEPT_KEYWORDS="amd64"
ACCEPT_LICENSE="*"
CBUILD="x86_64-pc-linux-gnu"
CFLAGS="-march=native -O2 -fomit-frame-pointer -pipe -W -Wall"
CHOST="x86_64-pc-linux-gnu"
CONFIG_PROTECT="/etc /etc/stunnel/stunnel.conf /usr/lib64/libreoffice/program/sofficerc /usr/share/config /usr/share/easy-rsa /usr/share/gnupg/qualified.txt /usr/share/themes/oxygen-gtk/gtk-2.0"
CONFIG_PROTECT_MASK="/etc/ca-certificates.conf /etc/dconf /etc/env.d /etc/fonts/fonts.conf /etc/gconf /etc/gentoo-release /etc/php/apache2-php7.2/ext-active/ /etc/php/cgi-php7.2/ext-active/ /etc/php/cli-php7.2/ext-active/ /etc/revdep-rebuild /etc/sandbox.d /etc/terminfo"
CXXFLAGS="-march=native -O2 -fomit-frame-pointer -pipe -W -Wall"
DISTDIR="/usr/portage/distfiles"
ENV_UNSET="DBUS_SESSION_BUS_ADDRESS DISPLAY PERL5LIB PERL5OPT PERLPREFIX PERL_CORE PERL_MB_OPT PERL_MM_OPT XAUTHORITY XDG_CACHE_HOME XDG_CONFIG_HOME XDG_DATA_HOME XDG_RUNTIME_DIR"
FCFLAGS="-O2 -pipe"
FEATURES="assume-digests binpkg-logs config-protect-if-modified distlocks ebuild-locks fixlafiles merge-sync multilib-strict news parallel-fetch preserve-libs protect-owned sandbox sfperms strict unknown-features-warn unmerge-logs unmerge-orphans userfetch userpriv usersandbox usersync"
FFLAGS="-O2 -pipe"
GENTOO_MIRRORS="http://gentoo.mirrors.easynews.com/linux/gentoo/ http://gentoo.mirrors.tds.net/gentoo http://gentoo.gossamerhost.com rsync://gentoo.gossamerhost.com/gentoo-distfiles/ http://mirror.csclub.uwaterloo.ca/gentoo-distfiles/"
LANG="en_US.utf8"
LDFLAGS="-Wl,-O1 -Wl,--as-needed"
MAKEOPTS="-j28"
PKGDIR="/usr/portage/packages"
PORTAGE_CONFIGROOT="/"
PORTAGE_RSYNC_OPTS="--recursive --links --safe-links --perms --times --omit-dir-times --compress --force --whole-file --delete --stats --human-readable --timeout=180 --exclude=/distfiles --exclude=/local --exclude=/packages --exclude=/.git"
PORTAGE_TMPDIR="/tmp"
USE="X Xaw3d a52 aac acl acpi alsa amd64 apache2 audiofile bash-completion bcmath berkdb bzip2 cairo caps cdparanoia cdr clamav cli cracklib crypt ctype cups cxx dbus dga directfb dri dts dv dvd dvdr encode esd ffmpeg fftw flac foomaticdb fortran gcj gd gdbm gif glut gnutls gphoto2 gpm gstreamer gtk iconv icu imagemagick imap imlib ipv6 jpeg libtirpc lm_sensors lzma lzo mad mikmod mjpeg mng mp3 mpeg mplayer multilib musepack mysql mysqli nas ncurses nls nptl nvidia offensive ogg openal openexr opengl openmp orc pam pcre pdf perl plasma plotutils png policykit portaudio posix ppds python qt5 quicktime readline sasl sdl seccomp semantic-desktop slp sndfile sockets sox speex spell ssl svg syslog tcpd theora threads tiff truetype unicode usb vdpau vhosts vorbis win32codecs wmf x264 xattr xml xmp xpm xulrunner xvid xvmc zlib" ABI_X86="64 32" ALSA_CARDS="ali5451 als4000 atiixp atiixp-modem bt87x ca0106 cmipci emu10k1x ens1370 ens1371 es1938 es1968 fm801 hda-intel intel8x0 intel8x0m maestro3 trident usb-audio via82xx via82xx-modem ymfpci" APACHE2_MODULES="authn_core authz_core socache_shmcb unixd actions alias auth_basic authn_alias authn_anon authn_dbm authn_default authn_file authz_dbm authz_default authz_groupfile authz_host authz_owner authz_user autoindex cache cgi cgid dav dav_fs dav_lock deflate dir disk_cache env expires ext_filter file_cache filter headers include info log_config logio mem_cache mime mime_magic negotiation rewrite setenvif speling status unique_id userdir usertrack vhost_alias" CALLIGRA_FEATURES="karbon plan sheets stage words" COLLECTD_PLUGINS="df interface irq load memory rrdtool swap syslog" CPU_FLAGS_X86="aes avx avx2 avx512f avx512dq avx512cd avx512bw avx512vl f16c fma3 mmx mmxext pclmul popcnt sse sse2 sse3 sse4_1 sse4_2 ssse3" ELIBC="glibc" GPSD_PROTOCOLS="ashtech aivdm earthmate evermore fv18 garmin garmintxt gpsclock isync itrax mtk3301 nmea ntrip navcom oceanserver oldstyle oncore rtcm104v2 rtcm104v3 sirf skytraq superstar2 timing tsip tripmate tnt ublox ubx" GRUB_PLATFORMS="pc" INPUT_DEVICES="evdev" KERNEL="linux" LCD_DEVICES="bayrad cfontz cfontz633 glk hd44780 lb216 lcdm001 mtxorb ncurses text" LIBREOFFICE_EXTENSIONS="presenter-console presenter-minimizer" OFFICE_IMPLEMENTATION="libreoffice" PHP_TARGETS="php5-6 php7-1" POSTGRES_TARGETS="postgres9_5 postgres10" PYTHON_SINGLE_TARGET="python3_6" PYTHON_TARGETS="python2_7 python3_6" RUBY_TARGETS="ruby23" USERLAND="GNU" VIDEO_CARDS="nvidia" XTABLES_ADDONS="quota2 psd pknock lscan length2 ipv4options ipset ipp2p iface geoip fuzzy condition tee tarpit sysrq steal rawnat logmark ipmark dhcpmac delude chaos account"
Unset:  CC, CPPFLAGS, CTARGET, CXX, EMERGE_DEFAULT_OPTS, INSTALL_MASK, LC_ALL, LINGUAS, PORTAGE_BINHOST, PORTAGE_BUNZIP2_COMMAND, PORTAGE_COMPRESS, PORTAGE_COMPRESS_FLAGS, PORTAGE_RSYNC_EXTRA_OPTS



The "Failed:" line states somthing about brotli. I see there is a app-arch/brotli in portage but it is not installed on my system.
Back to top
View user's profile Send private message
mir3x
Guru
Guru


Joined: 02 Jun 2012
Posts: 419

PostPosted: Wed Oct 10, 2018 11:16 am    Post subject: Reply with quote

Code:
x86_64-pc-linux-gnu-clang: error: no such file or directory: '../../third_party/brotli/enc/static_dict.c'
x86_64-pc-linux-gnu-clang: error: no input files


It just cannot find file in chromium directory ( it should be included there, its not brotli from portage), maybe it unpacked incorrectly somehow? No idea how it happened.
I can see that file in chromium directory - third_party/brotli/enc/static_dict.c.

About jumbo-build - use it - it speeds up compiling in ver69 - 2 times, in v70 - about 3 times.

I see 3 options:
- try ver. 70 ( it will fail probably too)
- find why its badly unpacked ( maybe some system packages are not updated ?)
- unpack manually and when chromium starts compilng copy files to work dir :D
_________________
Installation aborted to prevent system self-destruction
Back to top
View user's profile Send private message
Fog_Watch
Apprentice
Apprentice


Joined: 24 Jul 2006
Posts: 201
Location: Utility Muffin Research Kitchen

PostPosted: Fri Oct 12, 2018 10:30 am    Post subject: Reply with quote

fedeliallalinea wrote:
This seems an out of memory error.

Correct.
After doubling my RAM to 16Gb Chromium 69.0.3497.100 compiled successfully.
Many thanks.
Back to top
View user's profile Send private message
Display posts from previous:   
Reply to topic    Gentoo Forums Forum Index Portage & Programming All times are GMT
Goto page 1, 2, 3  Next
Page 1 of 3

 
Jump to:  
You cannot post new topics in this forum
You cannot reply to topics in this forum
You cannot edit your posts in this forum
You cannot delete your posts in this forum
You cannot vote in polls in this forum