Gentoo Forums
Gentoo Forums
Gentoo Forums
Quick Search: in
Failed to emerge media-gfx/iscan-2.26.2
View unanswered posts
View posts from last 24 hours

 
Reply to topic    Gentoo Forums Forum Index Portage & Programming
View previous topic :: View next topic  
Author Message
stampante
n00b
n00b


Joined: 11 Dec 2013
Posts: 8

PostPosted: Tue Dec 24, 2013 12:00 pm    Post subject: Failed to emerge media-gfx/iscan-2.26.2 Reply with quote

Installation of iscan on my system failed.
This is the error message:
Code:

 ERROR: media-gfx/iscan-2.26.2::gentoo failed (compile phase):
 *   emake failed
 *
 * Call stack:
 *          ebuild.sh, line   93:  Called src_compile
 *        environment, line 3364:  Called __eapi2_src_compile
 *   phase-helpers.sh, line  688:  Called die
 * The specific snippet of code:
 *         emake || die "emake failed"
 *
Back to top
View user's profile Send private message
xp-vit
n00b
n00b


Joined: 22 Sep 2012
Posts: 36

PostPosted: Tue Dec 24, 2013 1:58 pm    Post subject: Reply with quote

If you need help you nned to provide more information. Post outputs of:

Code:
emerge --info '=media-gfx/iscan-2.26.2'

and
Code:
emerge -pqv  '=media-gfx/iscan-2.26.2'


Also build.log for this package will be usefull.
Back to top
View user's profile Send private message
stampante
n00b
n00b


Joined: 11 Dec 2013
Posts: 8

PostPosted: Tue Dec 24, 2013 2:24 pm    Post subject: Reply with quote

This is output of emerge --info '=media-gfx/iscan-2.26.2'
Code:

Portage 2.2.7 (default/linux/amd64/13.0/desktop, gcc-4.7.3, glibc-2.16.0, 3.10.17-gentoo x86_64)
=================================================================
                         System Settings
=================================================================
System uname: Linux-3.10.17-gentoo-x86_64-Intel-R-_Core-TM-2_Quad_CPU_Q8200_@_2.33GHz-with-gentoo-2.2
KiB Mem:     4055856 total,   3169596 free
KiB Swap:    1568472 total,   1568472 free
Timestamp of tree: Tue, 24 Dec 2013 10:45:01 +0000
ld ld di GNU (GNU Binutils) 2.23.2
app-shells/bash:          4.2_p45
dev-lang/python:          2.7.5-r3, 3.3.2-r2
dev-util/cmake:           2.8.11.2
dev-util/pkgconfig:       0.28
sys-apps/baselayout:      2.2
sys-apps/openrc:          0.12.4
sys-apps/sandbox:         2.6-r1
sys-devel/autoconf:       2.13, 2.69
sys-devel/automake:       1.11.6, 1.13.4
sys-devel/binutils:       2.23.2
sys-devel/gcc:            4.7.3-r1
sys-devel/gcc-config:     1.7.3
sys-devel/libtool:        2.4.2
sys-devel/make:           3.82-r4
sys-kernel/linux-headers: 3.9 (virtual/os-headers)
sys-libs/glibc:           2.16.0
Repositories: gentoo
ACCEPT_KEYWORDS="amd64"
ACCEPT_LICENSE="* -@EULA"
CBUILD="x86_64-pc-linux-gnu"
CFLAGS="-march=native -mtune=native -O2 -pipe"
CHOST="x86_64-pc-linux-gnu"
CONFIG_PROTECT="/etc /usr/share/gnupg/qualified.txt"
CONFIG_PROTECT_MASK="/etc/ca-certificates.conf /etc/dconf /etc/env.d /etc/fonts/fonts.conf /etc/gconf /etc/gentoo-release /etc/revdep-rebuild /etc/sandbox.d /etc/terminfo"
CXXFLAGS="-march=native -mtune=native -O2 -pipe"
DISTDIR="/usr/portage/distfiles"
FCFLAGS="-O2 -pipe"
FEATURES="assume-digests binpkg-logs config-protect-if-modified distlocks ebuild-locks fixlafiles merge-sync news parallel-fetch preserve-libs protect-owned sandbox sfperms strict unknown-features-warn unmerge-logs unmerge-orphans userfetch userpriv usersandbox usersync"
FFLAGS="-O2 -pipe"
GENTOO_MIRRORS="http://mirror.switch.ch/ftp/mirror/gentoo/"
LANG="it_IT.UTF-8"
LDFLAGS="-Wl,-O1 -Wl,--as-needed"
MAKEOPTS="-j5"
PKGDIR="/usr/portage/packages"
PORTAGE_CONFIGROOT="/"
PORTAGE_RSYNC_OPTS="--recursive --links --safe-links --perms --times --omit-dir-times --compress --force --whole-file --delete --stats --human-readable --timeout=180 --exclude=/distfiles --exclude=/local --exclude=/packages"
PORTAGE_TMPDIR="/home/sergio/CONDIVISA/GENTOO/var/tmp"
PORTDIR="/usr/portage"
PORTDIR_OVERLAY=""
SYNC="rsync://rsync.de.gentoo.org/gentoo-portage"
USE="X a52 aac acl acpi alsa amd64 berkdb bindist bluetooth branding bzip2 cairo cdda cdr cli consolekit cracklib crypt cups cxx dbus dri dts dvd dvdr emboss encode exif fam firefox flac fortran gdbm gif gpm gtk iconv ipv6 jpeg lcms ldap libnotify mad mmx mng modules mp3 mp4 mpeg mudflap multilib ncurses nls nptl ogg opengl openmp pam pango pcre pdf png policykit ppds readline sdl session spell sse sse2 ssl startup-notification svg tcpd thunar tiff truetype udev udisks unicode upower usb vorbis wxwidgets x264 xcb xml xv xvid zlib" ABI_X86="64" ALSA_CARDS="ali5451 als4000 atiixp atiixp-modem bt87x ca0106 cmipci emu10k1x ens1370 ens1371 es1938 es1968 fm801 hda-intel intel8x0 intel8x0m maestro3 trident usb-audio via82xx via82xx-modem ymfpci" APACHE2_MODULES="authn_core authz_core socache_shmcb unixd actions alias auth_basic authn_alias authn_anon authn_dbm authn_default authn_file authz_dbm authz_default authz_groupfile authz_host authz_owner authz_user autoindex cache cgi cgid dav dav_fs dav_lock deflate dir disk_cache env expires ext_filter file_cache filter headers include info log_config logio mem_cache mime mime_magic negotiation rewrite setenvif speling status unique_id userdir usertrack vhost_alias" CALLIGRA_FEATURES="kexi words flow plan sheets stage tables krita karbon braindump author" CAMERAS="ptp2" COLLECTD_PLUGINS="df interface irq load memory rrdtool swap syslog" ELIBC="glibc" GPSD_PROTOCOLS="ashtech aivdm earthmate evermore fv18 garmin garmintxt gpsclock itrax mtk3301 nmea ntrip navcom oceanserver oldstyle oncore rtcm104v2 rtcm104v3 sirf superstar2 timing tsip tripmate tnt ublox ubx" INPUT_DEVICES="keyboard mouse evdev" KERNEL="linux" LCD_DEVICES="bayrad cfontz cfontz633 glk hd44780 lb216 lcdm001 mtxorb ncurses text" LIBREOFFICE_EXTENSIONS="presenter-console presenter-minimizer" LINGUAS="it" OFFICE_IMPLEMENTATION="libreoffice" PHP_TARGETS="php5-5" PYTHON_SINGLE_TARGET="python2_7" PYTHON_TARGETS="python2_7 python3_3" RUBY_TARGETS="ruby19 ruby18" USERLAND="GNU" VIDEO_CARDS="nvidia" XTABLES_ADDONS="quota2 psd pknock lscan length2 ipv4options ipset ipp2p iface geoip fuzzy condition tee tarpit sysrq steal rawnat logmark ipmark dhcpmac delude chaos account"
Unset:  CPPFLAGS, CTARGET, EMERGE_DEFAULT_OPTS, INSTALL_MASK, LC_ALL, PORTAGE_BUNZIP2_COMMAND, PORTAGE_COMPRESS, PORTAGE_COMPRESS_FLAGS, PORTAGE_RSYNC_EXTRA_OPTS, USE_PYTHON


This is output of emerge -pqv '=media-gfx/iscan-2.26.2'
Code:

[ebuild  N    ] media-gfx/iscan-2.26.2  USE="X jpeg png tiff -doc -gimp" LINGUAS="it -ar -de -es -fr -ja -ko -nl -pt -zh_CN -zh_TW"

Thank you
Back to top
View user's profile Send private message
VoidMage
Watchman
Watchman


Joined: 14 Oct 2006
Posts: 5771

PostPosted: Tue Dec 24, 2013 6:20 pm    Post subject: Reply with quote

...and - quite obviously - you need to post the actual error, not just portage failure message.
Back to top
View user's profile Send private message
xp-vit
n00b
n00b


Joined: 22 Sep 2012
Posts: 36

PostPosted: Tue Dec 24, 2013 7:11 pm    Post subject: Reply with quote

... and log can be found in build.log for this package which I asked for.
Back to top
View user's profile Send private message
stampante
n00b
n00b


Joined: 11 Dec 2013
Posts: 8

PostPosted: Tue Dec 24, 2013 9:20 pm    Post subject: Reply with quote

VoidMage wrote:
...and - quite obviously - you need to post the actual error, not just portage failure message.


This is the error from "build.log":
Code:

/usr/lib/gcc/x86_64-pc-linux-gnu/4.7.3/../../../../x86_64-pc-linux-gnu/bin/ld: ../lib/.libs/libimage-stream.a(libimage_stream_la-pngstream.o): undefined reference to symbol 'png_set_longjmp_fn@@PNG15_0'
/usr/lib/gcc/x86_64-pc-linux-gnu/4.7.3/../../../../x86_64-pc-linux-gnu/bin/ld: note: 'png_set_longjmp_fn@@PNG15_0' is defined in DSO /usr/lib64/libpng15.so.15 so try adding it to the linker command line
/usr/lib64/libpng15.so.15: could not read symbols: Invalid operation
collect2: error: ld returned 1 exit status
make[2]: *** [iscan] Error 1
make[2]: Leaving directory `/home/sergio/CONDIVISA/GENTOO/var/tmp/portage/media-gfx/iscan-2.26.2/work/iscan-2.26.2/frontend'
make[1]: *** [all-recursive] Error 1
make[1]: Leaving directory `/home/sergio/CONDIVISA/GENTOO/var/tmp/portage/media-gfx/iscan-2.26.2/work/iscan-2.26.2'
make: *** [all] Error 2
emake failed

Back to top
View user's profile Send private message
VoidMage
Watchman
Watchman


Joined: 14 Oct 2006
Posts: 5771

PostPosted: Wed Dec 25, 2013 1:20 am    Post subject: Reply with quote

Would be nice to have a few more lines of the log, but that looks quite straightforward - libpng isn't getting explicitly linked to.

This might be fixed in the more recent version already in portage. There also seems to be 2.29.3, which isn't in portage yet.
Back to top
View user's profile Send private message
mahdi1234
Guru
Guru


Joined: 19 Feb 2005
Posts: 500
Location: far from new world orderia

PostPosted: Thu Jan 09, 2014 5:35 pm    Post subject: Reply with quote

Met the same problem ... based on this https://bugs.gentoo.org/show_bug.cgi?id=486382 I did remove png useflag and it builts fine now, just in case.
_________________
http://gentoo.mahdi.cz <-- gentoo package search engine
Back to top
View user's profile Send private message
Display posts from previous:   
Reply to topic    Gentoo Forums Forum Index Portage & Programming All times are GMT
Page 1 of 1

 
Jump to:  
You cannot post new topics in this forum
You cannot reply to topics in this forum
You cannot edit your posts in this forum
You cannot delete your posts in this forum
You cannot vote in polls in this forum