Gentoo Forums
Gentoo Forums
Gentoo Forums
Quick Search: in
need help cant emerge this libproxy-0.4.10-r1 [SOLVED]
View unanswered posts
View posts from last 24 hours

 
Reply to topic    Gentoo Forums Forum Index Portage & Programming
View previous topic :: View next topic  
Author Message
sleepingsun
Guru
Guru


Joined: 03 May 2006
Posts: 316
Location: Bosnia

PostPosted: Sun Jul 28, 2013 1:44 pm    Post subject: need help cant emerge this libproxy-0.4.10-r1 [SOLVED] Reply with quote

Need help to emerge this i just wnt to update it new kde and all package went fine and just this left with this error :

Quote:
Linking CXX shared module config_gnome3.so
cd /var/tmp/portage/net-libs/libproxy-0.4.10-r1/work/libproxy-0.4.10_build/libproxy && /usr/bin/cmake -E cmake_link_script CMakeFiles/config_gnome3.dir/link.txt --verbose=1
/usr/bin/x86_64-pc-linux-gnu-g++ -fPIC -fvisibility=hidden -march=nocona -O2 -pipe -Wl,-O1 -Wl,--as-needed -shared -Wl,-soname,config_gnome3.so -o config_gnome3.so CMakeFiles/config_gnome3.dir/modules/config_gnome3.cpp.o libproxy.so.1.0.0 -Wl,-rpath,/var/tmp/portage/net-libs/libproxy-0.4.10-r1/work/libproxy-0.4.10_build/libproxy:
make[2]: Leaving directory `/var/tmp/portage/net-libs/libproxy-0.4.10-r1/work/libproxy-0.4.10_build'
/usr/bin/cmake -E cmake_progress_report /var/tmp/portage/net-libs/libproxy-0.4.10-r1/work/libproxy-0.4.10_build/CMakeFiles 3
[100%] Built target config_gnome3
make[1]: Leaving directory `/var/tmp/portage/net-libs/libproxy-0.4.10-r1/work/libproxy-0.4.10_build'
make: *** [all] Error 2
* ERROR: net-libs/libproxy-0.4.10-r1 failed (compile phase):
* emake failed
*
* If you need support, post the output of `emerge --info '=net-libs/libproxy-0.4.10-r1'`,
* the complete build log and the output of `emerge -pqv '=net-libs/libproxy-0.4.10-r1'`.
* The complete build log is located at '/var/tmp/portage/net-libs/libproxy-0.4.10-r1/temp/build.log'.
* The ebuild environment file is located at '/var/tmp/portage/net-libs/libproxy-0.4.10-r1/temp/environment'.
* Working directory: '/var/tmp/portage/net-libs/libproxy-0.4.10-r1/work/libproxy-0.4.10_build'
* S: '/var/tmp/portage/net-libs/libproxy-0.4.10-r1/work/libproxy-0.4.10'

>>> Failed to emerge net-libs/libproxy-0.4.10-r1, Log file:

>>> '/var/tmp/portage/net-libs/libproxy-0.4.10-r1/temp/build.log'

* Messages for package net-libs/libproxy-0.4.10-r1:

* ERROR: net-libs/libproxy-0.4.10-r1 failed (compile phase):
* emake failed
*
* If you need support, post the output of `emerge --info '=net-libs/libproxy-0.4.10-r1'`,
* the complete build log and the output of `emerge -pqv '=net-libs/libproxy-0.4.10-r1'`.
* The complete build log is located at '/var/tmp/portage/net-libs/libproxy-0.4.10-r1/temp/build.log'.
* The ebuild environment file is located at '/var/tmp/portage/net-libs/libproxy-0.4.10-r1/temp/environment'.
* Working directory: '/var/tmp/portage/net-libs/libproxy-0.4.10-r1/work/libproxy-0.4.10_build'
* S: '/var/tmp/portage/net-libs/libproxy-0.4.10-r1/work/libproxy-0.4.10'
*
* The following package has failed to build or install:
*
* (net-libs/libproxy-0.4.10-r1::gentoo, ebuild scheduled for merge), Log file:
* '/var/tmp/portage/net-libs/libproxy-0.4.10-r1/temp/build.log'
*

_________________
Gentoo is Rocks


Last edited by sleepingsun on Tue Jul 30, 2013 10:35 am; edited 1 time in total
Back to top
View user's profile Send private message
VoidMage
Watchman
Watchman


Joined: 14 Oct 2006
Posts: 5270

PostPosted: Sun Jul 28, 2013 3:16 pm    Post subject: Reply with quote

Posting the actual error would have help both us and you.
Back to top
View user's profile Send private message
sleepingsun
Guru
Guru


Joined: 03 May 2006
Posts: 316
Location: Bosnia

PostPosted: Sun Jul 28, 2013 8:02 pm    Post subject: Reply with quote

I posted error in quote ?
_________________
Gentoo is Rocks
Back to top
View user's profile Send private message
VoidMage
Watchman
Watchman


Joined: 14 Oct 2006
Posts: 5270

PostPosted: Sun Jul 28, 2013 9:29 pm    Post subject: Reply with quote

sleepingsun wrote:
I posted error in quote ?


Portage bailout message ? Yes.
The actual error ? No.

Pastebin the whole log.
Back to top
View user's profile Send private message
sleepingsun
Guru
Guru


Joined: 03 May 2006
Posts: 316
Location: Bosnia

PostPosted: Sun Jul 28, 2013 10:01 pm    Post subject: Reply with quote

Quote:
 * Package: net-libs/libproxy-0.4.10-r1
 * Repository: gentoo
 * Maintainer: freedesktop-bugs@gentoo.org
 * USE: abi_x86_64 amd64 elibc_glibc gnome kernel_linux multilib perl python userland_GNU webkit
 * FEATURES: preserve-libs sandbox
>>> Unpacking source...
>>> Unpacking libproxy-0.4.10.tar.gz to /var/tmp/portage/net-libs/libproxy-0.4.10-r1/work
>>> Source unpacked in /var/tmp/portage/net-libs/libproxy-0.4.10-r1/work
>>> Preparing source in /var/tmp/portage/net-libs/libproxy-0.4.10-r1/work/libproxy-0.4.10 ...
* Applying libproxy-0.4.10-mozjs185.pc.patch ...
 [ ok ]
* Applying libproxy-0.4.10-disable-pac-test.patch ...
 [ ok ]
* Applying libproxy-0.4.10-cmake-2.8.10.patch ...
 [ ok ]
* Applying libproxy-0.4.11-avoid-nm-build-dep.patch ...
 [ ok ]
>>> Source prepared.
>>> Configuring source in /var/tmp/portage/net-libs/libproxy-0.4.10-r1/work/libproxy-0.4.10 ...
>>> Working in BUILD_DIR: "/var/tmp/portage/net-libs/libproxy-0.4.10-r1/work/libproxy-0.4.10_build"
cmake --no-warn-unused-cli -C /var/tmp/portage/net-libs/libproxy-0.4.10-r1/work/libproxy-0.4.10_build/gentoo_common_config.cmake -G Unix Makefiles -DCMAKE_INSTALL_PREFIX=/usr -DPERL_VENDORINSTALL=ON -DCMAKE_C_FLAGS=-march=nocona -O2 -pipe -DCMAKE_CXX_FLAGS=-march=nocona -O2 -pipe -DWITH_GNOME3=ON -DWITH_KDE4=OFF -DWITH_DOTNET=OFF -DWITH_NM=OFF -DWITH_PERL=ON -DWITH_PYTHON=ON -DWITH_MOZJS=OFF -DWITH_WEBKIT=ON -DWITH_WEBKIT3=ON -DWITH_VALA=ON -DBUILD_TESTING=OFF -DCMAKE_BUILD_TYPE=Gentoo -DCMAKE_INSTALL_DO_STRIP=OFF -DCMAKE_USER_MAKE_RULES_OVERRIDE=/var/tmp/portage/net-libs/libproxy-0.4.10-r1/work/libproxy-0.4.10_build/gentoo_rules.cmake /var/tmp/portage/net-libs/libproxy-0.4.10-r1/work/libproxy-0.4.10
Not searching for unused variables given on the command line.
loading initial cache file /var/tmp/portage/net-libs/libproxy-0.4.10-r1/work/libproxy-0.4.10_build/gentoo_common_config.cmake
-- The C compiler identification is GNU 4.6.3
-- The CXX compiler identification is GNU 4.6.3
-- Check for working C compiler: /usr/bin/x86_64-pc-linux-gnu-gcc
-- Check for working C compiler: /usr/bin/x86_64-pc-linux-gnu-gcc -- works
-- Detecting C compiler ABI info
-- Detecting C compiler ABI info - done
-- Check for working CXX compiler: /usr/bin/x86_64-pc-linux-gnu-g++
-- Check for working CXX compiler: /usr/bin/x86_64-pc-linux-gnu-g++ -- works
-- Detecting CXX compiler ABI info
-- Detecting CXX compiler ABI info - done
-- Building with bundled libmodman
-- Found PythonInterp: /usr/bin/python (found version "2.7.5")
-- Found python version 2.7
-- Using PYTHON_SITEPKG_DIR=/usr/lib64/python2.7/site-packages
-- Found Perl: /usr/bin/perl (found version "5.12.4")
-- Found PerlLibs: /usr/lib64/libperl.so.5.12.4 (found version "5.12.4")
-- Found PkgConfig: /usr/bin/x86_64-pc-linux-gnu-pkg-config (found version "0.28")
-- checking for modules 'gio-2.0>=2.26;gobject-2.0'
-- found gio-2.0, version 2.32.4
-- found gobject-2.0, version 2.32.4
-- checking for module 'natus'
-- package 'natus' not found
-- checking for module 'javascriptcoregtk-3.0 >= 1.5.0'
-- found javascriptcoregtk-3.0 , version 1.8.3
MODULES TO BUILD:
* config_envvar
config_sysconfig
config_gnome
m config_gnome3
config_kde4
config_macosx
config_w32reg
* ignore_domain
* ignore_hostname
* ignore_ip
network_networkmanager
pacrunner_mozjs
pacrunner_natus
* pacrunner_webkit
* wpad_dns_alias

-- <<< Gentoo configuration >>>
Build type Gentoo
Install path /usr
Compiler flags:
C -march=nocona -O2 -pipe
C++ -march=nocona -O2 -pipe
Linker flags:
Executable -Wl,-O1 -Wl,--as-needed
Module -Wl,-O1 -Wl,--as-needed
Shared -Wl,-O1 -Wl,--as-needed

-- Configuring done
-- Generating done
-- Build files have been written to: /var/tmp/portage/net-libs/libproxy-0.4.10-r1/work/libproxy-0.4.10_build
>>> Source configured.
>>> Compiling source in /var/tmp/portage/net-libs/libproxy-0.4.10-r1/work/libproxy-0.4.10 ...
>>> Working in BUILD_DIR: "/var/tmp/portage/net-libs/libproxy-0.4.10-r1/work/libproxy-0.4.10_build"
make -j5 VERBOSE=1
/usr/bin/cmake -H/var/tmp/portage/net-libs/libproxy-0.4.10-r1/work/libproxy-0.4.10 -B/var/tmp/portage/net-libs/libproxy-0.4.10-r1/work/libproxy-0.4.10_build --check-build-system CMakeFiles/Makefile.cmake 0
/usr/bin/cmake -E cmake_progress_start /var/tmp/portage/net-libs/libproxy-0.4.10-r1/work/libproxy-0.4.10_build/CMakeFiles /var/tmp/portage/net-libs/libproxy-0.4.10-r1/work/libproxy-0.4.10_build/CMakeFiles/progress.marks
make -f CMakeFiles/Makefile2 all
make[1]: Entering directory `/var/tmp/portage/net-libs/libproxy-0.4.10-r1/work/libproxy-0.4.10_build'
make -f libmodman/CMakeFiles/modman.dir/build.make libmodman/CMakeFiles/modman.dir/depend
make -f bindings/perl/lib/CMakeFiles/PMlibproxy.dir/build.make bindings/perl/lib/CMakeFiles/PMlibproxy.dir/depend
make -f libproxy/CMakeFiles/pxgsettings.dir/build.make libproxy/CMakeFiles/pxgsettings.dir/depend
make[2]: Entering directory `/var/tmp/portage/net-libs/libproxy-0.4.10-r1/work/libproxy-0.4.10_build'
cd /var/tmp/portage/net-libs/libproxy-0.4.10-r1/work/libproxy-0.4.10_build && /usr/bin/cmake -E cmake_depends "Unix Makefiles" /var/tmp/portage/net-libs/libproxy-0.4.10-r1/work/libproxy-0.4.10 /var/tmp/portage/net-libs/libproxy-0.4.10-r1/work/libproxy-0.4.10/libmodman /var/tmp/portage/net-libs/libproxy-0.4.10-r1/work/libproxy-0.4.10_build /var/tmp/portage/net-libs/libproxy-0.4.10-r1/work/libproxy-0.4.10_build/libmodman /var/tmp/portage/net-libs/libproxy-0.4.10-r1/work/libproxy-0.4.10_build/libmodman/CMakeFiles/modman.dir/DependInfo.cmake --color=
make[2]: Entering directory `/var/tmp/portage/net-libs/libproxy-0.4.10-r1/work/libproxy-0.4.10_build'
cd /var/tmp/portage/net-libs/libproxy-0.4.10-r1/work/libproxy-0.4.10_build && /usr/bin/cmake -E cmake_depends "Unix Makefiles" /var/tmp/portage/net-libs/libproxy-0.4.10-r1/work/libproxy-0.4.10 /var/tmp/portage/net-libs/libproxy-0.4.10-r1/work/libproxy-0.4.10/bindings/perl/lib /var/tmp/portage/net-libs/libproxy-0.4.10-r1/work/libproxy-0.4.10_build /var/tmp/portage/net-libs/libproxy-0.4.10-r1/work/libproxy-0.4.10_build/bindings/perl/lib /var/tmp/portage/net-libs/libproxy-0.4.10-r1/work/libproxy-0.4.10_build/bindings/perl/lib/CMakeFiles/PMlibproxy.dir/DependInfo.cmake --color=
make[2]: Entering directory `/var/tmp/portage/net-libs/libproxy-0.4.10-r1/work/libproxy-0.4.10_build'
cd /var/tmp/portage/net-libs/libproxy-0.4.10-r1/work/libproxy-0.4.10_build && /usr/bin/cmake -E cmake_depends "Unix Makefiles" /var/tmp/portage/net-libs/libproxy-0.4.10-r1/work/libproxy-0.4.10 /var/tmp/portage/net-libs/libproxy-0.4.10-r1/work/libproxy-0.4.10/libproxy /var/tmp/portage/net-libs/libproxy-0.4.10-r1/work/libproxy-0.4.10_build /var/tmp/portage/net-libs/libproxy-0.4.10-r1/work/libproxy-0.4.10_build/libproxy /var/tmp/portage/net-libs/libproxy-0.4.10-r1/work/libproxy-0.4.10_build/libproxy/CMakeFiles/pxgsettings.dir/DependInfo.cmake --color=
Dependee "/var/tmp/portage/net-libs/libproxy-0.4.10-r1/work/libproxy-0.4.10_build/libmodman/CMakeFiles/modman.dir/DependInfo.cmake" is newer than depender "/var/tmp/portage/net-libs/libproxy-0.4.10-r1/work/libproxy-0.4.10_build/libmodman/CMakeFiles/modman.dir/depend.internal".
Dependee "/var/tmp/portage/net-libs/libproxy-0.4.10-r1/work/libproxy-0.4.10_build/libmodman/CMakeFiles/CMakeDirectoryInformation.cmake" is newer than depender "/var/tmp/portage/net-libs/libproxy-0.4.10-r1/work/libproxy-0.4.10_build/libmodman/CMakeFiles/modman.dir/depend.internal".
Scanning dependencies of target modman
Dependee "/var/tmp/portage/net-libs/libproxy-0.4.10-r1/work/libproxy-0.4.10_build/bindings/perl/lib/CMakeFiles/PMlibproxy.dir/DependInfo.cmake" is newer than depender "/var/tmp/portage/net-libs/libproxy-0.4.10-r1/work/libproxy-0.4.10_build/bindings/perl/lib/CMakeFiles/PMlibproxy.dir/depend.internal".
Dependee "/var/tmp/portage/net-libs/libproxy-0.4.10-r1/work/libproxy-0.4.10_build/bindings/perl/lib/CMakeFiles/CMakeDirectoryInformation.cmake" is newer than depender "/var/tmp/portage/net-libs/libproxy-0.4.10-r1/work/libproxy-0.4.10_build/bindings/perl/lib/CMakeFiles/PMlibproxy.dir/depend.internal".
Scanning dependencies of target PMlibproxy
Dependee "/var/tmp/portage/net-libs/libproxy-0.4.10-r1/work/libproxy-0.4.10_build/libproxy/CMakeFiles/pxgsettings.dir/DependInfo.cmake" is newer than depender "/var/tmp/portage/net-libs/libproxy-0.4.10-r1/work/libproxy-0.4.10_build/libproxy/CMakeFiles/pxgsettings.dir/depend.internal".
Dependee "/var/tmp/portage/net-libs/libproxy-0.4.10-r1/work/libproxy-0.4.10_build/libproxy/CMakeFiles/CMakeDirectoryInformation.cmake" is newer than depender "/var/tmp/portage/net-libs/libproxy-0.4.10-r1/work/libproxy-0.4.10_build/libproxy/CMakeFiles/pxgsettings.dir/depend.internal".
Scanning dependencies of target pxgsettings
make[2]: Leaving directory `/var/tmp/portage/net-libs/libproxy-0.4.10-r1/work/libproxy-0.4.10_build'
make -f bindings/perl/lib/CMakeFiles/PMlibproxy.dir/build.make bindings/perl/lib/CMakeFiles/PMlibproxy.dir/build
make[2]: Entering directory `/var/tmp/portage/net-libs/libproxy-0.4.10-r1/work/libproxy-0.4.10_build'
cd /var/tmp/portage/net-libs/libproxy-0.4.10-r1/work/libproxy-0.4.10_build/bindings/perl/lib && /usr/bin/cmake -E copy /var/tmp/portage/net-libs/libproxy-0.4.10-r1/work/libproxy-0.4.10/bindings/perl/lib/Libproxy.pm /var/tmp/portage/net-libs/libproxy-0.4.10-r1/work/libproxy-0.4.10_build/perl/blib/lib/Libproxy.pm
make[2]: Leaving directory `/var/tmp/portage/net-libs/libproxy-0.4.10-r1/work/libproxy-0.4.10_build'
make -f libmodman/CMakeFiles/modman.dir/build.make libmodman/CMakeFiles/modman.dir/build
make[2]: Entering directory `/var/tmp/portage/net-libs/libproxy-0.4.10-r1/work/libproxy-0.4.10_build'
/usr/bin/cmake -E cmake_progress_report /var/tmp/portage/net-libs/libproxy-0.4.10-r1/work/libproxy-0.4.10_build/CMakeFiles 15
[ 5%] make[2]: Leaving directory `/var/tmp/portage/net-libs/libproxy-0.4.10-r1/work/libproxy-0.4.10_build'
/usr/bin/cmake -E cmake_progress_report /var/tmp/portage/net-libs/libproxy-0.4.10-r1/work/libproxy-0.4.10_build/CMakeFiles
[ 5%] Building CXX object libmodman/CMakeFiles/modman.dir/module_manager.cpp.o
Built target PMlibproxy
cd /var/tmp/portage/net-libs/libproxy-0.4.10-r1/work/libproxy-0.4.10_build/libmodman && /usr/bin/x86_64-pc-linux-gnu-g++ -DNDEBUG -fvisibility=hidden -fPIC -march=nocona -O2 -pipe -I/var/tmp/portage/net-libs/libproxy-0.4.10-r1/work/libproxy-0.4.10 -o CMakeFiles/modman.dir/module_manager.cpp.o -c /var/tmp/portage/net-libs/libproxy-0.4.10-r1/work/libproxy-0.4.10/libmodman/module_manager.cpp
make[2]: Leaving directory `/var/tmp/portage/net-libs/libproxy-0.4.10-r1/work/libproxy-0.4.10_build'
make -f libproxy/CMakeFiles/pxgsettings.dir/build.make libproxy/CMakeFiles/pxgsettings.dir/build
make[2]: Entering directory `/var/tmp/portage/net-libs/libproxy-0.4.10-r1/work/libproxy-0.4.10_build'
/usr/bin/cmake -E cmake_progress_report /var/tmp/portage/net-libs/libproxy-0.4.10-r1/work/libproxy-0.4.10_build/CMakeFiles 17
[ 11%] Building CXX object libproxy/CMakeFiles/pxgsettings.dir/modules/pxgsettings.cpp.o
cd /var/tmp/portage/net-libs/libproxy-0.4.10-r1/work/libproxy-0.4.10_build/libproxy && /usr/bin/x86_64-pc-linux-gnu-g++ -D_POSIX_C_SOURCE=200112L -DNDEBUG -fvisibility=hidden -march=nocona -O2 -pipe -I/var/tmp/portage/net-libs/libproxy-0.4.10-r1/work/libproxy-0.4.10 -I/usr/include/glib-2.0 -I/usr/lib64/glib-2.0/include -I/usr/include/webkitgtk-3.0 -o CMakeFiles/pxgsettings.dir/modules/pxgsettings.cpp.o -c /var/tmp/portage/net-libs/libproxy-0.4.10-r1/work/libproxy-0.4.10/libproxy/modules/pxgsettings.cpp
Linking CXX executable pxgsettings
cd /var/tmp/portage/net-libs/libproxy-0.4.10-r1/work/libproxy-0.4.10_build/libproxy && /usr/bin/cmake -E cmake_link_script CMakeFiles/pxgsettings.dir/link.txt --verbose=1
/usr/bin/x86_64-pc-linux-gnu-g++ -fvisibility=hidden -march=nocona -O2 -pipe -Wl,-O1 -Wl,--as-needed CMakeFiles/pxgsettings.dir/modules/pxgsettings.cpp.o -o pxgsettings -rdynamic -lgio-2.0 -lgobject-2.0 -lglib-2.0
make[2]: Leaving directory `/var/tmp/portage/net-libs/libproxy-0.4.10-r1/work/libproxy-0.4.10_build'
/usr/bin/cmake -E cmake_progress_report /var/tmp/portage/net-libs/libproxy-0.4.10-r1/work/libproxy-0.4.10_build/CMakeFiles 17
[ 11%] Built target pxgsettings
Linking CXX static library libmodman.a
cd /var/tmp/portage/net-libs/libproxy-0.4.10-r1/work/libproxy-0.4.10_build/libmodman && /usr/bin/cmake -P CMakeFiles/modman.dir/cmake_clean_target.cmake
cd /var/tmp/portage/net-libs/libproxy-0.4.10-r1/work/libproxy-0.4.10_build/libmodman && /usr/bin/cmake -E cmake_link_script CMakeFiles/modman.dir/link.txt --verbose=1
/usr/bin/x86_64-pc-linux-gnu-ar cr libmodman.a CMakeFiles/modman.dir/module_manager.cpp.o
/usr/bin/x86_64-pc-linux-gnu-ranlib libmodman.a
make[2]: Leaving directory `/var/tmp/portage/net-libs/libproxy-0.4.10-r1/work/libproxy-0.4.10_build'
/usr/bin/cmake -E cmake_progress_report /var/tmp/portage/net-libs/libproxy-0.4.10-r1/work/libproxy-0.4.10_build/CMakeFiles 15
[ 11%] Built target modman
make -f libproxy/CMakeFiles/libproxy.dir/build.make libproxy/CMakeFiles/libproxy.dir/depend
make[2]: Entering directory `/var/tmp/portage/net-libs/libproxy-0.4.10-r1/work/libproxy-0.4.10_build'
cd /var/tmp/portage/net-libs/libproxy-0.4.10-r1/work/libproxy-0.4.10_build && /usr/bin/cmake -E cmake_depends "Unix Makefiles" /var/tmp/portage/net-libs/libproxy-0.4.10-r1/work/libproxy-0.4.10 /var/tmp/portage/net-libs/libproxy-0.4.10-r1/work/libproxy-0.4.10/libproxy /var/tmp/portage/net-libs/libproxy-0.4.10-r1/work/libproxy-0.4.10_build /var/tmp/portage/net-libs/libproxy-0.4.10-r1/work/libproxy-0.4.10_build/libproxy /var/tmp/portage/net-libs/libproxy-0.4.10-r1/work/libproxy-0.4.10_build/libproxy/CMakeFiles/libproxy.dir/DependInfo.cmake --color=
Dependee "/var/tmp/portage/net-libs/libproxy-0.4.10-r1/work/libproxy-0.4.10_build/libproxy/CMakeFiles/libproxy.dir/DependInfo.cmake" is newer than depender "/var/tmp/portage/net-libs/libproxy-0.4.10-r1/work/libproxy-0.4.10_build/libproxy/CMakeFiles/libproxy.dir/depend.internal".
Dependee "/var/tmp/portage/net-libs/libproxy-0.4.10-r1/work/libproxy-0.4.10_build/libproxy/CMakeFiles/CMakeDirectoryInformation.cmake" is newer than depender "/var/tmp/portage/net-libs/libproxy-0.4.10-r1/work/libproxy-0.4.10_build/libproxy/CMakeFiles/libproxy.dir/depend.internal".
Scanning dependencies of target libproxy
make[2]: Leaving directory `/var/tmp/portage/net-libs/libproxy-0.4.10-r1/work/libproxy-0.4.10_build'
make -f libproxy/CMakeFiles/libproxy.dir/build.make libproxy/CMakeFiles/libproxy.dir/build
make[2]: Entering directory `/var/tmp/portage/net-libs/libproxy-0.4.10-r1/work/libproxy-0.4.10_build'
/usr/bin/cmake -E cmake_progress_report /var/tmp/portage/net-libs/libproxy-0.4.10-r1/work/libproxy-0.4.10_build/CMakeFiles 4
/usr/bin/cmake -E cmake_progress_report /var/tmp/portage/net-libs/libproxy-0.4.10-r1/work/libproxy-0.4.10_build/CMakeFiles 5
/usr/bin/cmake -E cmake_progress_report /var/tmp/portage/net-libs/libproxy-0.4.10-r1/work/libproxy-0.4.10_build/CMakeFiles 6
/usr/bin/cmake -E cmake_progress_report /var/tmp/portage/net-libs/libproxy-0.4.10-r1/work/libproxy-0.4.10_build/CMakeFiles 7
/usr/bin/cmake -E cmake_progress_report /var/tmp/portage/net-libs/libproxy-0.4.10-r1/work/libproxy-0.4.10_build/CMakeFiles 8
[ 17%] [ 23%] [ 29%] [ 35%] [ 41%] Building CXX object libproxy/CMakeFiles/libproxy.dir/extension_config.cpp.o
cd /var/tmp/portage/net-libs/libproxy-0.4.10-r1/work/libproxy-0.4.10_build/libproxy && /usr/bin/x86_64-pc-linux-gnu-g++ -D_POSIX_C_SOURCE=200112L -Dlibproxy_EXPORTS -DNDEBUG -fvisibility=hidden -march=nocona -O2 -pipe -fPIC -I/var/tmp/portage/net-libs/libproxy-0.4.10-r1/work/libproxy-0.4.10 -I/usr/include/glib-2.0 -I/usr/lib64/glib-2.0/include -I/usr/include/webkitgtk-3.0 -o CMakeFiles/libproxy.dir/extension_config.cpp.o -c /var/tmp/portage/net-libs/libproxy-0.4.10-r1/work/libproxy-0.4.10/libproxy/extension_config.cpp
Building CXX object libproxy/CMakeFiles/libproxy.dir/extension_pacrunner.cpp.o
cd /var/tmp/portage/net-libs/libproxy-0.4.10-r1/work/libproxy-0.4.10_build/libproxy && /usr/bin/x86_64-pc-linux-gnu-g++ -D_POSIX_C_SOURCE=200112L -Dlibproxy_EXPORTS -DNDEBUG -fvisibility=hidden -march=nocona -O2 -pipe -fPIC -I/var/tmp/portage/net-libs/libproxy-0.4.10-r1/work/libproxy-0.4.10 -I/usr/include/glib-2.0 -I/usr/lib64/glib-2.0/include -I/usr/include/webkitgtk-3.0 -o CMakeFiles/libproxy.dir/extension_pacrunner.cpp.o -c /var/tmp/portage/net-libs/libproxy-0.4.10-r1/work/libproxy-0.4.10/libproxy/extension_pacrunner.cpp
Building CXX object libproxy/CMakeFiles/libproxy.dir/url.cpp.o
Building CXX object libproxy/CMakeFiles/libproxy.dir/extension_wpad.cpp.o
cd /var/tmp/portage/net-libs/libproxy-0.4.10-r1/work/libproxy-0.4.10_build/libproxy && /usr/bin/x86_64-pc-linux-gnu-g++ -D_POSIX_C_SOURCE=200112L -Dlibproxy_EXPORTS -DNDEBUG -fvisibility=hidden -march=nocona -O2 -pipe -fPIC -I/var/tmp/portage/net-libs/libproxy-0.4.10-r1/work/libproxy-0.4.10 -I/usr/include/glib-2.0 -I/usr/lib64/glib-2.0/include -I/usr/include/webkitgtk-3.0 -o CMakeFiles/libproxy.dir/extension_wpad.cpp.o -c /var/tmp/portage/net-libs/libproxy-0.4.10-r1/work/libproxy-0.4.10/libproxy/extension_wpad.cpp
cd /var/tmp/portage/net-libs/libproxy-0.4.10-r1/work/libproxy-0.4.10_build/libproxy && /usr/bin/x86_64-pc-linux-gnu-g++ -D_POSIX_C_SOURCE=200112L -Dlibproxy_EXPORTS -DNDEBUG -fvisibility=hidden -march=nocona -O2 -pipe -fPIC -I/var/tmp/portage/net-libs/libproxy-0.4.10-r1/work/libproxy-0.4.10 -I/usr/include/glib-2.0 -I/usr/lib64/glib-2.0/include -I/usr/include/webkitgtk-3.0 -o CMakeFiles/libproxy.dir/url.cpp.o -c /var/tmp/portage/net-libs/libproxy-0.4.10-r1/work/libproxy-0.4.10/libproxy/url.cpp
Building CXX object libproxy/CMakeFiles/libproxy.dir/proxy.cpp.o
cd /var/tmp/portage/net-libs/libproxy-0.4.10-r1/work/libproxy-0.4.10_build/libproxy && /usr/bin/x86_64-pc-linux-gnu-g++ -D_POSIX_C_SOURCE=200112L -Dlibproxy_EXPORTS -DBUILTIN_MODULES=" X(config_envvar) X(ignore_domain) X(ignore_hostname) X(ignore_ip) X(pacrunner_webkit) X(wpad_dns_alias)" -DMODULEDIR=\"/usr/lib64/libproxy/0.4.10/modules\" -DNDEBUG -fvisibility=hidden -march=nocona -O2 -pipe -fPIC -I/var/tmp/portage/net-libs/libproxy-0.4.10-r1/work/libproxy-0.4.10 -I/usr/include/glib-2.0 -I/usr/lib64/glib-2.0/include -I/usr/include/webkitgtk-3.0 -o CMakeFiles/libproxy.dir/proxy.cpp.o -c /var/tmp/portage/net-libs/libproxy-0.4.10-r1/work/libproxy-0.4.10/libproxy/proxy.cpp
/usr/bin/cmake -E cmake_progress_report /var/tmp/portage/net-libs/libproxy-0.4.10-r1/work/libproxy-0.4.10_build/CMakeFiles 9
[ 47%] /usr/bin/cmake -E cmake_progress_report /var/tmp/portage/net-libs/libproxy-0.4.10-r1/work/libproxy-0.4.10_build/CMakeFiles 10
Building CXX object libproxy/CMakeFiles/libproxy.dir/modules/config_envvar.cpp.o
cd /var/tmp/portage/net-libs/libproxy-0.4.10-r1/work/libproxy-0.4.10_build/libproxy && /usr/bin/x86_64-pc-linux-gnu-g++ -D_POSIX_C_SOURCE=200112L -Dlibproxy_EXPORTS -DLIBEXECDIR=\"/usr/libexec\" -DMM_MODULE_BUILTIN=config_envvar -DNDEBUG -fvisibility=hidden -march=nocona -O2 -pipe -fPIC -I/var/tmp/portage/net-libs/libproxy-0.4.10-r1/work/libproxy-0.4.10 -I/usr/include/glib-2.0 -I/usr/lib64/glib-2.0/include -I/usr/include/webkitgtk-3.0 -o CMakeFiles/libproxy.dir/modules/config_envvar.cpp.o -c /var/tmp/portage/net-libs/libproxy-0.4.10-r1/work/libproxy-0.4.10/libproxy/modules/config_envvar.cpp
[ 52%] Building CXX object libproxy/CMakeFiles/libproxy.dir/modules/ignore_domain.cpp.o
cd /var/tmp/portage/net-libs/libproxy-0.4.10-r1/work/libproxy-0.4.10_build/libproxy && /usr/bin/x86_64-pc-linux-gnu-g++ -D_POSIX_C_SOURCE=200112L -Dlibproxy_EXPORTS -DLIBEXECDIR=\"/usr/libexec\" -DMM_MODULE_BUILTIN=ignore_domain -DNDEBUG -fvisibility=hidden -march=nocona -O2 -pipe -fPIC -I/var/tmp/portage/net-libs/libproxy-0.4.10-r1/work/libproxy-0.4.10 -I/usr/include/glib-2.0 -I/usr/lib64/glib-2.0/include -I/usr/include/webkitgtk-3.0 -o CMakeFiles/libproxy.dir/modules/ignore_domain.cpp.o -c /var/tmp/portage/net-libs/libproxy-0.4.10-r1/work/libproxy-0.4.10/libproxy/modules/ignore_domain.cpp
/usr/bin/cmake -E cmake_progress_report /var/tmp/portage/net-libs/libproxy-0.4.10-r1/work/libproxy-0.4.10_build/CMakeFiles 11
[ 58%] Building CXX object libproxy/CMakeFiles/libproxy.dir/modules/ignore_hostname.cpp.o
cd /var/tmp/portage/net-libs/libproxy-0.4.10-r1/work/libproxy-0.4.10_build/libproxy && /usr/bin/x86_64-pc-linux-gnu-g++ -D_POSIX_C_SOURCE=200112L -Dlibproxy_EXPORTS -DLIBEXECDIR=\"/usr/libexec\" -DMM_MODULE_BUILTIN=ignore_hostname -DNDEBUG -fvisibility=hidden -march=nocona -O2 -pipe -fPIC -I/var/tmp/portage/net-libs/libproxy-0.4.10-r1/work/libproxy-0.4.10 -I/usr/include/glib-2.0 -I/usr/lib64/glib-2.0/include -I/usr/include/webkitgtk-3.0 -o CMakeFiles/libproxy.dir/modules/ignore_hostname.cpp.o -c /var/tmp/portage/net-libs/libproxy-0.4.10-r1/work/libproxy-0.4.10/libproxy/modules/ignore_hostname.cpp
/usr/bin/cmake -E cmake_progress_report /var/tmp/portage/net-libs/libproxy-0.4.10-r1/work/libproxy-0.4.10_build/CMakeFiles 12
[ 64%] /usr/bin/cmake -E cmake_progress_report /var/tmp/portage/net-libs/libproxy-0.4.10-r1/work/libproxy-0.4.10_build/CMakeFiles 13
Building CXX object libproxy/CMakeFiles/libproxy.dir/modules/ignore_ip.cpp.o
cd /var/tmp/portage/net-libs/libproxy-0.4.10-r1/work/libproxy-0.4.10_build/libproxy && /usr/bin/x86_64-pc-linux-gnu-g++ -D_POSIX_C_SOURCE=200112L -Dlibproxy_EXPORTS -DLIBEXECDIR=\"/usr/libexec\" -DMM_MODULE_BUILTIN=ignore_ip -DNDEBUG -fvisibility=hidden -march=nocona -O2 -pipe -fPIC -I/var/tmp/portage/net-libs/libproxy-0.4.10-r1/work/libproxy-0.4.10 -I/usr/include/glib-2.0 -I/usr/lib64/glib-2.0/include -I/usr/include/webkitgtk-3.0 -o CMakeFiles/libproxy.dir/modules/ignore_ip.cpp.o -c /var/tmp/portage/net-libs/libproxy-0.4.10-r1/work/libproxy-0.4.10/libproxy/modules/ignore_ip.cpp
[ 70%] Building CXX object libproxy/CMakeFiles/libproxy.dir/modules/pacrunner_webkit.cpp.o
cd /var/tmp/portage/net-libs/libproxy-0.4.10-r1/work/libproxy-0.4.10_build/libproxy && /usr/bin/x86_64-pc-linux-gnu-g++ -D_POSIX_C_SOURCE=200112L -Dlibproxy_EXPORTS -DLIBEXECDIR=\"/usr/libexec\" -DMM_MODULE_BUILTIN=pacrunner_webkit -DNDEBUG -fvisibility=hidden -march=nocona -O2 -pipe -fPIC -I/var/tmp/portage/net-libs/libproxy-0.4.10-r1/work/libproxy-0.4.10 -I/usr/include/glib-2.0 -I/usr/lib64/glib-2.0/include -I/usr/include/webkitgtk-3.0 -o CMakeFiles/libproxy.dir/modules/pacrunner_webkit.cpp.o -c /var/tmp/portage/net-libs/libproxy-0.4.10-r1/work/libproxy-0.4.10/libproxy/modules/pacrunner_webkit.cpp
/usr/bin/cmake -E cmake_progress_report /var/tmp/portage/net-libs/libproxy-0.4.10-r1/work/libproxy-0.4.10_build/CMakeFiles 14
[ 76%] Building CXX object libproxy/CMakeFiles/libproxy.dir/modules/wpad_dns_alias.cpp.o
cd /var/tmp/portage/net-libs/libproxy-0.4.10-r1/work/libproxy-0.4.10_build/libproxy && /usr/bin/x86_64-pc-linux-gnu-g++ -D_POSIX_C_SOURCE=200112L -Dlibproxy_EXPORTS -DLIBEXECDIR=\"/usr/libexec\" -DMM_MODULE_BUILTIN=wpad_dns_alias -DNDEBUG -fvisibility=hidden -march=nocona -O2 -pipe -fPIC -I/var/tmp/portage/net-libs/libproxy-0.4.10-r1/work/libproxy-0.4.10 -I/usr/include/glib-2.0 -I/usr/lib64/glib-2.0/include -I/usr/include/webkitgtk-3.0 -o CMakeFiles/libproxy.dir/modules/wpad_dns_alias.cpp.o -c /var/tmp/portage/net-libs/libproxy-0.4.10-r1/work/libproxy-0.4.10/libproxy/modules/wpad_dns_alias.cpp
Linking CXX shared library libproxy.so
cd /var/tmp/portage/net-libs/libproxy-0.4.10-r1/work/libproxy-0.4.10_build/libproxy && /usr/bin/cmake -E cmake_link_script CMakeFiles/libproxy.dir/link.txt --verbose=1
/usr/bin/x86_64-pc-linux-gnu-g++ -fPIC -fvisibility=hidden -march=nocona -O2 -pipe -Wl,-O1 -Wl,--as-needed -shared -Wl,-soname,libproxy.so.1 -o libproxy.so.1.0.0 CMakeFiles/libproxy.dir/extension_config.cpp.o CMakeFiles/libproxy.dir/extension_pacrunner.cpp.o CMakeFiles/libproxy.dir/extension_wpad.cpp.o CMakeFiles/libproxy.dir/proxy.cpp.o CMakeFiles/libproxy.dir/url.cpp.o CMakeFiles/libproxy.dir/modules/config_envvar.cpp.o CMakeFiles/libproxy.dir/modules/ignore_domain.cpp.o CMakeFiles/libproxy.dir/modules/ignore_hostname.cpp.o CMakeFiles/libproxy.dir/modules/ignore_ip.cpp.o CMakeFiles/libproxy.dir/modules/pacrunner_webkit.cpp.o CMakeFiles/libproxy.dir/modules/wpad_dns_alias.cpp.o ../libmodman/libmodman.a -lm -lpthread -ldl -ljavascriptcoregtk-3.0 -lglib-2.0
cd /var/tmp/portage/net-libs/libproxy-0.4.10-r1/work/libproxy-0.4.10_build/libproxy && /usr/bin/cmake -E cmake_symlink_library libproxy.so.1.0.0 libproxy.so.1 libproxy.so
make[2]: Leaving directory `/var/tmp/portage/net-libs/libproxy-0.4.10-r1/work/libproxy-0.4.10_build'
/usr/bin/cmake -E cmake_progress_report /var/tmp/portage/net-libs/libproxy-0.4.10-r1/work/libproxy-0.4.10_build/CMakeFiles 4 5 6 7 8 9 10 11 12 13 14
[ 76%] Built target libproxy
make -f bindings/perl/src/CMakeFiles/PLlibproxy.dir/build.make bindings/perl/src/CMakeFiles/PLlibproxy.dir/depend
make -f libproxy/CMakeFiles/config_gnome3.dir/build.make libproxy/CMakeFiles/config_gnome3.dir/depend
make -f utils/CMakeFiles/proxy.dir/build.make utils/CMakeFiles/proxy.dir/depend
make[2]: Entering directory `/var/tmp/portage/net-libs/libproxy-0.4.10-r1/work/libproxy-0.4.10_build'
/usr/bin/cmake -E cmake_progress_report /var/tmp/portage/net-libs/libproxy-0.4.10-r1/work/libproxy-0.4.10_build/CMakeFiles 1
make[2]: Entering directory `/var/tmp/portage/net-libs/libproxy-0.4.10-r1/work/libproxy-0.4.10_build'
cd /var/tmp/portage/net-libs/libproxy-0.4.10-r1/work/libproxy-0.4.10_build && /usr/bin/cmake -E cmake_depends "Unix Makefiles" /var/tmp/portage/net-libs/libproxy-0.4.10-r1/work/libproxy-0.4.10 /var/tmp/portage/net-libs/libproxy-0.4.10-r1/work/libproxy-0.4.10/libproxy /var/tmp/portage/net-libs/libproxy-0.4.10-r1/work/libproxy-0.4.10_build /var/tmp/portage/net-libs/libproxy-0.4.10-r1/work/libproxy-0.4.10_build/libproxy /var/tmp/portage/net-libs/libproxy-0.4.10-r1/work/libproxy-0.4.10_build/libproxy/CMakeFiles/config_gnome3.dir/DependInfo.cmake --color=
make[2]: Entering directory `/var/tmp/portage/net-libs/libproxy-0.4.10-r1/work/libproxy-0.4.10_build'
cd /var/tmp/portage/net-libs/libproxy-0.4.10-r1/work/libproxy-0.4.10_build && /usr/bin/cmake -E cmake_depends "Unix Makefiles" /var/tmp/portage/net-libs/libproxy-0.4.10-r1/work/libproxy-0.4.10 /var/tmp/portage/net-libs/libproxy-0.4.10-r1/work/libproxy-0.4.10/utils /var/tmp/portage/net-libs/libproxy-0.4.10-r1/work/libproxy-0.4.10_build /var/tmp/portage/net-libs/libproxy-0.4.10-r1/work/libproxy-0.4.10_build/utils /var/tmp/portage/net-libs/libproxy-0.4.10-r1/work/libproxy-0.4.10_build/utils/CMakeFiles/proxy.dir/DependInfo.cmake --color=
[ 82%] Dependee "/var/tmp/portage/net-libs/libproxy-0.4.10-r1/work/libproxy-0.4.10_build/libproxy/CMakeFiles/config_gnome3.dir/DependInfo.cmake" is newer than depender "/var/tmp/portage/net-libs/libproxy-0.4.10-r1/work/libproxy-0.4.10_build/libproxy/CMakeFiles/config_gnome3.dir/depend.internal".
Dependee "/var/tmp/portage/net-libs/libproxy-0.4.10-r1/work/libproxy-0.4.10_build/libproxy/CMakeFiles/CMakeDirectoryInformation.cmake" is newer than depender "/var/tmp/portage/net-libs/libproxy-0.4.10-r1/work/libproxy-0.4.10_build/libproxy/CMakeFiles/config_gnome3.dir/depend.internal".
Scanning dependencies of target config_gnome3
Dependee "/var/tmp/portage/net-libs/libproxy-0.4.10-r1/work/libproxy-0.4.10_build/utils/CMakeFiles/proxy.dir/DependInfo.cmake" is newer than depender "/var/tmp/portage/net-libs/libproxy-0.4.10-r1/work/libproxy-0.4.10_build/utils/CMakeFiles/proxy.dir/depend.internal".
Dependee "/var/tmp/portage/net-libs/libproxy-0.4.10-r1/work/libproxy-0.4.10_build/utils/CMakeFiles/CMakeDirectoryInformation.cmake" is newer than depender "/var/tmp/portage/net-libs/libproxy-0.4.10-r1/work/libproxy-0.4.10_build/utils/CMakeFiles/proxy.dir/depend.internal".
Scanning dependencies of target proxy
Generating Libproxy.c
cd /var/tmp/portage/net-libs/libproxy-0.4.10-r1/work/libproxy-0.4.10_build/bindings/perl/src && /usr/bin/perl /var/tmp/portage/net-libs/libproxy-0.4.10-r1/work/libproxy-0.4.10/bindings/perl/src/doxsubpp.pl /usr/bin/perl /var/tmp/portage/net-libs/libproxy-0.4.10-r1/work/libproxy-0.4.10/bindings/perl/src/Libproxy.xs /var/tmp/portage/net-libs/libproxy-0.4.10-r1/work/libproxy-0.4.10_build/bindings/perl/src/Libproxy.c
make[2]: Leaving directory `/var/tmp/portage/net-libs/libproxy-0.4.10-r1/work/libproxy-0.4.10_build'
make -f utils/CMakeFiles/proxy.dir/build.make utils/CMakeFiles/proxy.dir/build
make[2]: Leaving directory `/var/tmp/portage/net-libs/libproxy-0.4.10-r1/work/libproxy-0.4.10_build'
make -f libproxy/CMakeFiles/config_gnome3.dir/build.make libproxy/CMakeFiles/config_gnome3.dir/build
make[2]: Entering directory `/var/tmp/portage/net-libs/libproxy-0.4.10-r1/work/libproxy-0.4.10_build'
/usr/bin/cmake -E cmake_progress_report /var/tmp/portage/net-libs/libproxy-0.4.10-r1/work/libproxy-0.4.10_build/CMakeFiles 16
make[2]: Entering directory `/var/tmp/portage/net-libs/libproxy-0.4.10-r1/work/libproxy-0.4.10_build'
/usr/bin/cmake -E cmake_progress_report /var/tmp/portage/net-libs/libproxy-0.4.10-r1/work/libproxy-0.4.10_build/CMakeFiles 3
[ 88%] [ 94%] Building C object utils/CMakeFiles/proxy.dir/proxy.c.o
cd /var/tmp/portage/net-libs/libproxy-0.4.10-r1/work/libproxy-0.4.10_build/utils && /usr/bin/x86_64-pc-linux-gnu-gcc -DNDEBUG -march=nocona -O2 -pipe -I/var/tmp/portage/net-libs/libproxy-0.4.10-r1/work/libproxy-0.4.10 -I/var/tmp/portage/net-libs/libproxy-0.4.10-r1/work/libproxy-0.4.10/utils/../libproxy -o CMakeFiles/proxy.dir/proxy.c.o -c /var/tmp/portage/net-libs/libproxy-0.4.10-r1/work/libproxy-0.4.10/utils/proxy.c
Building CXX object libproxy/CMakeFiles/config_gnome3.dir/modules/config_gnome3.cpp.o
cd /var/tmp/portage/net-libs/libproxy-0.4.10-r1/work/libproxy-0.4.10_build/libproxy && /usr/bin/x86_64-pc-linux-gnu-g++ -D_POSIX_C_SOURCE=200112L -Dconfig_gnome3_EXPORTS -DLIBEXECDIR=\"/usr/libexec\" -DNDEBUG -fvisibility=hidden -march=nocona -O2 -pipe -fPIC -I/var/tmp/portage/net-libs/libproxy-0.4.10-r1/work/libproxy-0.4.10 -I/usr/include/glib-2.0 -I/usr/lib64/glib-2.0/include -I/usr/include/webkitgtk-3.0 -o CMakeFiles/config_gnome3.dir/modules/config_gnome3.cpp.o -c /var/tmp/portage/net-libs/libproxy-0.4.10-r1/work/libproxy-0.4.10/libproxy/modules/config_gnome3.cpp
Linking C executable proxy
cd /var/tmp/portage/net-libs/libproxy-0.4.10-r1/work/libproxy-0.4.10_build/utils && /usr/bin/cmake -E cmake_link_script CMakeFiles/proxy.dir/link.txt --verbose=1
/usr/bin/x86_64-pc-linux-gnu-gcc -march=nocona -O2 -pipe -Wl,-O1 -Wl,--as-needed CMakeFiles/proxy.dir/proxy.c.o -o proxy -rdynamic ../libproxy/libproxy.so.1.0.0 -Wl,-rpath,/var/tmp/portage/net-libs/libproxy-0.4.10-r1/work/libproxy-0.4.10_build/libproxy:
/usr/lib/gcc/x86_64-pc-linux-gnu/4.6.3/../../../../x86_64-pc-linux-gnu/bin/ld: warning: libicui18n.so.49, needed by /usr/lib64/libjavascriptcoregtk-3.0.so.0, not found (try using -rpath or -rpath-link)
/usr/lib/gcc/x86_64-pc-linux-gnu/4.6.3/../../../../x86_64-pc-linux-gnu/bin/ld: warning: libicuuc.so.49, needed by /usr/lib64/libjavascriptcoregtk-3.0.so.0, not found (try using -rpath or -rpath-link)
/usr/lib64/libjavascriptcoregtk-3.0.so.0: undefined reference to `ucol_close_49'
/usr/lib64/libjavascriptcoregtk-3.0.so.0: undefined reference to `ucol_getLocaleByType_49'
/usr/lib64/libjavascriptcoregtk-3.0.so.0: undefined reference to `u_strToLower_49'
/usr/lib64/libjavascriptcoregtk-3.0.so.0: undefined reference to `ucol_open_49'
/usr/lib64/libjavascriptcoregtk-3.0.so.0: undefined reference to `u_charDirection_49'
/usr/lib64/libjavascriptcoregtk-3.0.so.0: undefined reference to `udat_format_49'
/usr/lib64/libjavascriptcoregtk-3.0.so.0: undefined reference to `ucol_getAttribute_49'
/usr/lib64/libjavascriptcoregtk-3.0.so.0: undefined reference to `ucol_strcoll_49'
/usr/lib64/libjavascriptcoregtk-3.0.so.0: undefined reference to `udat_close_49'
/usr/lib64/libjavascriptcoregtk-3.0.so.0: undefined reference to `u_charType_49'
/usr/lib64/libjavascriptcoregtk-3.0.so.0: undefined reference to `u_toupper_49'
/usr/lib64/libjavascriptcoregtk-3.0.so.0: undefined reference to `u_memcasecmp_49'
/usr/lib64/libjavascriptcoregtk-3.0.so.0: undefined reference to `ucol_setAttribute_49'
/usr/lib64/libjavascriptcoregtk-3.0.so.0: undefined reference to `u_tolower_49'
/usr/lib64/libjavascriptcoregtk-3.0.so.0: undefined reference to `u_strFoldCase_49'
/usr/lib64/libjavascriptcoregtk-3.0.so.0: undefined reference to `u_strToUpper_49'
/usr/lib64/libjavascriptcoregtk-3.0.so.0: undefined reference to `udat_open_49'
/usr/lib64/libjavascriptcoregtk-3.0.so.0: undefined reference to `u_foldCase_49'
collect2: ld returned 1 exit status
make[2]: *** [utils/proxy] Error 1
make[2]: Leaving directory `/var/tmp/portage/net-libs/libproxy-0.4.10-r1/work/libproxy-0.4.10_build'
make[1]: *** [utils/CMakeFiles/proxy.dir/all] Error 2
make[1]: *** Waiting for unfinished jobs....
cd /var/tmp/portage/net-libs/libproxy-0.4.10-r1/work/libproxy-0.4.10_build && /usr/bin/cmake -E cmake_depends "Unix Makefiles" /var/tmp/portage/net-libs/libproxy-0.4.10-r1/work/libproxy-0.4.10 /var/tmp/portage/net-libs/libproxy-0.4.10-r1/work/libproxy-0.4.10/bindings/perl/src /var/tmp/portage/net-libs/libproxy-0.4.10-r1/work/libproxy-0.4.10_build /var/tmp/portage/net-libs/libproxy-0.4.10-r1/work/libproxy-0.4.10_build/bindings/perl/src /var/tmp/portage/net-libs/libproxy-0.4.10-r1/work/libproxy-0.4.10_build/bindings/perl/src/CMakeFiles/PLlibproxy.dir/DependInfo.cmake --color=
Dependee "/var/tmp/portage/net-libs/libproxy-0.4.10-r1/work/libproxy-0.4.10_build/bindings/perl/src/CMakeFiles/PLlibproxy.dir/DependInfo.cmake" is newer than depender "/var/tmp/portage/net-libs/libproxy-0.4.10-r1/work/libproxy-0.4.10_build/bindings/perl/src/CMakeFiles/PLlibproxy.dir/depend.internal".
Dependee "/var/tmp/portage/net-libs/libproxy-0.4.10-r1/work/libproxy-0.4.10_build/bindings/perl/src/CMakeFiles/CMakeDirectoryInformation.cmake" is newer than depender "/var/tmp/portage/net-libs/libproxy-0.4.10-r1/work/libproxy-0.4.10_build/bindings/perl/src/CMakeFiles/PLlibproxy.dir/depend.internal".
Scanning dependencies of target PLlibproxy
make[2]: Leaving directory `/var/tmp/portage/net-libs/libproxy-0.4.10-r1/work/libproxy-0.4.10_build'
make -f bindings/perl/src/CMakeFiles/PLlibproxy.dir/build.make bindings/perl/src/CMakeFiles/PLlibproxy.dir/build
make[2]: Entering directory `/var/tmp/portage/net-libs/libproxy-0.4.10-r1/work/libproxy-0.4.10_build'
/usr/bin/cmake -E cmake_progress_report /var/tmp/portage/net-libs/libproxy-0.4.10-r1/work/libproxy-0.4.10_build/CMakeFiles 2
[100%] Building C object bindings/perl/src/CMakeFiles/PLlibproxy.dir/Libproxy.c.o
cd /var/tmp/portage/net-libs/libproxy-0.4.10-r1/work/libproxy-0.4.10_build/bindings/perl/src && /usr/bin/x86_64-pc-linux-gnu-gcc -DPLlibproxy_EXPORTS -DNDEBUG -march=nocona -O2 -pipe -fPIC -I/var/tmp/portage/net-libs/libproxy-0.4.10-r1/work/libproxy-0.4.10 -I/usr/lib64/perl5/5.12.4/x86_64-linux/CORE -I/var/tmp/portage/net-libs/libproxy-0.4.10-r1/work/libproxy-0.4.10/libproxy -o CMakeFiles/PLlibproxy.dir/Libproxy.c.o -c /var/tmp/portage/net-libs/libproxy-0.4.10-r1/work/libproxy-0.4.10_build/bindings/perl/src/Libproxy.c
Linking C shared library ../../../perl/blib/arch/auto/Net/Libproxy.so
cd /var/tmp/portage/net-libs/libproxy-0.4.10-r1/work/libproxy-0.4.10_build/bindings/perl/src && /usr/bin/cmake -E cmake_link_script CMakeFiles/PLlibproxy.dir/link.txt --verbose=1
/usr/bin/x86_64-pc-linux-gnu-gcc -fPIC -march=nocona -O2 -pipe -Wl,-O1 -Wl,--as-needed -shared -Wl,-soname,Libproxy.so -o ../../../perl/blib/arch/auto/Net/Libproxy.so CMakeFiles/PLlibproxy.dir/Libproxy.c.o /usr/lib64/libperl.so.5.12.4 ../../../libproxy/libproxy.so.1.0.0 -Wl,-rpath,/var/tmp/portage/net-libs/libproxy-0.4.10-r1/work/libproxy-0.4.10_build/libproxy:
make[2]: Leaving directory `/var/tmp/portage/net-libs/libproxy-0.4.10-r1/work/libproxy-0.4.10_build'
/usr/bin/cmake -E cmake_progress_report /var/tmp/portage/net-libs/libproxy-0.4.10-r1/work/libproxy-0.4.10_build/CMakeFiles 1 2
[100%] Built target PLlibproxy
Linking CXX shared module config_gnome3.so
cd /var/tmp/portage/net-libs/libproxy-0.4.10-r1/work/libproxy-0.4.10_build/libproxy && /usr/bin/cmake -E cmake_link_script CMakeFiles/config_gnome3.dir/link.txt --verbose=1
/usr/bin/x86_64-pc-linux-gnu-g++ -fPIC -fvisibility=hidden -march=nocona -O2 -pipe -Wl,-O1 -Wl,--as-needed -shared -Wl,-soname,config_gnome3.so -o config_gnome3.so CMakeFiles/config_gnome3.dir/modules/config_gnome3.cpp.o libproxy.so.1.0.0 -Wl,-rpath,/var/tmp/portage/net-libs/libproxy-0.4.10-r1/work/libproxy-0.4.10_build/libproxy:
make[2]: Leaving directory `/var/tmp/portage/net-libs/libproxy-0.4.10-r1/work/libproxy-0.4.10_build'
/usr/bin/cmake -E cmake_progress_report /var/tmp/portage/net-libs/libproxy-0.4.10-r1/work/libproxy-0.4.10_build/CMakeFiles 3
[100%] Built target config_gnome3
make[1]: Leaving directory `/var/tmp/portage/net-libs/libproxy-0.4.10-r1/work/libproxy-0.4.10_build'
make: *** [all] Error 2
* ERROR: net-libs/libproxy-0.4.10-r1 failed (compile phase):
* emake failed
*
* If you need support, post the output of `emerge --info '=net-libs/libproxy-0.4.10-r1'`,
* the complete build log and the output of `emerge -pqv '=net-libs/libproxy-0.4.10-r1'`.
* The complete build log is located at '/var/tmp/portage/net-libs/libproxy-0.4.10-r1/temp/build.log'.
* The ebuild environment file is located at '/var/tmp/portage/net-libs/libproxy-0.4.10-r1/temp/environment'.
* Working directory: '/var/tmp/portage/net-libs/libproxy-0.4.10-r1/work/libproxy-0.4.10_build'
* S: '/var/tmp/portage/net-libs/libproxy-0.4.10-r1/work/libproxy-0.4.10'

_________________
Gentoo is Rocks
Back to top
View user's profile Send private message
VoidMage
Watchman
Watchman


Joined: 14 Oct 2006
Posts: 5270

PostPosted: Mon Jul 29, 2013 2:48 am    Post subject: Reply with quote

:roll: paste!=pastebin

Anyway, revdep-rebuild, it's the icu upgrade - in this package, it's webkit-gtk, but more libs are likely to be broken.
Back to top
View user's profile Send private message
sleepingsun
Guru
Guru


Joined: 03 May 2006
Posts: 316
Location: Bosnia

PostPosted: Mon Jul 29, 2013 8:54 am    Post subject: Reply with quote

Try to reemerge icu, webkit, perl python update and revdep-rebuild says that everythings are ok ?

Edited:

Problem was in etc/make.conf when i first installed gentoo i put kde but few weeks ago i get massage that some packages need to be installed and need to remove kde i do it also java was blacklisted sun-jdk and i remove tham and put icetee-bin and everythings work fine till i get update system to new kde ...
all mess i try to fix and thanks friend for your help on libproxy i try few times to reemerge webkit-gtk but nothing after your post i do it and work ! Thanks
_________________
Gentoo is Rocks
Back to top
View user's profile Send private message
Display posts from previous:   
Reply to topic    Gentoo Forums Forum Index Portage & Programming All times are GMT
Page 1 of 1

 
Jump to:  
You cannot post new topics in this forum
You cannot reply to topics in this forum
You cannot edit your posts in this forum
You cannot delete your posts in this forum
You cannot vote in polls in this forum