Gentoo Forums
Gentoo Forums
Gentoo Forums
Quick Search: in
[Solved]kdelibs-4.8.1-r2 won't emerge due to soprano ?
View unanswered posts
View posts from last 24 hours

 
Reply to topic    Gentoo Forums Forum Index Portage & Programming
View previous topic :: View next topic  
Author Message
MaDDeePee
Guru
Guru


Joined: 18 Aug 2004
Posts: 304
Location: Germany

PostPosted: Fri May 11, 2012 11:15 pm    Post subject: [Solved]kdelibs-4.8.1-r2 won't emerge due to soprano ? Reply with quote

:cry:

I couldn't get past this:

Code:
[ 48%] Built target nepomuk-rcgen
Linking CXX shared library ../lib/libkdeinit4_kbuildsycoca4.so
cd /var/tmp/portage/kde-base/kdelibs-4.8.1-r2/work/kdelibs-4.8.1_build/kded && /usr/bin/cmake -E cmake_link_script CMakeFiles/kdeinit_kbuildsycoca4.dir/link.txt --verbose=1       
/usr/bin/i686-pc-linux-gnu-g++  -fPIC -O2 -march=nocona -fomit-frame-pointer -pipe -mmmx -msse -msse2 -msse3  -Wnon-virtual-dtor -Wno-long-long -ansi -Wundef -Wcast-align -Wchar-subscripts -Wall -W -Wpointer-arith -Wformat-security -fno-exceptions -DQT_NO_EXCEPTIONS -fno-check-new -fno-common -Woverloaded-virtual -fno-threadsafe-statics -fvisibility=hidden -Werror=return-type -fvisibility-inlines-hidden -Wl,--enable-new-dtags -Wl,--fatal-warnings -Wl,--no-undefined -lc  -Wl,-O1 -Wl,--as-needed -shared -Wl,-soname,libkdeinit4_kbuildsycoca4.so -o ../lib/libkdeinit4_kbuildsycoca4.so CMakeFiles/kdeinit_kbuildsycoca4.dir/kdeinit_kbuildsycoca4_automoc.o CMakeFiles/kdeinit_kbuildsycoca4.dir/kbuildsycoca.o CMakeFiles/kdeinit_kbuildsycoca4.dir/kbuildmimetypefactory.o CMakeFiles/kdeinit_kbuildsycoca4.dir/kmimeassociations.o CMakeFiles/kdeinit_kbuildsycoca4.dir/kbuildservicetypefactory.o CMakeFiles/kdeinit_kbuildsycoca4.dir/kbuildservicefactory.o CMakeFiles/kdeinit_kbuildsycoca4.dir/kbuildservicegroupfactory.o CMakeFiles/kdeinit_kbuildsycoca4.dir/kbuildprotocolinfofactory.o CMakeFiles/kdeinit_kbuildsycoca4.dir/kctimefactory.o CMakeFiles/kdeinit_kbuildsycoca4.dir/vfolder_menu.o -L/var/tmp/portage/kde-base/kdelibs-4.8.1-r2/work/kdelibs-4.8.1_build/lib -L/usr/lib/qt4 ../lib/libkdeui.so.5.8.0 /usr/lib/qt4/libQtXml.so ../lib/libkdecore.so.5.8.0 /usr/lib/qt4/libQtDBus.so /usr/lib/qt4/libQtCore.so -lpthread /usr/lib/qt4/libQtGui.so /usr/lib/qt4/libQtSvg.so -Wl,-rpath,/var/tmp/portage/kde-base/kdelibs-4.8.1-r2/work/kdelibs-4.8.1_build/lib:/usr/lib/qt4:
make[2]: Leaving directory `/var/tmp/portage/kde-base/kdelibs-4.8.1-r2/work/kdelibs-4.8.1_build'
/usr/bin/cmake -E cmake_progress_report /var/tmp/portage/kde-base/kdelibs-4.8.1-r2/work/kdelibs-4.8.1_build/CMakeFiles
[ 48%] Built target kdeinit_kbuildsycoca4
make[1]: Leaving directory `/var/tmp/portage/kde-base/kdelibs-4.8.1-r2/work/kdelibs-4.8.1_build'
make: *** [all] Fehler 2
 * ERROR: kde-base/kdelibs-4.8.1-r2 failed (compile phase):
 *   emake failed
 *
 * If you need support, post the output of 'emerge --info =kde-base/kdelibs-4.8.1-r2',
 * the complete build log and the output of 'emerge -pqv =kde-base/kdelibs-4.8.1-r2'.
 * The complete build log is located at '/var/tmp/portage/kde-base/kdelibs-4.8.1-r2/temp/build.log'.
 * The ebuild environment file is located at '/var/tmp/portage/kde-base/kdelibs-4.8.1-r2/temp/environment'.
 * S: '/var/tmp/portage/kde-base/kdelibs-4.8.1-r2/work/kdelibs-4.8.1'

>>> Failed to emerge kde-base/kdelibs-4.8.1-r2, Log file:

>>>  '/var/tmp/portage/kde-base/kdelibs-4.8.1-r2/temp/build.log'


Already re-emerged all QT packages soprano...cmake...whatever.
No clue.

Any hints?

emerge --info =kde-base/kdelibs-4.8.1-r2

Code:
Portage 2.1.10.49 (default/linux/x86/10.0/desktop, gcc-4.5.3, glibc-2.14.1-r3, 2.6.38-gentoo i686)
=================================================================
                        System Settings
=================================================================
System uname: Linux-2.6.38-gentoo-i686-Intel-R-_Xeon-R-_CPU_E5450_@_3.00GHz-with-gentoo-2.0.3
Timestamp of tree: Fri, 11 May 2012 17:30:01 +0000
ccache version 3.1.6 [disabled]
app-shells/bash:          4.2_p20
dev-java/java-config:     2.1.11-r3
dev-lang/python:          2.6.6-r2, 2.7.2-r3, 3.1.4-r3, 3.2.2
dev-util/ccache:          3.1.6
dev-util/cmake:           2.8.7-r5
dev-util/pkgconfig:       0.26
sys-apps/baselayout:      2.0.3
sys-apps/openrc:          0.8.3-r1
sys-apps/sandbox:         2.4
sys-devel/autoconf:       2.13::<unknown repository>, 2.68
sys-devel/automake:       1.9.6-r3, 1.10.3, 1.11.1
sys-devel/binutils:       2.21.1-r1
sys-devel/gcc:            4.3.6-r1, 4.5.3-r2
sys-devel/gcc-config:     1.5-r2
sys-devel/libtool:        2.4-r1
sys-devel/make:           3.82-r1
sys-kernel/linux-headers: 3.1 (virtual/os-headers)
sys-libs/glibc:           2.14.1-r3
Repositories: gentoo overlay
ACCEPT_KEYWORDS="x86"
ACCEPT_LICENSE="* -@EULA Q3AEULA Nero-EULA-US dlj-1.1 skype-eula googleearth AdobeFlash-10.3 AdobeFlash-10 PUEL Oracle-BCLA-JavaSE"
CBUILD="i686-pc-linux-gnu"
CFLAGS="-O2 -march=nocona -fomit-frame-pointer -pipe -mmmx -msse -msse2 -msse3"
CHOST="i686-pc-linux-gnu"
CONFIG_PROTECT="/etc /usr/share/config /usr/share/gnupg/qualified.txt"
CONFIG_PROTECT_MASK="/etc/ca-certificates.conf /etc/env.d /etc/env.d/java/ /etc/fonts/fonts.conf /etc/gconf /etc/gentoo-release /etc/revdep-rebuild /etc/sandbox.d /etc/splash /etc/terminfo"
CXXFLAGS="-O2 -march=nocona -fomit-frame-pointer -pipe -mmmx -msse -msse2 -msse3"
DISTDIR="/usr/portage/distfiles"
EMERGE_DEFAULT_OPTS="--autounmask=n"
FEATURES="assume-digests binpkg-logs distlocks ebuild-locks fixlafiles news parallel-fetch protect-owned sandbox sfperms strict unknown-features-warn unmerge-logs unmerge-orphans userfetch"
FFLAGS=""
GENTOO_MIRRORS="http://distfiles.gentoo.org"
LANG="de_DE.UTF-8"
LDFLAGS="-Wl,-O1 -Wl,--as-needed"
LINGUAS="de"
MAKEOPTS="-j9"
PKGDIR="/usr/portage/packages"
PORTAGE_CONFIGROOT="/"
PORTAGE_RSYNC_OPTS="--recursive --links --safe-links --perms --times --compress --force --whole-file --delete --stats --human-readable --timeout=180 --exclude=/distfiles --exclude=/local --exclude=/packages"
PORTAGE_TMPDIR="/var/tmp"
PORTDIR="/usr/portage"
PORTDIR_OVERLAY="/usr/local/portage"
SYNC="rsync://rsync.gentoo.org/gentoo-portage"
USE="X a52 aac acl acpi acpi4linux aim alsa apm berkdb bidi bluetooth bootspla branding browserplugin bzip2 cairo cdda cdinstall cdr cdrom cli consolekit cracklib css cups cxx dbus dedicated dhcp divx4linux dri dts dvb dvd dvdr dvdread emboss emoticon encode exif fam fbcon firefox fla flac fortran ftp fusion gdbm gdu gif gimp gimpprint gkrellm glitz gphoto2 gpm gtk high-ints iconv icq ipv6 java javascript jp2 jpeg jpeg2k kde lcms ldap libnotify lm_sensors mad ming mjpeg mmx mmx2 mng modules mozilla moznocompose moznoirc moznomail mp3 mp4 mpeg mplayer mudflap ncurses nls nptl nptlonly nsplugin ntlm nvidia ogg openal opengl openmp oscar pam pango pcre pdf png policykit ppds pppd qt3support qt4 readline samba scanner sdl semantic-desktop session spell sse sse2 sse3 ssl startup-notification svg tcpd theora threads tidy tiff transcode truetype udev unicode usb userlocales v4l vdpau videos vorbis win32codecs wxwidgets x264 x86 xcb xinerama xml xorg xulrunner xv xvid xvmc zlib" ALSA_CARDS="emu10k1" ALSA_PCM_PLUGINS="adpcm alaw asym copy dmix dshare dsnoop empty extplug file hooks iec958 ioplug ladspa lfloat linear meter mmap_emul mulaw multi null plug rate route share shm softvol" APACHE2_MODULES="actions alias auth_basic authn_alias authn_anon authn_dbm authn_default authn_file authz_dbm authz_default authz_groupfile authz_host authz_owner authz_user autoindex cache cgi cgid dav dav_fs dav_lock deflate dir disk_cache env expires ext_filter file_cache filter headers include info log_config logio mem_cache mime mime_magic negotiation rewrite setenvif speling status unique_id userdir usertrack vhost_alias" CALLIGRA_FEATURES="kexi words flow plan sheets stage tables krita karbon braindump" CAMERAS="ptp2 canon" COLLECTD_PLUGINS="df interface irq load memory rrdtool swap syslog" DVB_CARDS="dibusb-usb1" ELIBC="glibc" GPSD_PROTOCOLS="ashtech aivdm earthmate evermore fv18 garmin garmintxt gpsclock itrax mtk3301 nmea ntrip navcom oceanserver oldstyle oncore rtcm104v2 rtcm104v3 sirf superstar2 timing tsip tripmate tnt ubx" INPUT_DEVICES="joystick keyboard mouse evdev virtualbox" KERNEL="linux" LCD_DEVICES="bayrad cfontz cfontz633 glk hd44780 lb216 lcdm001 mtxorb ncurses text" LIBREOFFICE_EXTENSIONS="presenter-console presenter-minimizer" LINGUAS="de" PHP_TARGETS="php5-3" RUBY_TARGETS="ruby18" USERLAND="GNU" VIDEO_CARDS="fbdev nvidia vesa vmware nouveau nv virtualbox" XTABLES_ADDONS="quota2 psd pknock lscan length2 ipv4options ipset ipp2p iface geoip fuzzy condition tee tarpit sysrq steal rawnat logmark ipmark dhcpmac delude chaos account"
Unset:  CPPFLAGS, CTARGET, INSTALL_MASK, LC_ALL, PORTAGE_BUNZIP2_COMMAND, PORTAGE_COMPRESS, PORTAGE_COMPRESS_FLAGS, PORTAGE_RSYNC_EXTRA_OPTS, USE_PYTHON


Last edited by MaDDeePee on Sun May 20, 2012 1:06 pm; edited 2 times in total
Back to top
View user's profile Send private message
VoidMage
Watchman
Watchman


Joined: 14 Oct 2006
Posts: 5769

PostPosted: Sat May 12, 2012 3:19 am    Post subject: Reply with quote

Any chance of you posting the actual error ?
Back to top
View user's profile Send private message
MaDDeePee
Guru
Guru


Joined: 18 Aug 2004
Posts: 304
Location: Germany

PostPosted: Sat May 12, 2012 7:15 am    Post subject: Reply with quote

Thats my problem. I can't see what is the error.

No clue what you are asking about, thats all i can tell you. Need to know why it doesn't compile...


Code:
[ 48%] Built target nepomuk-rcgen
Linking CXX shared library ../lib/libkdeinit4_kbuildsycoca4.so
cd /var/tmp/portage/kde-base/kdelibs-4.8.1-r2/work/kdelibs-4.8.1_build/kded && /usr/bin/cmake -E cmake_link_script CMakeFiles/kdeinit_kbuildsycoca4.dir/link.txt --verbose=1       
/usr/bin/i686-pc-linux-gnu-g++  -fPIC -O2 -march=nocona -fomit-frame-pointer -pipe -mmmx -msse -msse2 -msse3  -Wnon-virtual-dtor -Wno-long-long -ansi -Wundef -Wcast-align -Wchar-subscripts -Wall -W -Wpointer-arith -Wformat-security -fno-exceptions -DQT_NO_EXCEPTIONS -fno-check-new -fno-common -Woverloaded-virtual -fno-threadsafe-statics -fvisibility=hidden -Werror=return-type -fvisibility-inlines-hidden -Wl,--enable-new-dtags -Wl,--fatal-warnings -Wl,--no-undefined -lc  -Wl,-O1 -Wl,--as-needed -shared -Wl,-soname,libkdeinit4_kbuildsycoca4.so -o ../lib/libkdeinit4_kbuildsycoca4.so CMakeFiles/kdeinit_kbuildsycoca4.dir/kdeinit_kbuildsycoca4_automoc.o CMakeFiles/kdeinit_kbuildsycoca4.dir/kbuildsycoca.o CMakeFiles/kdeinit_kbuildsycoca4.dir/kbuildmimetypefactory.o CMakeFiles/kdeinit_kbuildsycoca4.dir/kmimeassociations.o CMakeFiles/kdeinit_kbuildsycoca4.dir/kbuildservicetypefactory.o CMakeFiles/kdeinit_kbuildsycoca4.dir/kbuildservicefactory.o CMakeFiles/kdeinit_kbuildsycoca4.dir/kbuildservicegroupfactory.o CMakeFiles/kdeinit_kbuildsycoca4.dir/kbuildprotocolinfofactory.o CMakeFiles/kdeinit_kbuildsycoca4.dir/kctimefactory.o CMakeFiles/kdeinit_kbuildsycoca4.dir/vfolder_menu.o -L/var/tmp/portage/kde-base/kdelibs-4.8.1-r2/work/kdelibs-4.8.1_build/lib -L/usr/lib/qt4 ../lib/libkdeui.so.5.8.0 /usr/lib/qt4/libQtXml.so ../lib/libkdecore.so.5.8.0 /usr/lib/qt4/libQtDBus.so /usr/lib/qt4/libQtCore.so -lpthread /usr/lib/qt4/libQtGui.so /usr/lib/qt4/libQtSvg.so -Wl,-rpath,/var/tmp/portage/kde-base/kdelibs-4.8.1-r2/work/kdelibs-4.8.1_build/lib:/usr/lib/qt4:
make[2]: Leaving directory `/var/tmp/portage/kde-base/kdelibs-4.8.1-r2/work/kdelibs-4.8.1_build'
/usr/bin/cmake -E cmake_progress_report /var/tmp/portage/kde-base/kdelibs-4.8.1-r2/work/kdelibs-4.8.1_build/CMakeFiles
[ 48%] Built target kdeinit_kbuildsycoca4
make[1]: Leaving directory `/var/tmp/portage/kde-base/kdelibs-4.8.1-r2/work/kdelibs-4.8.1_build'
make: *** [all] Fehler 2
 * ERROR: kde-base/kdelibs-4.8.1-r2 failed (compile phase):
 *   emake failed
 *
 * If you need support, post the output of 'emerge --info =kde-base/kdelibs-4.8.1-r2',
 * the complete build log and the output of 'emerge -pqv =kde-base/kdelibs-4.8.1-r2'.
 * The complete build log is located at '/var/tmp/portage/kde-base/kdelibs-4.8.1-r2/temp/build.log'.
 * The ebuild environment file is located at '/var/tmp/portage/kde-base/kdelibs-4.8.1-r2/temp/environment'.
 * S: '/var/tmp/portage/kde-base/kdelibs-4.8.1-r2/work/kdelibs-4.8.1'

>>> Failed to emerge kde-base/kdelibs-4.8.1-r2, Log file:

>>>  '/var/tmp/portage/kde-base/kdelibs-4.8.1-r2/temp/build.log'
Back to top
View user's profile Send private message
roarinelk
Guru
Guru


Joined: 04 Mar 2004
Posts: 447

PostPosted: Sat May 12, 2012 7:49 am    Post subject: Reply with quote

build with "MAKEOPTS=-j1", then the error should be visible right away.
Back to top
View user's profile Send private message
MaDDeePee
Guru
Guru


Joined: 18 Aug 2004
Posts: 304
Location: Germany

PostPosted: Sat May 12, 2012 8:19 am    Post subject: Reply with quote

roarinelk wrote:
build with "MAKEOPTS=-j1", then the error should be visible right away.


Ok, thanks.

Now i got this:

Code:
[ 20%] Built target nepomuk_automoc
make -f nepomuk/CMakeFiles/nepomuk.dir/build.make nepomuk/CMakeFiles/nepomuk.dir/depend
make[2]: Entering directory `/var/tmp/portage/kde-base/kdelibs-4.8.1-r2/work/kdelibs-4.8.1_build'
/usr/bin/cmake -E cmake_progress_report /var/tmp/portage/kde-base/kdelibs-4.8.1-r2/work/kdelibs-4.8.1_build/CMakeFiles
[ 20%] Generating ndo.h, ndo.cpp
cd /var/tmp/portage/kde-base/kdelibs-4.8.1-r2/work/kdelibs-4.8.1_build/nepomuk && /usr/bin/onto2vocabularyclass --name NDO --encoding trig --namespace Nepomuk::Vocabulary --export-module nepomuk /usr/share/ontology/nepomuk/ndo.trig
(Soprano::PluginManager) found no soprano plugin at  "/usr/lib/soprano/libsoprano_raptorparser.so"
Could not find parser plugin for encoding trig
make[2]: *** [nepomuk/ndo.h] Fehler 1
make[2]: Leaving directory `/var/tmp/portage/kde-base/kdelibs-4.8.1-r2/work/kdelibs-4.8.1_build'
make[1]: *** [nepomuk/CMakeFiles/nepomuk.dir/all] Fehler 2
make[1]: Leaving directory `/var/tmp/portage/kde-base/kdelibs-4.8.1-r2/work/kdelibs-4.8.1_build'
make: *** [all] Fehler 2
 * ERROR: kde-base/kdelibs-4.8.1-r2 failed (compile phase):
 *   emake failed
 *
 * If you need support, post the output of 'emerge --info =kde-base/kdelibs-4.8.1-r2',
 * the complete build log and the output of 'emerge -pqv =kde-base/kdelibs-4.8.1-r2'.
 * The complete build log is located at '/var/tmp/portage/kde-base/kdelibs-4.8.1-r2/temp/build.log'.
 * The ebuild environment file is located at '/var/tmp/portage/kde-base/kdelibs-4.8.1-r2/temp/environment'.
 * S: '/var/tmp/portage/kde-base/kdelibs-4.8.1-r2/work/kdelibs-4.8.1'

>>> Failed to emerge kde-base/kdelibs-4.8.1-r2, Log file:

Already re-emerged soprano, didnt work. What else could it be?

Code:
*  dev-libs/soprano
      Latest version available: 2.7.4
      Latest version installed: 2.7.4
      Size of files: 1,907 kB
      Homepage:      http://sourceforge.net/projects/soprano
      Description:   Library that provides a nice Qt interface to RDF storage solutions
      License:       LGPL-2


Code:
MaDWorkStatioN maddeepee # ls /usr/lib/soprano/libsoprano_*
/usr/lib/soprano/libsoprano_nquadparser.so      /usr/lib/soprano/libsoprano_raptorparser.so      /usr/lib/soprano/libsoprano_redlandbackend.so
/usr/lib/soprano/libsoprano_nquadserializer.so  /usr/lib/soprano/libsoprano_raptorserializer.so  /usr/lib/soprano/libsoprano_virtuosobackend.so
MaDWorkStatioN maddeepee #
Back to top
View user's profile Send private message
MaDDeePee
Guru
Guru


Joined: 18 Aug 2004
Posts: 304
Location: Germany

PostPosted: Sat May 12, 2012 9:22 am    Post subject: Reply with quote

... it was media-libs/raptor holding me back^^

thanks :)
Back to top
View user's profile Send private message
lackovic10
n00b
n00b


Joined: 14 May 2012
Posts: 2
Location: Serbia

PostPosted: Mon May 14, 2012 10:39 pm    Post subject: same problem Reply with quote

hi,

i seem to have the same problem.
i have installed media-libs/raptor-2.0.7, what did you do with it, so you could install kde ?

thanx a lot.
Back to top
View user's profile Send private message
MaDDeePee
Guru
Guru


Joined: 18 Aug 2004
Posts: 304
Location: Germany

PostPosted: Wed May 16, 2012 6:15 pm    Post subject: Reply with quote

Well what i was talking about is that i just re-emerged raptor to make it compile. didnt change anything else.
Back to top
View user's profile Send private message
lackovic10
n00b
n00b


Joined: 14 May 2012
Posts: 2
Location: Serbia

PostPosted: Wed May 16, 2012 9:44 pm    Post subject: tnx Reply with quote

worked for me also!!! thanks a lot!!!
Back to top
View user's profile Send private message
Vrenn
Apprentice
Apprentice


Joined: 15 Dec 2004
Posts: 211

PostPosted: Sat May 19, 2012 4:21 pm    Post subject: Reply with quote

Worked for me too, thanks!
Could you please add a [solved] at the title? This is worth to be found.
_________________
With nice greetings
Vrenn
Back to top
View user's profile Send private message
BitPit
n00b
n00b


Joined: 10 Jun 2003
Posts: 10
Location: Austin, TX

PostPosted: Sat May 19, 2012 8:28 pm    Post subject: Reply with quote

This fix works for the same problem in kde-base/kdelibs-4.8.3 too.

I recompiled my whole world "emerge -e world" (kdelibs-4.8.1-r2) before doing an rsync that brought in all the new kde-4.8.3 ebuilds. media-libs/raptor-2.0.7 was emerged along with the rest of the world before I got the new ebuilds that came with kde-4.8.3.

All I did to create and fix the problem was:
emerge --sync
emerge -uDN world
* kde-base/kdelibs-4.8.3 failed
emerge raptor
emerge -uDN world
* compiled ok

There may be a broken dependency in an ebuild.
Back to top
View user's profile Send private message
threadau
n00b
n00b


Joined: 22 May 2012
Posts: 10

PostPosted: Tue May 22, 2012 4:50 am    Post subject: Reply with quote

Also having trouble with 4.8.3, currently trying the raptor fix.
Back to top
View user's profile Send private message
threadau
n00b
n00b


Joined: 22 May 2012
Posts: 10

PostPosted: Tue May 22, 2012 7:15 am    Post subject: Reply with quote

Success.

Is it worth getting it onto the bug tracker? I couldn't find it there, but I could be search-failing.

Now, onto ksysguard 4.8.3 :-/
Back to top
View user's profile Send private message
BitPit
n00b
n00b


Joined: 10 Jun 2003
Posts: 10
Location: Austin, TX

PostPosted: Tue May 22, 2012 1:39 pm    Post subject: Reply with quote

I also had to emerge x11-libs/qt-webkit before I could build kde 4.8.3.
My notes are poor, but I think that is needed to compile ksysguard 4.8.3.

This probably deserves a bug report.
Back to top
View user's profile Send private message
helio
Apprentice
Apprentice


Joined: 08 Apr 2006
Posts: 169

PostPosted: Wed May 30, 2012 8:36 pm    Post subject: Reply with quote

Thanks, this thread helped me too.
Back to top
View user's profile Send private message
ASID
Apprentice
Apprentice


Joined: 22 Mar 2006
Posts: 194

PostPosted: Thu Jun 07, 2012 11:26 am    Post subject: Reply with quote

emerging x11-libs/qt-webkit did the trick for me.
(ksysguard-4.8.1 was failing)

Thnx!
Back to top
View user's profile Send private message
Jagaer
n00b
n00b


Joined: 27 Feb 2004
Posts: 16
Location: Kingston, On, Canada

PostPosted: Fri Jun 15, 2012 10:29 pm    Post subject: Reply with quote

Thanks,

Emerging Raptor worked for me too, upgrading from soprano 2.7.4 to 2.7.6
Back to top
View user's profile Send private message
lanlocked
n00b
n00b


Joined: 12 Oct 2004
Posts: 7
Location: Versailles, Ky.

PostPosted: Mon Jul 02, 2012 1:32 am    Post subject: Woot -- Thanks! Reply with quote

I just wanted to add myself to the "me too" list. Rebuilding media-libs/raptor so that I could rebuild soprano worked for me when I was trying to upgrade from kdelibs-4.8.1 to kdelibs-4.8.4 x86_64.

Thanks!
_________________
Sometimes he's sitting there thinking. Sometimes he's just sitting there.
Back to top
View user's profile Send private message
kklatt
n00b
n00b


Joined: 25 Oct 2004
Posts: 10

PostPosted: Tue Apr 30, 2013 4:11 pm    Post subject: Reply with quote

Worked for me, with a twist. I emerged raptor on an AMD 6 core and a single AMD, worked, but after the emerge had failed when building kdelib. I built raptor before emerging on an I7, kdelib failed, re-emerged raptor and its working fine.
Back to top
View user's profile Send private message
cami
n00b
n00b


Joined: 15 Jan 2005
Posts: 17

PostPosted: Sat May 04, 2013 8:48 pm    Post subject: Reply with quote

$ revdep-rebuild -i
<snip>
[ 71% ] * broken /usr/lib64/libraptor2.so.0.0.0 (requires libicuuc.so.49)
<snip>

It seems this isn't really a kdelibs problem, it's simply an icu upgrade we probably all did before upgrading kdelibs -- without an intermittent revdep-rebuild.
Back to top
View user's profile Send private message
Display posts from previous:   
Reply to topic    Gentoo Forums Forum Index Portage & Programming All times are GMT
Page 1 of 1

 
Jump to:  
You cannot post new topics in this forum
You cannot reply to topics in this forum
You cannot edit your posts in this forum
You cannot delete your posts in this forum
You cannot vote in polls in this forum