Gentoo Forums
Gentoo Forums
Gentoo Forums
Quick Search: in
OpenOffice.org 2.x
View unanswered posts
View posts from last 24 hours

Goto page Previous  1, 2, 3, 4 ... 37, 38, 39  Next  
This topic is locked: you cannot edit posts or make replies.    Gentoo Forums Forum Index Unsupported Software
View previous topic :: View next topic  
Author Message
Harry_Hakbijl
n00b
n00b


Joined: 07 Mar 2005
Posts: 55
Location: Leuven, Vlaanderen

PostPosted: Sat Jul 02, 2005 7:04 pm    Post subject: Reply with quote

geki wrote:
new milestone overlay delays. no time as well as some breakages in latest milestones prevent me to bump overlay.


Still waiting over here ;-). This new bump should compile on amd64 if I get it right :twisted:

GoGo Geki!
Back to top
View user's profile Send private message
geki
Advocate
Advocate


Joined: 13 May 2004
Posts: 2328
Location: Germania

PostPosted: Sun Jul 03, 2005 12:36 am    Post subject: Reply with quote

Harry_Hakbijl, just for you i finally bumped it to m113.

* gcc4/gcj4 patches stay unapplied. need rework.
* just tested patches which apply here, all.

be happy if build is breaking :o
may be i get some more time tomorrow.

PS don't ask where to get the overlay. you know where or not :P
_________________
boost|select libs to build|slotable|python-buildid

hear hear
Back to top
View user's profile Send private message
Harry_Hakbijl
n00b
n00b


Joined: 07 Mar 2005
Posts: 55
Location: Leuven, Vlaanderen

PostPosted: Sun Jul 03, 2005 12:07 pm    Post subject: Reply with quote

geki wrote:

be happy if build is breaking :o


Patching goes wrong...

Code:

 * Applying ooo64bit.patch ...

 * Failed Patch: ooo64bit.patch !
 *  ( /usr/local/portage/app-office/openoffice/files/1.9.113/x86_64/ooo64bit.pat ch )
 *
 * Include in your bugreport the contents of:
 *
 *   /var/tmp/portage/openoffice-1.9.113/temp/ooo64bit.patch-13594.out


ooo64bit.patch-13594.out
Back to top
View user's profile Send private message
scoobydu
Veteran
Veteran


Joined: 16 Feb 2003
Posts: 1076
Location: 'Mind the Gap'

PostPosted: Sun Jul 03, 2005 12:15 pm    Post subject: Reply with quote

Thx Harry_Hakbijl for upping the log, same problem here ...
_________________
Tyan Tiger K8W, 2xOpteron 240,Powerbook5,6 15" 1.5g, Macbook Black 2g, Mac Mini 1g, Ipod P60g.
| Linux - From a windows user perspective|
Back to top
View user's profile Send private message
geki
Advocate
Advocate


Joined: 13 May 2004
Posts: 2328
Location: Germania

PostPosted: Sun Jul 03, 2005 12:36 pm    Post subject: Reply with quote

Quote:
Auflösen des Hostnamen »hartwin.homeip.net«.... 172.19.3.5
Verbindungsaufbau zu hartwin.homeip.net[172.19.3.5]:8080...
private address, please fix. thanks! :o
_________________
boost|select libs to build|slotable|python-buildid

hear hear
Back to top
View user's profile Send private message
Harry_Hakbijl
n00b
n00b


Joined: 07 Mar 2005
Posts: 55
Location: Leuven, Vlaanderen

PostPosted: Sun Jul 03, 2005 4:15 pm    Post subject: Reply with quote

geki wrote:
Quote:
Auflösen des Hostnamen »hartwin.homeip.net«.... 172.19.3.5
Verbindungsaufbau zu hartwin.homeip.net[172.19.3.5]:8080...
private address, please fix. thanks! :o


Ah Crap, changed some things in our network. MMM, I'll put it somewhere else...

ooo64bit.patch-13594.out
Back to top
View user's profile Send private message
geki
Advocate
Advocate


Joined: 13 May 2004
Posts: 2328
Location: Germania

PostPosted: Sun Jul 03, 2005 7:53 pm    Post subject: Reply with quote

updated
_________________
boost|select libs to build|slotable|python-buildid

hear hear
Back to top
View user's profile Send private message
Harry_Hakbijl
n00b
n00b


Joined: 07 Mar 2005
Posts: 55
Location: Leuven, Vlaanderen

PostPosted: Mon Jul 04, 2005 6:37 am    Post subject: Reply with quote

Patching went OK, building stops:

Code:

adding: com/sun/star/lib/unoloader/UnoLoader.java (deflated 61%)
------------------------------
Making: ../../unxlngx4.pro/misc/unoloader.dpz
dmake  -f makefile.mk strip="true" product="full" make_zip_deps=true   ../../unxlngx4.pro/misc/unoloader_src.dpzz
echo # > ../../unxlngx4.pro/misc/unoloader_src.dpzz
type 4
zipdep.pl -r  ../../unxlngx4.pro/bin/unoloader_src.zip "com" "-x" "'*makefile.mk'" "-x" "'*manifest'" -x "*CVS*" >> ../../unxlngx4.pro/misc/unoloader_src.dpzz
zipdep -- version: 1.12
Multi Platform Enabled Edition
cat   ../../unxlngx4.pro/misc/unoloader_src.dpzz /var/tmp/portage/openoffice-1.9.113/temp/mk7NP1Kh | grep -v "CVS" >> ../../unxlngx4.pro/misc/unoloader.dpz
echo zipdep_langs=en-US nl  >> ../../unxlngx4.pro/misc/unoloader.dpz
-------------
/var/tmp/portage/openoffice-1.9.113/work/src680-m113/ridljar/source/unoloader/com/sun/star/lib/unoloader
dmake:  makefile.mk:  line 85:  Error -- Missing targets or attributes in rule
'---* tg_merge.mk *---'

ERROR: Error 65280 occurred while making /var/tmp/portage/openoffice-1.9.113/work/src680-m113/ridljar/source/unoloader/com/sun/star/lib/unoloader

!!! ERROR: app-office/openoffice-1.9.113 failed.
!!! Function src_compile, Line 618, Exitcode 1


My info is all over the thread allready ;-) but I'll post it once again:

emerge -pv openoffice:
Code:

[ebuild  N    ] app-office/openoffice-1.9.113  +berkdb -boost -crystal-images +cups +curl +firefox -gcj +gnome -icu +industrial-images -java +jpeg -kde +ldap -mozilla -nas +neon +nobinfilter -nomoz -nosound +nptl -portaudio +python -sablot -sndfile -wpd +xml2 +zlib 18,082 kB [1]


emerge info
Code:

Portage 2.0.51.19 (default-linux/amd64/2005.0, gcc-3.4.3, glibc-2.3.4.20041102-r1, 2.6.11-gentoo-r9 x86_64)
=================================================================
System uname: 2.6.11-gentoo-r9 x86_64 AMD Athlon(tm) 64 Processor 3000+
Gentoo Base System version 1.6.12
Python:              dev-lang/python-2.3.5 [2.3.5 (#1, May 12 2005, 07:16:44)]
distcc 2.18.3 x86_64-pc-linux-gnu (protocols 1 and 2) (default port 3632) [disabled]
dev-lang/python:     2.3.5
sys-apps/sandbox:    [Not Present]
sys-devel/autoconf:  2.13, 2.59-r6
sys-devel/automake:  1.5, 1.9.5, 1.8.5-r3, 1.6.3, 1.7.9-r1, 1.4_p6
sys-devel/binutils:  2.15.92.0.2-r10
sys-devel/libtool:   1.5.16
virtual/os-headers:  2.6.11-r2
ACCEPT_KEYWORDS="amd64"
AUTOCLEAN="yes"
CFLAGS="-O3 -march=k8 -pipe -fomit-frame-pointer"
CHOST="x86_64-pc-linux-gnu"
CONFIG_PROTECT="/etc /usr/kde/2/share/config /usr/kde/3.3/env /usr/kde/3.3/share/config /usr/kde/3.3/shutdown /usr/kde/3.4/env /usr/kde/3.4/share/config /usr/kde/3.4/shutdown /usr/kde/3/share/config /usr/lib/X11/xkb /usr/share/config /usr/share/texmf/dvipdfm/config/ /usr/share/texmf/dvips/config/ /usr/share/texmf/tex/generic/config/ /usr/share/texmf/tex/platex/config/ /usr/share/texmf/xdvi/ /var/qmail/control"
CONFIG_PROTECT_MASK="/etc/gconf /etc/terminfo /etc/env.d"
CXXFLAGS="-O3 -march=k8 -pipe -fomit-frame-pointer"
DISTDIR="/usr/portage/distfiles"
FEATURES="autoaddcvs autoconfig ccache distlocks sandbox sfperms strict"
GENTOO_MIRRORS="ftp://ftp.belnet.be/mirror/rsync.gentoo.org/gentoo/ http://www.gigaload.org/gentoo.org/ http://linux.rz.ruhr-uni-bochum.de/download/gentoo-mirror/"
LANG="nl_BE@euro"
LINGUAS="nl"
MAKEOPTS="-j2"
PKGDIR="/usr/portage/packages"
PORTAGE_TMPDIR="/var/tmp"
PORTDIR="/usr/portage"
PORTDIR_OVERLAY="/usr/local/portage"
SYNC="rsync://rsync.gentoo.org/gentoo-portage"
USE="amd64 X acpi alsa avi bdd berkdb bitmap-fonts cdr crypt cups curl divxforlinux dvd dvdr encode esd fam flac flash font-server foomaticdb fortran ftp gd gdbm gif gphoto2 gpm gstreamer gtk gtk2 gtkhtml imagemagick imap imlib ipv6 java jp2 jpeg ldap libwww lzw lzw-tiff mad mikmod motif mozilla mp3 mpeg msn ncurses nls nptl ogg oggvorbis opengl oss pam pdflib perl png ppds python readline recode samba sdl slang ssl tcltk tcpd tetex tiff truetype truetype-fonts type1-fonts unicode usb userlocales vorbis xine xml xml2 xmms xpm xrandr xv xvid zlib linguas_nl userland_GNU kernel_linux elibc_glibc"
Unset:  ASFLAGS, CBUILD, CTARGET, LC_ALL, LDFLAGS


cat /etc/portage/package.cflags:
Code:

app-office/openoffice -march=k8 -pipe -fomit-frame-pointer -O2
Back to top
View user's profile Send private message
hlevyn
Apprentice
Apprentice


Joined: 14 Jan 2005
Posts: 240
Location: Santa Clara, California

PostPosted: Mon Jul 04, 2005 7:35 pm    Post subject: Reply with quote

Howdy. I feel like a fool because I know this error has been encountered before, and I thought it had been fixed with a patch, but alas I cannot find the post where it was fixed. So, below is the output of ebuild /usr/local/portage/app-office/openoffice/openoffice-1.9.113.ebuild compile >> /var/www/hlevyn.dnsalias.com/htdocs/bridgetest.log
Code:
Use of uninitialized value in concatenation (.) or string at ./set_soenv line 905.
mkdir: cannot create directory `../../unxlngi6.pro/lib/': File exists
register component 'acceptor.uno.so' in registry 'uno_services.rdb' succesful!
register component 'bridgefac.uno.so' in registry 'uno_services.rdb' succesful!
register component 'connector.uno.so' in registry 'uno_services.rdb' succesful!
register component 'remotebridge.uno.so' in registry 'uno_services.rdb' succesful!
register component 'uuresolver.uno.so' in registry 'uno_services.rdb' succesful!
register component 'bridgetest.uno.so' in registry 'uno_services.rdb' succesful!
register component 'cppobj.uno.so' in registry 'uno_services.rdb' succesful!
register component 'uriproc.uno.so' in registry 'uno_services.rdb' succesful!
register component 'javaloader.uno.so' in registry '../../unxlngi6.pro/lib/uno_services.rdb' succesful!
register component 'javavm.uno.so' in registry '../../unxlngi6.pro/lib/uno_services.rdb' succesful!
dmake:  Error code 134, while making '../../unxlngi6.pro/lib/uno_services.rdb'
dmake:  '../../unxlngi6.pro/lib/uno_services.rdb' removed.

ERROR: Error 65280 occurred while making /var/tmp/portage/openoffice-1.9.113/work/src680-m113/testtools/source/bridgetest

!!! ERROR: app-office/openoffice-1.9.113 failed.
!!! Function src_compile, Line 621, Exitcode 1
!!! Build failed!
!!! If you need support, post the topmost build error, NOT this status message.

And the log can be found here. Something that might be causing this is that I was unable to find pkgconfig-mozilla-firefox.tar.bz2 on your website. Is it truly gone and not needed?

And because no post is complete around here without it:
Code:
Portage 2.0.51.19 (default-linux/x86/2005.0, gcc-3.4.4, glibc-2.3.5-r0, 2.6.12-gentoo-r3 i686)
=================================================================
System uname: 2.6.12-gentoo-r3 i686 AMD Athlon(TM) XP 2100+
Gentoo Base System version 1.6.12
Python:              dev-lang/python-2.4.1-r1 [2.4.1 (#1, Jun 17 2005, 01:18:02)]
dev-lang/python:     2.4.1-r1
sys-apps/sandbox:    [Not Present]
sys-devel/autoconf:  2.13, 2.59-r6
sys-devel/automake:  1.9.5, 1.5, 1.7.9-r1, 1.8.5-r3, 1.4_p6, 1.6.3
sys-devel/binutils:  2.16.1
sys-devel/libtool:   1.5.18-r1
virtual/os-headers:  2.6.11-r2
ACCEPT_KEYWORDS="x86"
AUTOCLEAN="yes"
CFLAGS="-march=athlon-xp -mtune=athlon-xp -O3 -pipe -fomit-frame-pointer"
CHOST="i686-pc-linux-gnu"
CONFIG_PROTECT="/etc /usr/kde/2/share/config /usr/kde/3.3/env /usr/kde/3.3/share/config /usr/kde/3.3/shutdown /usr/kde/3.4/env /usr/kde/3.4/share/config /usr/kde/3.4/shutdown /usr/kde/3/share/config /usr/lib/X11/xkb /usr/lib/mozilla/defaults/pref /usr/share/config /var/qmail/control"
CONFIG_PROTECT_MASK="/etc/gconf /etc/splash /etc/terminfo /etc/env.d"
CXXFLAGS="-march=athlon-xp -mtune=athlon-xp -O3 -pipe -fomit-frame-pointer"
DISTDIR="/usr/portage/distfiles"
FEATURES="autoaddcvs autoconfig ccache distlocks sandbox sfperms strict"
GENTOO_MIRRORS="http://distfiles.gentoo.org http://distro.ibiblio.org/pub/Linux/distributions/gentoo"
MAKEOPTS="-j2"
PKGDIR="/usr/portage/packages"
PORTAGE_TMPDIR="/var/tmp"
PORTDIR="/usr/portage"
PORTDIR_OVERLAY="/usr/local/portage"
SYNC="rsync://rsync.gentoo.org/gentoo-portage"
USE="X alsa apm arts avi berkdb bitmap-fonts cdr crypt cups curl dvd dvdr eds emboss encode esd fam firefox flac foomaticdb fortran gdbm gif gnome gpm gstreamer gtk gtk2 imagemagick imlib ipv6 java jmx jpeg junit ldap libg++ libwww mad mikmod motif mozilla mp3 mpeg ncurses nls offensive ogg oggvorbis opengl oss pam pdflib perl png ppds python qt quicktime readline samba sdl slang spell sqlite ssl svga tcltk tcpd tiff truetype truetype-fonts type1-fonts unicode usb vorbis win32codecs x86 xine xml xml2 xmms xv zlib userland_GNU kernel_linux elibc_glibc"
Unset:  ASFLAGS, CBUILD, CTARGET, LANG, LC_ALL, LDFLAGS, LINGUAS
Code:
Portage 2.0.51.19 (default-linux/x86/2005.0, gcc-3.4.4, glibc-2.3.5-r0, 2.6.12-gentoo-r3 i686)
=================================================================
System uname: 2.6.12-gentoo-r3 i686 Intel(R) Pentium(R) M processor 2.00GHz
Gentoo Base System version 1.6.12
Python:              dev-lang/python-2.3.4-r1,dev-lang/python-2.4.1-r1 [2.4.1 (#1, Jun 19 2005, 01:2                 9:30)]
dev-lang/python:     2.3.4-r1, 2.4.1-r1
sys-apps/sandbox:    [Not Present]
sys-devel/autoconf:  2.13, 2.59-r6
sys-devel/automake:  1.8.5-r3, 1.5, 1.7.9-r1, 1.6.3, 1.4_p6, 1.9.5
sys-devel/binutils:  2.16.1
sys-devel/libtool:   1.5.18-r1
virtual/os-headers:  2.6.11-r2
ACCEPT_KEYWORDS="x86"
AUTOCLEAN="yes"
CFLAGS="-march=pentium-m -mtune=pentium-m -O3 -pipe -fomit-frame-pointer"
CHOST="i686-pc-linux-gnu"
CONFIG_PROTECT="/etc /usr/kde/2/share/config /usr/kde/3.4/env /usr/kde/3.4/share/config /usr/kde/3.4/shutdown /usr/kde/3/share/config /usr/lib/X11/xkb /usr/lib/mozilla/defaults/pref /usr/share/config/var/qmail/control"
CONFIG_PROTECT_MASK="/etc/gconf /etc/splash /etc/terminfo /etc/env.d"
CXXFLAGS="-march=pentium-m -mtune=pentium-m -O3 -pipe -fomit-frame-pointer"
DISTDIR="/usr/portage/distfiles"
FEATURES="autoaddcvs autoconfig ccache distlocks sandbox sfperms strict"
GENTOO_MIRRORS="http://mirror.espri.arizona.edu/gentoo/ http://san.csc.calpoly.edu/gentoo/ ftp://gentoo.mirrors.tds.net/gentoo"
MAKEOPTS="-j2"
PKGDIR="/usr/portage/packages"
PORTAGE_TMPDIR="/var/tmp"
PORTDIR="/usr/portage"
PORTDIR_OVERLAY="/usr/local/portage"
SYNC="rsync://rsync.us.gentoo.org/gentoo-portage"
USE="X alsa apm arts avi berkdb bitmap-fonts cdr crypt cups curl dvd eds emboss encode esd fam firefox foomaticdb fortran gdbm gif gnome gpm gstreamer gtk gtk2 imagemagick imlib ipv6 java jpeg junit ldap libg++ libwww mad mikmod motif mozilla mp3 mpeg ncurses nls offensive ogg oggvorbis opengl oss pam pdflib perl png ppds python qt quicktime readline sdl spell ssl tcltk tcpd tiff truetype truetype-fonts type1-fonts unicode usb vorbis x86 xine xml2 xmms xv zlib userland_GNU kernel_linux elibc_glibc"
Unset:  ASFLAGS, CBUILD, CTARGET, LANG, LC_ALL, LDFLAGS, LINGUAS
Code:
[ebuild     U ] app-office/openoffice-1.9.113 [1.9.108] +berkdb -boost -crystal-images +cups +curl +firefox -gcj +gnome -icu +industrial-images +java -jpeg -kde +ldap -mozilla -nas +neon -nobinfilter -nomoz -nosound +nptl -portaudio +python -sablot -sndfile -wpd +xml2 +zlib

_________________
Madness takes its toll. Please have exact change.
Back to top
View user's profile Send private message
yamakawa
Guru
Guru


Joined: 28 Jul 2003
Posts: 340

PostPosted: Tue Jul 05, 2005 6:00 am    Post subject: Reply with quote

:geki

m113 ebuild went OK on the desktop PC, on which I have succeeded in emerging of m108 the other day.

thanks! :D
Back to top
View user's profile Send private message
whitesouls
Guru
Guru


Joined: 19 Nov 2004
Posts: 358
Location: In Front of My Laptop

PostPosted: Thu Jul 07, 2005 7:59 pm    Post subject: Reply with quote

:cry: ..after hunting here and there, i got geki's ebuild and started to work...this is what i got...please help me someone..

Code:
In file included from akmngr.c:23:
../../include/xmlsec/nss/tokens.h:49: error: parse error before "CK_MECHANISM_TYPE_PTR"
../../include/xmlsec/nss/tokens.h:49: warning: no semicolon at end of struct or union
../../include/xmlsec/nss/tokens.h:50: warning: data definition has no type or storage class
../../include/xmlsec/nss/tokens.h:51: error: parse error before '}' token
../../include/xmlsec/nss/tokens.h:56: error: parse error before "CK_MECHANISM_TYPE_PTR"
../../include/xmlsec/nss/tokens.h:62: error: parse error before "CK_MECHANISM_TYPE"
../../include/xmlsec/nss/tokens.h:68: error: parse error before "CK_MECHANISM_TYPE"
../../include/xmlsec/nss/tokens.h:72: error: parse error before "xmlSecNssKeySlotGetMechList"
../../include/xmlsec/nss/tokens.h:74: warning: data definition has no type or storage class
../../include/xmlsec/nss/tokens.h:79: error: parse error before "PK11SlotInfo"
../../include/xmlsec/nss/tokens.h:85: error: parse error before "PK11SlotInfo"
../../include/xmlsec/nss/tokens.h:93: error: parse error before '*' token
../../include/xmlsec/nss/tokens.h:96: warning: data definition has no type or storage class
../../include/xmlsec/nss/tokens.h:120: error: parse error before "CK_MECHANISM_TYPE"
../../include/xmlsec/nss/tokens.h:126: error: parse error before "CK_MECHANISM_TYPE"
../../include/xmlsec/nss/tokens.h:163: error: parse error before '*' token
../../include/xmlsec/nss/tokens.h:163: error: parse error before "type"
../../include/xmlsec/nss/tokens.h:163: warning: data definition has no type or storage class
../../include/xmlsec/nss/tokens.h:175: error: parse error before '*' token
In file included from akmngr.c:24:
../../include/xmlsec/nss/akmngr.h:27: error: parse error before '*' token
../../include/xmlsec/nss/akmngr.h:34: error: parse error before "PK11SymKey"
../../include/xmlsec/nss/akmngr.h:40: error: parse error before "SECKEYPublicKey"
../../include/xmlsec/nss/akmngr.h:46: error: parse error before "SECKEYPrivateKey"
In file included from akmngr.c:25:
../../include/xmlsec/nss/pkikeys.h:24: error: parse error before '*' token
../../include/xmlsec/nss/pkikeys.h:27: error: parse error before '*' token
../../include/xmlsec/nss/pkikeys.h:27: warning: data definition has no type or storage class
../../include/xmlsec/nss/pkikeys.h:29: error: parse error before '*' token
../../include/xmlsec/nss/pkikeys.h:29: warning: data definition has no type or storage class
../../include/xmlsec/nss/pkikeys.h:31: error: parse error before "xmlSecNssPKIKeyDataGetKeyType"
../../include/xmlsec/nss/pkikeys.h:31: warning: data definition has no type or storage class
In file included from akmngr.c:26:
../../include/xmlsec/nss/ciphers.h:22: error: parse error before "PK11SymKey"
../../include/xmlsec/nss/ciphers.h:24: error: parse error before '*' token
../../include/xmlsec/nss/ciphers.h:26: error: parse error before '*' token
../../include/xmlsec/nss/ciphers.h:26: warning: data definition has no type or storage class
akmngr.c:40: error: parse error before '*' token
akmngr.c:184: error: parse error before "PK11SymKey"
akmngr.c: In function `xmlSecNssAppliedKeysMngrSymKeyLoad':
akmngr.c:190: error: `mngr' undeclared (first use in this function)
akmngr.c:190: error: (Each undeclared identifier is reported only once
akmngr.c:190: error: for each function it appears in.)
akmngr.c:191: error: `symKey' undeclared (first use in this function)
akmngr.c: At top level:
akmngr.c:251: error: parse error before "SECKEYPublicKey"
akmngr.c: In function `xmlSecNssAppliedKeysMngrPubKeyLoad':
akmngr.c:257: error: `mngr' undeclared (first use in this function)
akmngr.c:258: error: `pubKey' undeclared (first use in this function)
akmngr.c: At top level:
akmngr.c:318: error: parse error before "SECKEYPrivateKey"
akmngr.c: In function `xmlSecNssAppliedKeysMngrPriKeyLoad':
akmngr.c:324: error: `mngr' undeclared (first use in this function)
akmngr.c:325: error: `priKey' undeclared (first use in this function)
make[3]: *** [akmngr.lo] Error 1
make[3]: Leaving directory `/var/tmp/portage/openoffice-1.9.108/work/src680-m108/libxmlsec/unxlngi6.pro/misc/build/xmlsec1-1.2.6/src/nss'
make[2]: *** [all-recursive] Error 1
make[2]: Leaving directory `/var/tmp/portage/openoffice-1.9.108/work/src680-m108/libxmlsec/unxlngi6.pro/misc/build/xmlsec1-1.2.6/src'
make[1]: *** [all-recursive] Error 1
make[1]: Leaving directory `/var/tmp/portage/openoffice-1.9.108/work/src680-m108/libxmlsec/unxlngi6.pro/misc/build/xmlsec1-1.2.6'
make: *** [all] Error 2
dmake:  Error code 2, while making './unxlngi6.pro/misc/build/so_built_so_xmlsec1'
'---* tg_merge.mk *---'

ERROR: Error 65280 occurred while making /var/tmp/portage/openoffice-1.9.108/work/src680-m108/libxmlsec

!!! ERROR: app-office/openoffice-1.9.108 failed.
!!! Function src_compile, Line 623, Exitcode 1
!!! Build failed!
!!! If you need support, post the topmost build error, NOT this status message.


this is only a partial of the error...
here's my emerge --info:

Code:
Portage 2.0.51.19 (default-linux/x86/2005.0, gcc-3.4.4, glibc-2.3.5-r0, 2.6.12-gentoo i686)
=================================================================
System uname: 2.6.12-gentoo i686 Intel(R) Pentium(R) M processor 1.60GHz
Gentoo Base System version 1.6.12
Python:              dev-lang/python-2.3.5 [2.3.5 (#1, Jul  7 2005, 17:48:15)]
ccache version 2.3 [enabled]
dev-lang/python:     2.3.5
sys-apps/sandbox:    1.2.9
sys-devel/autoconf:  2.59-r6, 2.13
sys-devel/automake:  1.7.9-r1, 1.8.5-r3, 1.5, 1.4_p6, 1.6.3, 1.9.5
sys-devel/binutils:  2.15.92.0.2-r10
sys-devel/libtool:   1.5.18-r1
virtual/os-headers:  2.6.11-r2
ACCEPT_KEYWORDS="x86"
AUTOCLEAN="yes"
CFLAGS="-O3 -march=pentium3 -pipe -msse2 -mfpmath=sse -mmmx -msse -fomit-frame-pointer -momit-leaf-frame-pointer -minline-all-stringops -foptimize-sibling-calls -fcaller-saves -falign-functions=64 -finline-functions -funit-at-a-time -fweb -floop-optimize2 -fforce-addr -ftracer -fstack-protector -fno-ident"
CHOST="i686-pc-linux-gnu"
CONFIG_PROTECT="/etc /usr/kde/2/share/config /usr/kde/3.3/env /usr/kde/3.3/share/config /usr/kde/3.3/shutdown /usr/kde/3/share/config /usr/lib/X11/xkb /usr/lib/mozilla/defaults/pref /usr/share/config /usr/share/texmf/dvipdfm/config/ /usr/share/texmf/dvips/config/ /usr/share/texmf/tex/generic/config/ /usr/share/texmf/tex/platex/config/ /usr/share/texmf/xdvi/ /var/qmail/control"
CONFIG_PROTECT_MASK="/etc/gconf /etc/terminfo /etc/env.d"
CXXFLAGS="-O3 -march=pentium3 -pipe -msse2 -mfpmath=sse -mmmx -msse -fomit-frame-pointer -momit-leaf-frame-pointer -minline-all-stringops -foptimize-sibling-calls -fcaller-saves -falign-functions=64 -finline-functions -funit-at-a-time -fweb -floop-optimize2 -fforce-addr -ftracer -fstack-protector -fno-ident -fvisibility-inlines-hidden"
DISTDIR="/usr/portage/distfiles"
FEATURES="autoaddcvs autoconfig ccache distlocks sandbox sfperms strict userpriv usersandbox"
GENTOO_MIRRORS="http://mirror.averse.net/pub/gentoo/ ftp://gentoo.ccccom.com http://194.117.143.69"
LANG="en_EN.UTF-8"
LC_ALL="en_US.UTF-8"
LINGUAS="en_US.UTF-8"
MAKEOPTS="-j2"
PKGDIR="/usr/portage/packages"
PORTAGE_TMPDIR="/var/tmp"
PORTDIR="/usr/portage"
PORTDIR_OVERLAY="/usr/local/portage"
SYNC="rsync://rsync.gentoo.org/gentoo-portage"
USE="x86 16bit 3dnow 3dnowex X aac acpi acpi4linux ada alsa ansi apm avi bash-completion bigger-fonts bitmap-fonts blender-game bluetooth bootsplash bzip2 bzlib c++ calendar caps ccache cdda cddb cdparanoia cdr cdrom chipcard chroot clamav crypt css cups curl dhcp dillo divx4linux dvd dvdread eds encode escreen esd ethereal fam foomaticdb fortran ftp gcc-libffi gdbm gif gimp gkrellm gmail gnustep gpm gstreamer gtk gtk2 i8x0 icq ieee1394 imagemagick imlib ipv6 irc irda jabber java javacomm javadoc javamail javascript jcs jikes jpeg jpeg2k lcd libg++ libwww logitech-mouse mad mikmod mixer mjpeg mmx mmx2 motif mozcalendar mozdevelop mozilla mozsvg mozxmlterm mp3 mpeg mpeg4 mplayer msn ncurses nls nptl ogg oggvorbis opengl oscar oss pam pdf pdflib perl png python qt quicktime readline real samba screenshot sdl spell sse sse2 ssl tcltk tcpd tetex tiff truetype truetype-fonts type1-fonts unicode uptimed usb v4l v4l2 vcd vcdimager videos vim vim-pager vim-with-x virus-scan visualization vorbis wifi wma123 wxwindows xine xml2 xmms xv xvid xvmc yahoo zlib video_cards_radeon linguas_en_US.UTF-8 userland_GNU kernel_linux elibc_glibc"
Unset:  ASFLAGS, CBUILD, CTARGET, LDFLAGS


please..is there any thing else i should do or post... by the way, izzit the latest ebuild?:oops:
_________________
whitesouls

Please insert the [SOLVED] tag if your problem is solved in your respective thread.
Back to top
View user's profile Send private message
hlevyn
Apprentice
Apprentice


Joined: 14 Jan 2005
Posts: 240
Location: Santa Clara, California

PostPosted: Thu Jul 07, 2005 8:11 pm    Post subject: Reply with quote

This issue was already posted here. It's due to an unpatched firefox build. Take a look at geki's site for a link to instructions on how to patch.
_________________
Madness takes its toll. Please have exact change.
Back to top
View user's profile Send private message
whitesouls
Guru
Guru


Joined: 19 Nov 2004
Posts: 358
Location: In Front of My Laptop

PostPosted: Thu Jul 07, 2005 8:22 pm    Post subject: Reply with quote

but i got some patching problems like failing hunks or chunks i guess...i hope someone can help me by guiding me step by step..:oops: ..sorry, i'm asking cause i've tried the guide he gave but i dont understand it and even though i follow..it fails..

edit this is my output of patching la..
Code:
VaderX tmp # patch -p0 < /tmp/mozilla-firefox-ebuild.patch
patching file /usr/portage/www-client/mozilla-firefox/mozilla-firefox-1.0.4.ebuild
Hunk #1 FAILED at 14.
Hunk #2 FAILED at 24.
Hunk #3 succeeded at 254 with fuzz 2 (offset 95 lines).
Hunk #4 FAILED at 297.
Hunk #5 succeeded at 385 with fuzz 2 (offset 144 lines).
3 out of 5 hunks FAILED -- saving rejects to file /usr/portage/www-client/mozilla-firefox/mozilla-firefox-1.0.4.ebuild.rej

_________________
whitesouls

Please insert the [SOLVED] tag if your problem is solved in your respective thread.


Last edited by whitesouls on Thu Jul 07, 2005 8:32 pm; edited 1 time in total
Back to top
View user's profile Send private message
whitesouls
Guru
Guru


Joined: 19 Nov 2004
Posts: 358
Location: In Front of My Laptop

PostPosted: Thu Jul 07, 2005 8:26 pm    Post subject: Reply with quote

forgot to post my emerge -pv openoffice
Code:
[ebuild  N    ] app-office/openoffice-1.9.108  -berkdb +boost +crystal-images -cups +curl +firefox -gcj -gnome +icu +industrial-images +java +jpeg -kde -ldap -mozilla -nas +neon -nobinfilter -nomoz -nosound +nptl -portaudio +python -sablot -sndfile -wpd +xml2 +zlib 0 kB [1]

Total size of downloads: 0 kB
Portage overlays:
 [1] /usr/local/portage

_________________
whitesouls

Please insert the [SOLVED] tag if your problem is solved in your respective thread.
Back to top
View user's profile Send private message
hlevyn
Apprentice
Apprentice


Joined: 14 Jan 2005
Posts: 240
Location: Santa Clara, California

PostPosted: Thu Jul 07, 2005 8:38 pm    Post subject: Reply with quote

I'd recommend removing the file you tried to patch, sync up again, and try from scratch. Also take a look at the reject file to see what hunks it didn't like.

And from geki's instructions, the following are the most important lines with the current patch:
Code:
wget http://geki.ath.cx/hacks/mozilla-firefox-ebuild.patch

patch -p0 < mozilla-firefox-ebuild.patch

ebuild /usr/portage/www-client/mozilla-firefox/mozilla-firefox-1.0.4.ebuild digest

emerge -pv mozilla-firefox
And make sure that Firefox uses ssl. Hopefully you won't have to do much else than that. :)
_________________
Madness takes its toll. Please have exact change.
Back to top
View user's profile Send private message
whitesouls
Guru
Guru


Joined: 19 Nov 2004
Posts: 358
Location: In Front of My Laptop

PostPosted: Thu Jul 07, 2005 8:44 pm    Post subject: Reply with quote

hlevyn wrote:
I'd recommend removing the file you tried to patch, sync up again, and try from scratch. Also take a look at the reject file to see what hunks it didn't like.

And from geki's instructions, the following are the most important lines with the current patch:
Code:
wget http://geki.ath.cx/hacks/mozilla-firefox-ebuild.patch

patch -p0 < mozilla-firefox-ebuild.patch

ebuild /usr/portage/www-client/mozilla-firefox/mozilla-firefox-1.0.4.ebuild digest

emerge -pv mozilla-firefox
And make sure that Firefox uses ssl. Hopefully you won't have to do much else than that. :)


ok, i will try..if it doesnt work.. I'll be back..:)
_________________
whitesouls

Please insert the [SOLVED] tag if your problem is solved in your respective thread.
Back to top
View user's profile Send private message
whitesouls
Guru
Guru


Joined: 19 Nov 2004
Posts: 358
Location: In Front of My Laptop

PostPosted: Thu Jul 07, 2005 9:28 pm    Post subject: Reply with quote

OOHH..thank god and you guys...at last i got the ebuild correctly patched and then the firefox now support ssl.. thank you hlevyn and geki..:D

Code:
VaderX tmp # emerge -pv mozilla-firefox

These are the packages that I would merge, in order:

Calculating dependencies ...done!
[ebuild  N    ] dev-util/cvs-1.11.20  -doc -emacs 2,358 kB
[ebuild   R   ] www-client/mozilla-firefox-1.0.4  -debug -gnome +java -ldap +mozdevelop -moznoxft +mozsvg +mozxmlterm +ssl -xinerama -xprint 0 kB

Total size of downloads: 2,358 kB

_________________
whitesouls

Please insert the [SOLVED] tag if your problem is solved in your respective thread.
Back to top
View user's profile Send private message
whitesouls
Guru
Guru


Joined: 19 Nov 2004
Posts: 358
Location: In Front of My Laptop

PostPosted: Sun Jul 10, 2005 4:42 am    Post subject: Reply with quote

I managed to compile mozilla-firefox with ssl support

Code:
VaderX ~ # emerge -pv mozilla-firefox

These are the packages that I would merge, in order:

Calculating dependencies ...done!
[ebuild   R   ] www-client/mozilla-firefox-1.0.4  -debug -gnome +java -ldap +mozdevelop -moznoxft +mozsvg +mozxmlterm +ssl -xinerama -xprint 0 kB



this is my error output after trying to compile openoffice...
Code:

------------------------------
Making: ../unxlngi6.pro/misc/util.dpc
dmake subdmake=true  -f makefile.mk strip="true" product="full" depend=t ALLDPC
------------------------------
No Dependencies
-------------
No EPM: do no packaging at this stage
... checking environment variables ...

########################################################
make_installer.pl, version 1.0
Product list file: openoffice.lst
Taking setup script from solver
Unpackpath: /var/tmp/portage/openoffice-1.9.108/work/src680-m108/instsetoo_native/util
Compiler: unxlngi6
Product: OpenOffice
BuildID: 8920
Build: SRC680
No minor set
Product version
Installpath: /var/tmp/portage/openoffice-1.9.108/work/opt/OpenOffice.org-1.9.108
Package format: native
Package list file: ../inc_openoffice/unix/packagelist.txt
Addon-Package list file: ../inc_openoffice/unix/packagelist_language.txt
Not calling epm
Unzip ARCHIVE files
services.rdb can be created
Languages:
        en-US
########################################################
... checking required files ...
...... searching zip ...
        Found: /usr/bin/zip
...... searching unzip ...
        Found: /usr/bin/unzip
... analyzing openoffice.lst ...
... analyzing script: /var/tmp/portage/openoffice-1.9.108/work/src680-m108/solver/680/unxlngi6.pro/bin/setup_osl.ins ...
... analyzing directories ...
... analyzing files ...
... analyzing scpactions ...
... analyzing shortcuts ...
... analyzing profile ...
... analyzing profileitems ...
... analyzing modules ...
------------------------------------
... languages en-US ...

**************************************************
ERROR: ERROR: Missing files
in function: remove_Files_Without_Sourcedirectory
**************************************************

**************************************************
ERROR: Saved logfile: /var/tmp/portage/openoffice-1.9.108/work/src680-m108/instsetoo_native/util/OpenOffice/logging/en-US/log_SRC680__en-US.log
**************************************************
... analyzing files ...
ERROR: The following files could not be found:
ERROR: File not found: ldapbe2.uno.so
... cleaning the output tree ...
Sun Jul 10 12:01:42 2005 (00:05 min.)

!!! ERROR: app-office/openoffice-1.9.108 failed.
!!! Function src_compile, Line 661, Exitcode 255
!!! Initial openoffice-1.9.108 build failed!
!!! If you need support, post the topmost build error, NOT this status message.



this is just a partial log of it...:oops: is there anything is can do for me to install openoffice?
[/code]
_________________
whitesouls

Please insert the [SOLVED] tag if your problem is solved in your respective thread.
Back to top
View user's profile Send private message
whitesouls
Guru
Guru


Joined: 19 Nov 2004
Posts: 358
Location: In Front of My Laptop

PostPosted: Tue Jul 12, 2005 7:50 pm    Post subject: Reply with quote

:( guess i have to stick with the binaries for awhile and wait for the full source version 2 to come out..damn..wish i could compile it without any problems...:(
_________________
whitesouls

Please insert the [SOLVED] tag if your problem is solved in your respective thread.
Back to top
View user's profile Send private message
geki
Advocate
Advocate


Joined: 13 May 2004
Posts: 2328
Location: Germania

PostPosted: Tue Jul 12, 2005 8:54 pm    Post subject: Reply with quote

Quote:
ERROR: File not found: ldapbe2.uno.so
seems to be fixed with m114, ximianized version. but who knows :o
will test soon. edit fixed

gcc4/gcj4 needs testing now.
_________________
boost|select libs to build|slotable|python-buildid

hear hear


Last edited by geki on Wed Jul 13, 2005 7:00 pm; edited 1 time in total
Back to top
View user's profile Send private message
whitesouls
Guru
Guru


Joined: 19 Nov 2004
Posts: 358
Location: In Front of My Laptop

PostPosted: Wed Jul 13, 2005 7:39 am    Post subject: Reply with quote

geki wrote:
Quote:
ERROR: File not found: ldapbe2.uno.so
seems to be fixed with m114, ximianized version. but who knows :o
will test soon.


ximianized version ehh...interesting.. is the ebuild ready yet?? and by the way, can i compile it with my LDFLAGS? coz i compile my whole system with LDFLAGS...:? hmm...
_________________
whitesouls

Please insert the [SOLVED] tag if your problem is solved in your respective thread.
Back to top
View user's profile Send private message
scoobydu
Veteran
Veteran


Joined: 16 Feb 2003
Posts: 1076
Location: 'Mind the Gap'

PostPosted: Wed Jul 13, 2005 11:08 am    Post subject: Reply with quote

Lord Vader wrote:
geki wrote:
Quote:
ERROR: File not found: ldapbe2.uno.so
seems to be fixed with m114, ximianized version. but who knows :o
will test soon.


ximianized version ehh...interesting.. is the ebuild ready yet?? and by the way, can i compile it with my LDFLAGS? coz i compile my whole system with LDFLAGS...:? hmm...


I'd be happy just to compile it at all :wink:
_________________
Tyan Tiger K8W, 2xOpteron 240,Powerbook5,6 15" 1.5g, Macbook Black 2g, Mac Mini 1g, Ipod P60g.
| Linux - From a windows user perspective|
Back to top
View user's profile Send private message
geki
Advocate
Advocate


Joined: 13 May 2004
Posts: 2328
Location: Germania

PostPosted: Fri Jul 15, 2005 12:54 pm    Post subject: Reply with quote

Quote:
Making: ../../unxlngi6.pro/lib/pythonloader.uno.so
g++ -Wl,-z,combreloc -Wl,-z,defs -Wl,-rpath,'$ORIGIN' -shared -Wl,-O1 -Wl,--version-script ../../unxlngi6.pro/misc/component_pythonloader.uno.map -L../../unxlngi6.pro/lib -L../lib -L/var/tmp/portage/openoffice-ximian-1.9.114/work/src680-m114/solenv/unxlngi6/lib -L/var/tmp/portage/openoffice-ximian-1.9.114/work/src680-m114/solver/680/unxlngi6.pro/lib -L/var/tmp/portage/openoffice-ximian-1.9.114/work/src680-m114/solenv/unxlngi6/lib -L/lib -L/jre/lib/i386 -L/jre/lib/i386/client -L/jre/lib/i386/native_threads -L/usr/lib -L/usr/lib/MozillaFirefox ../../unxlngi6.pro/slo/pythonloader.uno_version.o ../../unxlngi6.pro/slo/pythonloader.uno_description.o -o ../../unxlngi6.pro/lib/pythonloader.uno.so ../../unxlngi6.pro/slo/pyuno_loader.o -luno_cppu -luno_cppuhelpergcc3 -luno_sal -lpyuno -lpython2.4 -ldl -lpthread -lm -Wl,-Bdynamic -lstlport_gcc
rm -f ../../unxlngi6.pro/lib/check_pythonloader.uno.so
mv ../../unxlngi6.pro/lib/pythonloader.uno.so ../../unxlngi6.pro/lib/check_pythonloader.uno.so
/var/tmp/portage/openoffice-ximian-1.9.114/work/src680-m114/solenv/bin/checkdll.sh -L../../unxlngi6.pro/lib -L../lib -L/var/tmp/portage/openoffice-ximian-1.9.114/work/src680-m114/solenv/unxlngi6/lib -L/var/tmp/portage/openoffice-ximian-1.9.114/work/src680-m114/solver/680/unxlngi6.pro/lib -L/var/tmp/portage/openoffice-ximian-1.9.114/work/src680-m114/solenv/unxlngi6/lib -L/lib -L/jre/lib/i386 -L/jre/lib/i386/client -L/jre/lib/i386/native_threads -L/usr/lib -L/usr/lib/MozillaFirefox ../../unxlngi6.pro/lib/check_pythonloader.uno.so
Checking DLL ../../unxlngi6.pro/lib/check_pythonloader.uno.so ...: ok
-rwxr-xr-x 1 root root 27666 15. Jul 15:04 ../../unxlngi6.pro/lib/pythonloader.uno.so
rm -f ../../unxlngi6.pro/lib/pyuno_services.rdb ../../unxlngi6.pro/lib/pyuno_services.tmp ../../unxlngi6.pro/lib/pyuno_services.rdb
cd ../../unxlngi6.pro/lib && regcomp -register -r pyuno_services.tmp -c typeconverter.uno -c invocation.uno -c reflection.uno -c introspection.uno -c invocadapt.uno -c proxyfac.uno -c pythonloader.uno
[Java framework] Error in function BootParams::getJREHome() (fwkbase.cxx).javaldx failed!
Floating exception
dmake: Error code 136, while making '../../unxlngi6.pro/lib/pyuno_services.rdb'
'---* tg_merge.mk *---'

ERROR: Error 65280 occurred while making /var/tmp/portage/openoffice-ximian-1.9.114/work/src680-m114/pyuno/source/loader
gcc-4.0.1 build fails with aggressive cflags! :o
one of these
Quote:
-ffast-math -fforce-addr -momit-leaf-frame-pointer -fomit-frame-pointer -fweb -ftracer -frename-registers

_________________
boost|select libs to build|slotable|python-buildid

hear hear


Last edited by geki on Tue Jul 26, 2005 4:49 pm; edited 2 times in total
Back to top
View user's profile Send private message
whitesouls
Guru
Guru


Joined: 19 Nov 2004
Posts: 358
Location: In Front of My Laptop

PostPosted: Fri Jul 15, 2005 8:57 pm    Post subject: Reply with quote

Code:
/var/tmp/portage/openoffice-ximian-1.9.114/work/src680-m114/extras/source/database
------------------------------
Making: ../../unxlngi6.pro/misc/databasegeneral.dpz
dmake  -f makefile.mk strip="true" product="full" make_zip_deps=true   ../../unxlngi6.pro/misc/database.dpzz   ../../unxlngi6.pro/misc/databasebiblio.dpzz
echo # > ../../unxlngi6.pro/misc/database.dpzz
type 4
zipdep.pl -u -j  ../../unxlngi6.pro/bin/database.zip "biblio.odb" "evolocal.odb" -x "*CVS*" >> ../../unxlngi6.pro/misc/database.dpzz
zipdep -- version: 1.12
Multi Platform Enabled Edition
echo # > ../../unxlngi6.pro/misc/databasebiblio.dpzz
type 4
zipdep.pl -u -j  ../../unxlngi6.pro/bin/databasebiblio.zip "biblio.dbf" "biblio.dbt" -x "*CVS*" >> ../../unxlngi6.pro/misc/databasebiblio.dpzz
zipdep -- version: 1.12
Multi Platform Enabled Edition
cat   ../../unxlngi6.pro/misc/database.dpzz   ../../unxlngi6.pro/misc/databasebiblio.dpzz /var/tmp/portage/openoffice-ximian-1.9.114/temp/mkpV6uZs | grep -v "CVS" >> ../../unxlngi6.pro/misc/databasegeneral.dpz
echo zipdep_langs=en-US  >> ../../unxlngi6.pro/misc/databasegeneral.dpz
------------------------------
Making: ../../unxlngi6.pro/misc/databasegeneral.dpc
dmake subdmake=true  -f makefile.mk strip="true" product="full" depend=t ALLDPC
Making : Dependencies
dmake:  Error -- `evolocal.odb' not found, and can't be made
'---* tg_merge.mk *---'

ERROR: Error 65280 occurred while making /var/tmp/portage/openoffice-ximian-1.9.114/work/src680-m114/extras/source/database

!!! ERROR: app-office/openoffice-ximian-1.9.114 failed.
!!! Function src_compile, Line 523, Exitcode 1
!!! Build failed!
!!! If you need support, post the topmost build error, NOT this status message.


Yo geki, this is what i got from m114...damn..guess i have to stick with binaries...8)

Oh yeah, my emerge -pv openoffice-ximian
Code:

VaderX openoffice-ximian # emerge -pv app-office/openoffice-ximian

These are the packages that I would merge, in order:

Calculating dependencies ...done!
[ebuild  N    ] app-office/openoffice-ximian-1.9.114  -berkdb +boost -cups -curl -evo +firefox -gcj -gnome +icu +java +jpeg -kde -ldap -mono -mozilla -nas +neon +nobinfilter -nomoz -nosound +nptl -portaudio +python -sablot -sndfile -wpd +xml2 +zlib 18,085 kB [1]

Total size of downloads: 18,085 kB
Portage overlays:
 [1] /usr/local/portage

_________________
whitesouls

Please insert the [SOLVED] tag if your problem is solved in your respective thread.
Back to top
View user's profile Send private message
geki
Advocate
Advocate


Joined: 13 May 2004
Posts: 2328
Location: Germania

PostPosted: Sat Jul 16, 2005 12:04 am    Post subject: Reply with quote

fixed, also added lang package for localization files.

edit m118 ready, now waiting for new ximian patchset.
_________________
boost|select libs to build|slotable|python-buildid

hear hear
Back to top
View user's profile Send private message
Display posts from previous:   
This topic is locked: you cannot edit posts or make replies.    Gentoo Forums Forum Index Unsupported Software All times are GMT
Goto page Previous  1, 2, 3, 4 ... 37, 38, 39  Next
Page 3 of 39

 
Jump to:  
You cannot post new topics in this forum
You cannot reply to topics in this forum
You cannot edit your posts in this forum
You cannot delete your posts in this forum
You cannot vote in polls in this forum