Gentoo Forums
Gentoo Forums
Gentoo Forums
Quick Search: in
Can't emerge certain KDE3.4.0_rc1 apps
View unanswered posts
View posts from last 24 hours

Goto page 1, 2  Next  
Reply to topic    Gentoo Forums Forum Index Desktop Environments
View previous topic :: View next topic  
Author Message
Master One
l33t
l33t


Joined: 25 Aug 2003
Posts: 754
Location: Austria

PostPosted: Tue Mar 01, 2005 11:33 am    Post subject: Can't emerge certain KDE3.4.0_rc1 apps Reply with quote

Everything else worked out flawlessly, but some packages do not want to compile here, with similar errors.
Please have a look at the following three packages:

1. kde-base/kdemultimedia-kfile-plugins-3.4.0_rc1:
Code:
/bin/sh ../../libtool --silent --mode=link --tag=CXX i686-pc-linux-gnu-g++  -Wnon-virtual-dtor -Wno-long-long -Wundef -ansi -D_XOPEN_SOURCE=500 -D_BSD_SOURCE -Wcast-align -Wconversion -Wchar-subscripts -Wall -W -Wpointer-arith -Wwrite-strings -DNDEBUG -DNO_DEBUG -O2 -O3 -fweb -frename-registers -march=pentium-m -pipe -mtune=pentium-m -fforce-addr -momit-leaf-frame-pointer -fomit-frame-pointer -ftracer -funroll-loops -falign-functions -fmerge-all-constants -mfpmath=sse -maccumulate-outgoing-args -fprefetch-loop-arrays -fvisibility-inlines-hidden -fvisibility=hidden -Wformat-security -Wmissing-format-attribute -fno-exceptions -fno-check-new -fno-common -DQT_CLEAN_NAMESPACE -DQT_NO_ASCII_CAST -DQT_NO_STL -DQT_NO_COMPAT -DQT_NO_TRANSLATION   -Wl,-O1 -o kfile_mp3.la -rpath /usr/kde/3.4/lib/kde3 -L/usr/kde/3.4/lib -L/usr/qt/3/lib -L/usr/lib    -L/usr/lib -ltag -module -avoid-version -module -no-undefined -Wl,--no-undefined -Wl,--allow-shlib-undefined -R /usr/kde/3.4/lib -R /usr/kde/3.4/lib -R /usr/qt/3/lib -R /usr/lib  kfile_mp3.lo -lkio
.libs/kfile_mp3.o(.text+0x1cb4): In function `KMp3Plugin::readInfo(KFileMetaInfo&, unsigned int)':
: undefined reference to `TagLib::MPEG::File::File(char const*, bool, TagLib::AudioProperties::ReadStyle)'
.libs/kfile_mp3.o(.text+0x1cea): In function `KMp3Plugin::readInfo(KFileMetaInfo&, unsigned int)':
: undefined reference to `TagLib::File::isOpen() const'
.libs/kfile_mp3.o(.text+0x1d12): In function `KMp3Plugin::readInfo(KFileMetaInfo&, unsigned int)':
: undefined reference to `TagLib::MPEG::File::~File()'
.libs/kfile_mp3.o(.text+0x1d2f): In function `KMp3Plugin::readInfo(KFileMetaInfo&, unsigned int)':
: undefined reference to `TagLib::File::name() const'
.libs/kfile_mp3.o(.text+0x1d3d): In function `KMp3Plugin::readInfo(KFileMetaInfo&, unsigned int)':
: undefined reference to `TagLib::MPEG::File::~File()'
.libs/kfile_mp3.o(.text+0x1db4): In function `KMp3Plugin::readInfo(KFileMetaInfo&, unsigned int)':
: undefined reference to `TagLib::MPEG::File::tag() const'
.libs/kfile_mp3.o(.text+0x1dd2): In function `KMp3Plugin::readInfo(KFileMetaInfo&, unsigned int)':
: undefined reference to `TagLib::MPEG::File::tag() const'
.libs/kfile_mp3.o(.text+0x1e00): In function `KMp3Plugin::readInfo(KFileMetaInfo&, unsigned int)':
: undefined reference to `TagLib::MPEG::File::tag() const'
.libs/kfile_mp3.o(.text+0x1e2c): In function `KMp3Plugin::readInfo(KFileMetaInfo&, unsigned int)':
: undefined reference to `TagLib::MPEG::File::tag() const'
.libs/kfile_mp3.o(.text+0x1e79): In function `KMp3Plugin::readInfo(KFileMetaInfo&, unsigned int)':
: undefined reference to `TagLib::MPEG::File::tag() const'
.libs/kfile_mp3.o(.text+0x1ea5): In function `KMp3Plugin::readInfo(KFileMetaInfo&, unsigned int)':
: undefined reference to `TagLib::String::toCString(bool) const'
.libs/kfile_mp3.o(.text+0x1f07): In function `KMp3Plugin::readInfo(KFileMetaInfo&, unsigned int)':
: undefined reference to `TagLib::String::~String()'
.libs/kfile_mp3.o(.text+0x1f3a): In function `KMp3Plugin::readInfo(KFileMetaInfo&, unsigned int)':
: undefined reference to `TagLib::MPEG::File::tag() const'
.libs/kfile_mp3.o(.text+0x1f66): In function `KMp3Plugin::readInfo(KFileMetaInfo&, unsigned int)':
: undefined reference to `TagLib::String::toCString(bool) const'
.libs/kfile_mp3.o(.text+0x1fb4): In function `KMp3Plugin::readInfo(KFileMetaInfo&, unsigned int)':
: undefined reference to `TagLib::String::~String()'
.libs/kfile_mp3.o(.text+0x1fe1): In function `KMp3Plugin::readInfo(KFileMetaInfo&, unsigned int)':
: undefined reference to `TagLib::MPEG::File::tag() const'
.libs/kfile_mp3.o(.text+0x200d): In function `KMp3Plugin::readInfo(KFileMetaInfo&, unsigned int)':
: undefined reference to `TagLib::String::toCString(bool) const'
.libs/kfile_mp3.o(.text+0x206f): In function `KMp3Plugin::readInfo(KFileMetaInfo&, unsigned int)':
: undefined reference to `TagLib::String::~String()'
.libs/kfile_mp3.o(.text+0x2120): In function `KMp3Plugin::readInfo(KFileMetaInfo&, unsigned int)':
: undefined reference to `TagLib::MPEG::File::tag() const'
.libs/kfile_mp3.o(.text+0x2147): In function `KMp3Plugin::readInfo(KFileMetaInfo&, unsigned int)':
: undefined reference to `TagLib::String::toCString(bool) const'
.libs/kfile_mp3.o(.text+0x21a3): In function `KMp3Plugin::readInfo(KFileMetaInfo&, unsigned int)':
: undefined reference to `TagLib::String::~String()'
.libs/kfile_mp3.o(.text+0x2249): In function `KMp3Plugin::readInfo(KFileMetaInfo&, unsigned int)':
: undefined reference to `TagLib::MPEG::File::tag() const'
.libs/kfile_mp3.o(.text+0x2275): In function `KMp3Plugin::readInfo(KFileMetaInfo&, unsigned int)':
: undefined reference to `TagLib::String::toCString(bool) const'
.libs/kfile_mp3.o(.text+0x22cb): In function `KMp3Plugin::readInfo(KFileMetaInfo&, unsigned int)':
: undefined reference to `TagLib::String::~String()'
.libs/kfile_mp3.o(.text+0x244d): In function `KMp3Plugin::readInfo(KFileMetaInfo&, unsigned int)':
: undefined reference to `TagLib::MPEG::File::audioProperties() const'
.libs/kfile_mp3.o(.text+0x2455): In function `KMp3Plugin::readInfo(KFileMetaInfo&, unsigned int)':
: undefined reference to `TagLib::MPEG::Properties::version() const'
.libs/kfile_mp3.o(.text+0x24ee): In function `KMp3Plugin::readInfo(KFileMetaInfo&, unsigned int)':
: undefined reference to `TagLib::MPEG::File::audioProperties() const'
.libs/kfile_mp3.o(.text+0x24f6): In function `KMp3Plugin::readInfo(KFileMetaInfo&, unsigned int)':
: undefined reference to `TagLib::MPEG::Properties::layer() const'
.libs/kfile_mp3.o(.text+0x256b): In function `KMp3Plugin::readInfo(KFileMetaInfo&, unsigned int)':
: undefined reference to `TagLib::MPEG::File::audioProperties() const'
.libs/kfile_mp3.o(.text+0x25e8): In function `KMp3Plugin::readInfo(KFileMetaInfo&, unsigned int)':
: undefined reference to `TagLib::MPEG::File::audioProperties() const'
.libs/kfile_mp3.o(.text+0x2665): In function `KMp3Plugin::readInfo(KFileMetaInfo&, unsigned int)':
: undefined reference to `TagLib::MPEG::File::audioProperties() const'
.libs/kfile_mp3.o(.text+0x26e2): In function `KMp3Plugin::readInfo(KFileMetaInfo&, unsigned int)':
: undefined reference to `TagLib::MPEG::File::audioProperties() const'
.libs/kfile_mp3.o(.text+0x26ea): In function `KMp3Plugin::readInfo(KFileMetaInfo&, unsigned int)':
: undefined reference to `TagLib::MPEG::Properties::isCopyrighted() const'
.libs/kfile_mp3.o(.text+0x2768): In function `KMp3Plugin::readInfo(KFileMetaInfo&, unsigned int)':
: undefined reference to `TagLib::MPEG::File::audioProperties() const'
.libs/kfile_mp3.o(.text+0x2770): In function `KMp3Plugin::readInfo(KFileMetaInfo&, unsigned int)':
: undefined reference to `TagLib::MPEG::Properties::isOriginal() const'
.libs/kfile_mp3.o(.text+0x27ee): In function `KMp3Plugin::readInfo(KFileMetaInfo&, unsigned int)':
: undefined reference to `TagLib::MPEG::File::audioProperties() const'
.libs/kfile_mp3.o(.text+0x2c60): In function `KMp3Plugin::writeInfo(KFileMetaInfo const&) const':
: undefined reference to `TagLib::MPEG::File::File(char const*, bool, TagLib::AudioProperties::ReadStyle)'
.libs/kfile_mp3.o(.text+0x2c94): In function `KMp3Plugin::writeInfo(KFileMetaInfo const&) const':
: undefined reference to `TagLib::File::isOpen() const'
.libs/kfile_mp3.o(.text+0x2ca0): In function `KMp3Plugin::writeInfo(KFileMetaInfo const&) const':
: undefined reference to `TagLib::File::name() const'
.libs/kfile_mp3.o(.text+0x2ca8): In function `KMp3Plugin::writeInfo(KFileMetaInfo const&) const':
: undefined reference to `TagLib::File::isWritable(char const*)'
.libs/kfile_mp3.o(.text+0x2cf4): In function `KMp3Plugin::writeInfo(KFileMetaInfo const&) const':
: undefined reference to `TagLib::MPEG::File::~File()'
.libs/kfile_mp3.o(.text+0x2df5): In function `KMp3Plugin::writeInfo(KFileMetaInfo const&) const':
: undefined reference to `TagLib::String::String(char const*, TagLib::String::Type)'
.libs/kfile_mp3.o(.text+0x2e94): In function `KMp3Plugin::writeInfo(KFileMetaInfo const&) const':
: undefined reference to `TagLib::MPEG::File::tag() const'
.libs/kfile_mp3.o(.text+0x2eb4): In function `KMp3Plugin::writeInfo(KFileMetaInfo const&) const':
: undefined reference to `TagLib::String::~String()'
.libs/kfile_mp3.o(.text+0x2f81): In function `KMp3Plugin::writeInfo(KFileMetaInfo const&) const':
: undefined reference to `TagLib::String::String(char const*, TagLib::String::Type)'
.libs/kfile_mp3.o(.text+0x3024): In function `KMp3Plugin::writeInfo(KFileMetaInfo const&) const':
: undefined reference to `TagLib::MPEG::File::tag() const'
.libs/kfile_mp3.o(.text+0x3044): In function `KMp3Plugin::writeInfo(KFileMetaInfo const&) const':
: undefined reference to `TagLib::String::~String()'
.libs/kfile_mp3.o(.text+0x3111): In function `KMp3Plugin::writeInfo(KFileMetaInfo const&) const':
: undefined reference to `TagLib::String::String(char const*, TagLib::String::Type)'
.libs/kfile_mp3.o(.text+0x31b4): In function `KMp3Plugin::writeInfo(KFileMetaInfo const&) const':
: undefined reference to `TagLib::MPEG::File::tag() const'
.libs/kfile_mp3.o(.text+0x31d4): In function `KMp3Plugin::writeInfo(KFileMetaInfo const&) const':
: undefined reference to `TagLib::String::~String()'
.libs/kfile_mp3.o(.text+0x32e4): In function `KMp3Plugin::writeInfo(KFileMetaInfo const&) const':
: undefined reference to `TagLib::MPEG::File::tag() const'
.libs/kfile_mp3.o(.text+0x33c3): In function `KMp3Plugin::writeInfo(KFileMetaInfo const&) const':
: undefined reference to `TagLib::String::String(char const*, TagLib::String::Type)'
.libs/kfile_mp3.o(.text+0x3464): In function `KMp3Plugin::writeInfo(KFileMetaInfo const&) const':
: undefined reference to `TagLib::MPEG::File::tag() const'
.libs/kfile_mp3.o(.text+0x3484): In function `KMp3Plugin::writeInfo(KFileMetaInfo const&) const':
: undefined reference to `TagLib::String::~String()'
.libs/kfile_mp3.o(.text+0x3594): In function `KMp3Plugin::writeInfo(KFileMetaInfo const&) const':
: undefined reference to `TagLib::MPEG::File::tag() const'
.libs/kfile_mp3.o(.text+0x3673): In function `KMp3Plugin::writeInfo(KFileMetaInfo const&) const':
: undefined reference to `TagLib::String::String(char const*, TagLib::String::Type)'
.libs/kfile_mp3.o(.text+0x3714): In function `KMp3Plugin::writeInfo(KFileMetaInfo const&) const':
: undefined reference to `TagLib::MPEG::File::tag() const'
.libs/kfile_mp3.o(.text+0x3734): In function `KMp3Plugin::writeInfo(KFileMetaInfo const&) const':
: undefined reference to `TagLib::String::~String()'
.libs/kfile_mp3.o(.text+0x373c): In function `KMp3Plugin::writeInfo(KFileMetaInfo const&) const':
: undefined reference to `TagLib::MPEG::File::save()'
.libs/kfile_mp3.o(.text+0x3744): In function `KMp3Plugin::writeInfo(KFileMetaInfo const&) const':
: undefined reference to `TagLib::MPEG::File::~File()'
.libs/kfile_mp3.o(.text+0x3ab9): In function `KMp3Plugin::createValidator(QString const&, QString const&, QString const&, QObject*, char const*) const':
: undefined reference to `TagLib::ID3v1::genreList()'
.libs/kfile_mp3.o(.text+0x3b30): In function `KMp3Plugin::createValidator(QString const&, QString const&, QString const&, QObject*, char const*) const':
: undefined reference to `TagLib::String::toCString(bool) const'
.libs/kfile_mp3.o(.text+0x3c0f): In function `KMp3Plugin::createValidator(QString const&, QString const&, QString const&, QObject*, char const*) const':
: undefined reference to `TagLib::StringList::~StringList()'
.libs/kfile_mp3.o(.gnu.linkonce.t._ZN6TagLib4ListINS_6StringEE6detachEv+0xae): In function `TagLib::List<TagLib::String>::detach()':
: undefined reference to `TagLib::String::String(TagLib::String const&)'
collect2: ld returned 1 exit status
make[3]: *** [kfile_mp3.la] Fehler 1
make[3]: Leaving directory `/var/tmp/portage/kdemultimedia-kfile-plugins-3.4.0_rc1/work/kdemultimedia-kfile-plugins-3.4.0_rc1/kfile-plugins/mp3'
make[2]: *** [all-recursive] Fehler 1
make[2]: Leaving directory `/var/tmp/portage/kdemultimedia-kfile-plugins-3.4.0_rc1/work/kdemultimedia-kfile-plugins-3.4.0_rc1/kfile-plugins'
make[1]: *** [all-recursive] Fehler 1
make[1]: Leaving directory `/var/tmp/portage/kdemultimedia-kfile-plugins-3.4.0_rc1/work/kdemultimedia-kfile-plugins-3.4.0_rc1'
make: *** [all] Fehler 2

!!! ERROR: kde-base/kdemultimedia-kfile-plugins-3.4.0_rc1 failed.
!!! Function kde_src_compile, Line 166, Exitcode 2
!!! died running emake, kde_src_compile:make


2. app-pda/pilot-link-0.11.8
Code:
/bin/sh ../libtool --mode=link g++  -O3 -fweb -frename-registers -march=pentium-m -pipe -mtune=pentium-m -fforce-addr -momit-leaf-frame-pointer -fomit-frame-pointer -ftracer -funroll-loops -falign-functions -fmerge-all-constants -mfpmath=sse -maccumulate-outgoing-args -fprefetch-loop-arrays -fvisibility-inlines-hidden -fvisibility=hidden -Wno-deprecated -Wl,-O1 -o ccexample  ccexample.o ../libpisock++/libpisock++.la               ../libpisock/libpisock.la -lncurses  -lreadline
mkdir .libs
g++ -O3 -fweb -frename-registers -march=pentium-m -pipe -mtune=pentium-m -fforce-addr -momit-leaf-frame-pointer -fomit-frame-pointer -ftracer -funroll-loops -falign-functions -fmerge-all-constants -mfpmath=sse -maccumulate-outgoing-args -fprefetch-loop-arrays -fvisibility-inlines-hidden -fvisibility=hidden -Wno-deprecated -Wl,-O1 -o .libs/ccexample ccexample.o  ../libpisock++/.libs/libpisock++.so /var/tmp/portage/pilot-link-0.11.8/work/pilot-link-0.11.8/libpisock/.libs/libpisock.so -L/usr/lib ../libpisock/.libs/libpisock.so -lncurses -lreadline
ccexample.o(.text+0x807): In function `datebook(pi_file*)':
: undefined reference to `appointmentAppInfo_t::appointmentAppInfo_t(void*)'
ccexample.o(.text+0x80f): In function `datebook(pi_file*)':
: undefined reference to `appointmentAppInfo_t::pack()'
ccexample.o(.text+0x850): In function `datebook(pi_file*)':
: undefined reference to `vtable for appointment_t'
ccexample.o(.text+0x864): In function `datebook(pi_file*)':
: undefined reference to `appointment_t::blank()'
ccexample.o(.text+0x95e): In function `datebook(pi_file*)':
: undefined reference to `appointment_t::unpack(void*)'
ccexample.o(.text+0xc46): In function `datebook(pi_file*)':
: undefined reference to `appointment_t::~appointment_t()'
ccexample.o(.text+0xca4): In function `datebook(pi_file*)':
: undefined reference to `appointment_t::~appointment_t()'
ccexample.o(.text+0xdc7): In function `todos(pi_file*)':
: undefined reference to `todoAppInfo_t::todoAppInfo_t(void*)'
ccexample.o(.text+0xdd5): In function `todos(pi_file*)':
: undefined reference to `todoAppInfo_t::pack()'
ccexample.o(.text+0xe3a): In function `todos(pi_file*)':
: undefined reference to `vtable for todo_t'
ccexample.o(.text+0xf37): In function `todos(pi_file*)':
: undefined reference to `vtable for todo_t'
ccexample.o(.text+0xfcf): In function `todos(pi_file*)':
: undefined reference to `vtable for todo_t'
ccexample.o(.text+0x1011): In function `todos(pi_file*)':
: undefined reference to `vtable for todo_t'
ccexample.o(.text+0x1071): In function `todos(pi_file*)':
: undefined reference to `todo_t::unpack(void*)'
ccexample.o(.text+0x1089): In function `todos(pi_file*)':
: undefined reference to `appInfo_t::category(int)'
ccexample.o(.text+0x11fd): In function `todos(pi_file*)':
: undefined reference to `todo_t::pack(int*)'
ccexample.o(.text+0x1236): In function `todos(pi_file*)':
: undefined reference to `todo_t::pack(void*, int*)'
ccexample.o(.text+0x13a7): In function `memos(pi_file*)':
: undefined reference to `appInfo_t::appInfo_t(void const*)'
ccexample.o(.text+0x13cc): In function `memos(pi_file*)':
: undefined reference to `appInfo_t::baseAppInfoPack(unsigned char*)'
ccexample.o(.text+0x142f): In function `memos(pi_file*)':
: undefined reference to `vtable for memo_t'
ccexample.o(.text+0x158f): In function `memos(pi_file*)':
: undefined reference to `vtable for memo_t'
ccexample.o(.text+0x160f): In function `memos(pi_file*)':
: undefined reference to `memo_t::unpack(void*)'
ccexample.o(.text+0x168f): In function `memos(pi_file*)':
: undefined reference to `memo_t::pack(int*)'
ccexample.o(.text+0x16bd): In function `memos(pi_file*)':
: undefined reference to `memo_t::pack(void*, int*)'
ccexample.o(.text+0x1733): In function `memos(pi_file*)':
: undefined reference to `vtable for memo_t'
ccexample.o(.text+0x174b): In function `memos(pi_file*)':
: undefined reference to `vtable for memo_t'
ccexample.o(.text+0x17ce): In function `printCategoryNames(appInfo_t&)':
: undefined reference to `appInfo_t::category(int)'
ccexample.o(.text+0x18a9): In function `addresses(pi_file*)':
: undefined reference to `addressAppInfo_t::addressAppInfo_t(void*)'
ccexample.o(.text+0x18c8): In function `addresses(pi_file*)':
: undefined reference to `appInfo_t::category(int)'
ccexample.o(.text+0x1944): In function `addresses(pi_file*)':
: undefined reference to `addressAppInfo_t::pack()'
ccexample.o(.text+0x1975): In function `addresses(pi_file*)':
: undefined reference to `address_t::address_t()'
ccexample.o(.text+0x19eb): In function `addresses(pi_file*)':
: undefined reference to `address_t::~address_t()'
ccexample.o(.text+0x1a26): In function `addresses(pi_file*)':
: undefined reference to `address_t::unpack(void*)'
ccexample.o(.text+0x1a38): In function `addresses(pi_file*)':
: undefined reference to `appInfo_t::category(int)'
ccexample.o(.text+0x1a77): In function `addresses(pi_file*)':
: undefined reference to `address_t::entry(address_t::labelTypes_t)'
ccexample.o(.text+0x1ac8): In function `addresses(pi_file*)':
: undefined reference to `address_t::entry(address_t::labelTypes_t)'
ccexample.o(.text+0x1b21): In function `addresses(pi_file*)':
: undefined reference to `address_t::pack(int*)'
ccexample.o(.text+0x1b5a): In function `addresses(pi_file*)':
: undefined reference to `address_t::pack(void*, int*)'
ccexample.o(.text+0x1c08): In function `addresses(pi_file*)':
: undefined reference to `address_t::~address_t()'
ccexample.o(.text+0x1c5c): In function `addresses(pi_file*)':
: undefined reference to `address_t::~address_t()'
ccexample.o(.gnu.linkonce.t._ZN13memoAppInfo_t4packEv+0x20): In function `memoAppInfo_t::pack()':
: undefined reference to `appInfo_t::baseAppInfoPack(unsigned char*)'
collect2: ld returned 1 exit status
make[3]: *** [ccexample] Fehler 1
make[3]: Leaving directory `/var/tmp/portage/pilot-link-0.11.8/work/pilot-link-0.11.8/src'
make[2]: *** [all-recursive] Fehler 1
make[2]: Leaving directory `/var/tmp/portage/pilot-link-0.11.8/work/pilot-link-0.11.8/src'
make[1]: *** [all-recursive] Fehler 1
make[1]: Leaving directory `/var/tmp/portage/pilot-link-0.11.8/work/pilot-link-0.11.8'
make: *** [all-recursive-am] Fehler 2

!!! ERROR: app-pda/pilot-link-0.11.8 failed.
!!! Function src_compile, Line 57, Exitcode 2
!!! (no error message)


3. kde-base/kooka-3.4.0_rc1:
Code:
kookaimage.cpp:224: Warnung: nicht benutzter Parameter »filename«
kookaimage.cpp:224: Warnung: nicht benutzter Parameter »no«
/bin/sh ../libtool --silent --mode=link --tag=CXX i686-pc-linux-gnu-g++  -Wnon-virtual-dtor -Wno-long-long -Wundef -ansi -D_XOPEN_SOURCE=500 -D_BSD_SOURCE -Wcast-align -Wconversion -Wchar-subscripts -Wall -W -Wpointer-arith -Wwrite-strings -DNDEBUG -DNO_DEBUG -O2 -O3 -fweb -frename-registers -march=pentium-m -pipe -mtune=pentium-m -fforce-addr -momit-leaf-frame-pointer -fomit-frame-pointer -ftracer -funroll-loops -falign-functions -fmerge-all-constants -mfpmath=sse -maccumulate-outgoing-args -fprefetch-loop-arrays -fvisibility-inlines-hidden -fvisibility=hidden -Wformat-security -Wmissing-format-attribute -fno-exceptions -fno-check-new -fno-common -DQT_CLEAN_NAMESPACE -DQT_NO_ASCII_CAST -DQT_NO_STL -DQT_NO_COMPAT -DQT_NO_TRANSLATION   -Wl,-O1 -o kooka -R /usr/kde/3.4/lib -R /usr/kde/3.4/lib -R /usr/qt/3/lib -R /usr/lib -L/usr/kde/3.4/lib -L/usr/qt/3/lib -L/usr/lib    kooka.all_cpp.o  -lkio -lkdeprint -lktexteditor  ../libkscan/libkscan.la  -lkspell
kooka.all_cpp.o(.text+0xdbe): In function `KookaView::slOCRResultImage(QPixmap const&)':
: undefined reference to `ImageCanvas::newImage(QImage*)'
kooka.all_cpp.o(.text+0xdcd): In function `KookaView::slOCRResultImage(QPixmap const&)':
: undefined reference to `ImageCanvas::setReadOnly(bool)'
kooka.all_cpp.o(.text+0xdea): In function `KookaView::slOCRResultImage(QPixmap const&)':
: undefined reference to `ImageCanvas::newImage(QImage*)'
kooka.all_cpp.o(.text+0xf68): In function `KookaView::slCloseScanDevice()':
: undefined reference to `KScanDevice::slCloseDevice()'
kooka.all_cpp.o(.text+0xfa7): In function `KookaView::slCloseScanDevice()':
: undefined reference to `KScanDevice::slCloseDevice()'
kooka.all_cpp.o(.text+0x12dc): In function `KookaView::slUnloadAImage(KookaImage*)':
: undefined reference to `ImageCanvas::newImage(QImage*)'
kooka.all_cpp.o(.text+0x90f6): In function `ScanPackager::openRoots()':
: undefined reference to `Previewer::galleryRoot()'
kooka.all_cpp.o(.text+0x1957c): In function `ImgSaver::ImgSaver(QWidget*)':
: undefined reference to `Previewer::galleryRoot()'
kooka.all_cpp.o(.text+0x1970c): In function `ImgSaver::ImgSaver(QWidget*)':
: undefined reference to `Previewer::galleryRoot()'
kooka.all_cpp.o(.text+0x19934): In function `ImgSaver::ImgSaver(QWidget*, KURL)':
: undefined reference to `Previewer::galleryRoot()'
kooka.all_cpp.o(.text+0x19c24): In function `ImgSaver::ImgSaver(QWidget*, KURL)':
: undefined reference to `Previewer::galleryRoot()'
kooka.all_cpp.o(.text+0x1ddb2): In function `KookaView::updateCurrImage(QImage&)':
: undefined reference to `ImageCanvas::readOnly()'
kooka.all_cpp.o(.text+0x1e0bf): In function `KookaView::slMirrorImage(KookaView::MirrorType)':
: undefined reference to `ImageCanvas::rootImage()'
kooka.all_cpp.o(.text+0x2019f): In function `KookaView::slShowAImage(KookaImage*)':
: undefined reference to `ImageCanvas::newImage(QImage*)'
kooka.all_cpp.o(.text+0x201b0): In function `KookaView::slShowAImage(KookaImage*)':
: undefined reference to `ImageCanvas::setReadOnly(bool)'
kooka.all_cpp.o(.text+0x201fd): In function `KookaView::slShowAImage(KookaImage*)':
: undefined reference to `ImageCanvas::imageInfoString(int, int, int)'
kooka.all_cpp.o(.text+0x2070b): In function `KSANEOCR::slSpellDead()':
: undefined reference to `ImageCanvas::removeHighlight(int)'
kooka.all_cpp.o(.text+0x209b1): In function `KookaView::userDeviceSelection() const':
: undefined reference to `KScanDevice::getScannerName(QCString const&) const'
kooka.all_cpp.o(.text+0x20a3a): In function `KookaView::userDeviceSelection() const':
: undefined reference to `DeviceSelector::DeviceSelector(QWidget*, QStrList&, QStringList const&)'
kooka.all_cpp.o(.text+0x20a46): In function `KookaView::userDeviceSelection() const':
: undefined reference to `DeviceSelector::getDeviceFromConfig() const'
kooka.all_cpp.o(.text+0x20a9b): In function `KookaView::userDeviceSelection() const':
: undefined reference to `DeviceSelector::getSelectedDevice() const'
kooka.all_cpp.o(.text+0x20abd): In function `KookaView::userDeviceSelection() const':
: undefined reference to `DeviceSelector::~DeviceSelector()'
kooka.all_cpp.o(.text+0x20c3a): In function `KookaView::slSelectDevice(QCString const&)':
: undefined reference to `ScanParams::ScanParams(QWidget*, char const*)'
kooka.all_cpp.o(.text+0x20c6f): In function `KookaView::slSelectDevice(QCString const&)':
: undefined reference to `KScanDevice::openDevice(QCString const&)'
kooka.all_cpp.o(.text+0x20cad): In function `KookaView::slSelectDevice(QCString const&)':
: undefined reference to `ScanParams::connectDevice(KScanDevice*)'
kooka.all_cpp.o(.text+0x20d41): In function `KookaView::slSelectDevice(QCString const&)':
: undefined reference to `ScanParams::connectDevice(KScanDevice*)'
kooka.all_cpp.o(.text+0x20d6d): In function `KookaView::slSelectDevice(QCString const&)':
: undefined reference to `ScanParams::connectDevice(KScanDevice*)'
kooka.all_cpp.o(.text+0x20e41): In function `KookaView::slSelectDevice(QCString const&)':
: undefined reference to `KScanDevice::loadPreviewImage()'
kooka.all_cpp.o(.text+0x20e53): In function `KookaView::slSelectDevice(QCString const&)':
: undefined reference to `Previewer::setPreviewImage(QImage const&)'
kooka.all_cpp.o(.text+0x20e6d): In function `KookaView::slSelectDevice(QCString const&)':
: undefined reference to `Previewer::slConnectScanner(KScanDevice*)'
kooka.all_cpp.o(.text+0x210f5): In function `KookaView::KookaView(KParts::DockMainWindow*, QCString const&)':
: undefined reference to `ImageCanvas::ImageCanvas(QWidget*, QImage const*, char const*)'
kooka.all_cpp.o(.text+0x2112e): In function `KookaView::KookaView(KParts::DockMainWindow*, QCString const&)':
: undefined reference to `ImageCanvas::enableContextMenu(bool)'
kooka.all_cpp.o(.text+0x21b18): In function `KookaView::KookaView(KParts::DockMainWindow*, QCString const&)':
: undefined reference to `KScanDevice::KScanDevice(QObject*)'
kooka.all_cpp.o(.text+0x21d34): In function `KookaView::KookaView(KParts::DockMainWindow*, QCString const&)':
: undefined reference to `Previewer::Previewer(QWidget*, char const*)'
kooka.all_cpp.o(.text+0x22170): In function `KookaView::KookaView(KParts::DockMainWindow*, QCString const&)':
: undefined reference to `ImageCanvas::imageInfoString(int, int, int)'
kooka.all_cpp.o(.text+0x22209): In function `KookaView::KookaView(KParts::DockMainWindow*, QCString const&)':
: undefined reference to `ImageCanvas::imageInfoString(int, int, int)'
kooka.all_cpp.o(.text+0x231a5): In function `KookaView::KookaView(KParts::DockMainWindow*, QCString const&)':
: undefined reference to `ImageCanvas::ImageCanvas(QWidget*, QImage const*, char const*)'
kooka.all_cpp.o(.text+0x231de): In function `KookaView::KookaView(KParts::DockMainWindow*, QCString const&)':
: undefined reference to `ImageCanvas::enableContextMenu(bool)'
kooka.all_cpp.o(.text+0x23bc8): In function `KookaView::KookaView(KParts::DockMainWindow*, QCString const&)':
: undefined reference to `KScanDevice::KScanDevice(QObject*)'
kooka.all_cpp.o(.text+0x23de4): In function `KookaView::KookaView(KParts::DockMainWindow*, QCString const&)':
: undefined reference to `Previewer::Previewer(QWidget*, char const*)'
kooka.all_cpp.o(.text+0x24220): In function `KookaView::KookaView(KParts::DockMainWindow*, QCString const&)':
: undefined reference to `ImageCanvas::imageInfoString(int, int, int)'
kooka.all_cpp.o(.text+0x242b9): In function `KookaView::KookaView(KParts::DockMainWindow*, QCString const&)':
: undefined reference to `ImageCanvas::imageInfoString(int, int, int)'
kooka.all_cpp.o(.text+0x25805): In function `KGOCRDialog::setupGui()':
: undefined reference to `KScanSlider::KScanSlider(QWidget*, QString const&, double, double, bool, int)'
kooka.all_cpp.o(.text+0x2585b): In function `KGOCRDialog::setupGui()':
: undefined reference to `KScanSlider::slSetSlider(int)'
kooka.all_cpp.o(.text+0x2590b): In function `KGOCRDialog::setupGui()':
: undefined reference to `KScanSlider::KScanSlider(QWidget*, QString const&, double, double, bool, int)'
kooka.all_cpp.o(.text+0x2596e): In function `KGOCRDialog::setupGui()':
: undefined reference to `KScanSlider::slSetSlider(int)'
kooka.all_cpp.o(.text+0x25a18): In function `KGOCRDialog::setupGui()':
: undefined reference to `KScanSlider::KScanSlider(QWidget*, QString const&, double, double, bool, int)'
kooka.all_cpp.o(.text+0x25a6d): In function `KGOCRDialog::setupGui()':
: undefined reference to `KScanSlider::slSetSlider(int)'
kooka.all_cpp.o(.text+0x296a9): In function `KookaView::doOCRonSelection()':
: undefined reference to `ImageCanvas::selectedImage(QImage*)'
kooka.all_cpp.o(.text+0x2b95d): In function `KSANEOCR::slSpellIgnoreWord(QString const&)':
: undefined reference to `ImageCanvas::removeHighlight(int)'
kooka.all_cpp.o(.text+0x2ba3e): In function `KSANEOCR::slSpellIgnoreWord(QString const&)':
: undefined reference to `ImageCanvas::highlight(QRect const&, QPen const&, QBrush const&, bool)'
kooka.all_cpp.o(.text+0x2c3b1): In function `KSANEOCR::eventFilter(QObject*, QEvent*)':
: undefined reference to `ImageCanvas::getScaleFactor() const'
kooka.all_cpp.o(.text+0x2c9e0): In function `KSANEOCR::finishedOCRVisible(bool)':
: undefined reference to `ImageCanvas::newImageHoldZoom(QImage*)'
kooka.all_cpp.o(.text+0x2c9f7): In function `KSANEOCR::finishedOCRVisible(bool)':
: undefined reference to `ImageCanvas::setReadOnly(bool)'
kooka.all_cpp.o(.text+0x2ce4b): In function `KSANEOCR::slSpellCorrected(QString const&, QString const&, unsigned int)':
: undefined reference to `ImageCanvas::removeHighlight(int)'
kooka.all_cpp.o(.text+0x2d35a): In function `KSANEOCR::slMisspelling(QString const&, QStringList const&, unsigned int)':
: undefined reference to `ImageCanvas::highlight(QRect const&, QPen const&, QBrush const&, bool)'
kooka.all_cpp.o(.text+0x34442): In function `KookaView::slCreateNewImgFromSelection()':
: undefined reference to `ImageCanvas::rootImage()'
kooka.all_cpp.o(.text+0x344d6): In function `KookaView::slCreateNewImgFromSelection()':
: undefined reference to `ImageCanvas::selectedImage(QImage*)'
kooka.all_cpp.o(.text+0x3467d): In function `KookaView::slNewImageScanned(QImage*, ImgScanInfo*)':
: undefined reference to `ImgScanInfo::getXResolution()'
kooka.all_cpp.o(.text+0x34687): In function `KookaView::slNewImageScanned(QImage*, ImgScanInfo*)':
: undefined reference to `ImgScanInfo::getYResolution()'
kooka.all_cpp.o(.text+0x348ea): In function `KookaView::qt_invoke(int, QUObject*)':
: undefined reference to `ImgScanInfo::getXResolution()'
kooka.all_cpp.o(.text+0x348fa): In function `KookaView::qt_invoke(int, QUObject*)':
: undefined reference to `ImgScanInfo::getYResolution()'
kooka.all_cpp.o(.text+0x34936): In function `KookaView::qt_invoke(int, QUObject*)':
: undefined reference to `ImageCanvas::newImage(QImage*)'
kooka.all_cpp.o(.text+0x34b36): In function `KookaView::qt_invoke(int, QUObject*)':
: undefined reference to `ImageCanvas::handle_popup(int)'
kooka.all_cpp.o(.text+0x34bc7): In function `KookaView::qt_invoke(int, QUObject*)':
: undefined reference to `ScanParams::slStartScan()'
kooka.all_cpp.o(.text+0x34bdf): In function `KookaView::qt_invoke(int, QUObject*)':
: undefined reference to `ScanParams::slAcquirePreview()'
kooka.all_cpp.o(.text+0x34c7f): In function `KookaView::qt_invoke(int, QUObject*)':
: undefined reference to `ImageCanvas::selectedImage(QImage*)'
kooka.all_cpp.o(.text+0x34df8): In function `KookaView::qt_invoke(int, QUObject*)':
: undefined reference to `Previewer::newImage(QImage*)'
kooka.all_cpp.o(.text+0xc9f): In function `KookaView::slNewPreview(QImage*, ImgScanInfo*)':
: undefined reference to `Previewer::newImage(QImage*)'
kooka.all_cpp.o(.text+0xcce): In function `KookaView::slNewPreview(QImage*, ImgScanInfo*)':
: undefined reference to `Previewer::newImage(QImage*)'
collect2: ld returned 1 exit status
make[3]: *** [kooka] Fehler 1
make[3]: Leaving directory `/var/tmp/portage/kooka-3.4.0_rc1/work/kooka-3.4.0_rc1/kooka'
make[2]: *** [all-recursive] Fehler 1
make[2]: Leaving directory `/var/tmp/portage/kooka-3.4.0_rc1/work/kooka-3.4.0_rc1/kooka'
make[1]: *** [all-recursive] Fehler 1
make[1]: Leaving directory `/var/tmp/portage/kooka-3.4.0_rc1/work/kooka-3.4.0_rc1'
make: *** [all] Fehler 2

!!! ERROR: kde-base/kooka-3.4.0_rc1 failed.
!!! Function kde_src_compile, Line 166, Exitcode 2
!!! died running emake, kde_src_compile:make


These problems have nothing to do with CFLAGS/CXXFLAGS/LDFLAGS, I already tried a minimal & save set of flags, but the errors stay the same.

Anyone any idea, what the problem could be?
_________________
Las torturas mentales de la CIA
Back to top
View user's profile Send private message
unixpenguin2004
n00b
n00b


Joined: 18 Dec 2004
Posts: 46
Location: Southern California

PostPosted: Tue Mar 01, 2005 3:17 pm    Post subject: Unstable/Masked Reply with quote

Right now KDE 3.4.0 RC1 and both betas are masked. Give it a week and resync it and it should work. There's still some Gentoo specific bugs in it.
_________________
Compaq Proliant 8500R (7U Rackmount Form)
4x 550MHz Intel Pentium III (2MB L2)
1GB PC-100 SD-Ram
Compaq SmartArray RAID Controller
Compaq Dual 10/100 Ethernet
18.2GB Compaq Ultra2 Hotplug SCSI
Gentoo 2005.0 1.4.16 (Vanilla 2.6.11.9)
Back to top
View user's profile Send private message
Master One
l33t
l33t


Joined: 25 Aug 2003
Posts: 754
Location: Austria

PostPosted: Tue Mar 01, 2005 3:34 pm    Post subject: Re: Unstable/Masked Reply with quote

unixpenguin2004 wrote:
Right now KDE 3.4.0 RC1 and both betas are masked. Give it a week and resync it and it should work. There's still some Gentoo specific bugs in it.

I know, but others seem not to have experienced these problems. I am still searching for a better solution than to wait.

I assume it has something to do with installed libs. I already re-emerged kdelibs, imlib, imlib2, and libtool, but that didn't change anything.

The weird thing is, I could not find any info on a similar problem at all in this forum (nor in bugs.gentoo.org and bugs.kde.org).

At the moment, I am pretty lost here, because this way I am unable to emerge

kdemultimedia-meta
kdepim-meta
kdegraphics-meta
_________________
Las torturas mentales de la CIA
Back to top
View user's profile Send private message
MasterX
Veteran
Veteran


Joined: 26 Jun 2003
Posts: 1165

PostPosted: Tue Mar 01, 2005 3:44 pm    Post subject: Reply with quote

A shot in the dark. About the first problem it seems to me that you are missing Taglib. Have you emerged it?
The other two problems look like they are due to a broken library. What version of gcc do you have?
Maybe, you need to open a bug report in KDE
Back to top
View user's profile Send private message
unixpenguin2004
n00b
n00b


Joined: 18 Dec 2004
Posts: 46
Location: Southern California

PostPosted: Tue Mar 01, 2005 3:47 pm    Post subject: Patience is a virtue Reply with quote

I know Gentoo is all about being cutting-edge and all, but give it a few days before you go head first into a brick wall trying to get things that don't work yet working.
_________________
Compaq Proliant 8500R (7U Rackmount Form)
4x 550MHz Intel Pentium III (2MB L2)
1GB PC-100 SD-Ram
Compaq SmartArray RAID Controller
Compaq Dual 10/100 Ethernet
18.2GB Compaq Ultra2 Hotplug SCSI
Gentoo 2005.0 1.4.16 (Vanilla 2.6.11.9)
Back to top
View user's profile Send private message
Master One
l33t
l33t


Joined: 25 Aug 2003
Posts: 754
Location: Austria

PostPosted: Tue Mar 01, 2005 4:08 pm    Post subject: Reply with quote

MasterX wrote:
A shot in the dark. About the first problem it seems to me that you are missing Taglib. Have you emerged it?

taglib-1.3.1 is installed, I just re-emerged it, but no change.

MasterX wrote:
The other two problems look like they are due to a broken library. What version of gcc do you have?

gcc-3.4.3-20050110
MasterX wrote:
Maybe, you need to open a bug report in KDE

I am still in the hope, to find the solution for this problem, to be able to continue the emerging. Since the error output does not show, what the problem could be (at least I can not see anything familiar in it), it would be pretty hard to file a bug.
_________________
Las torturas mentales de la CIA
Back to top
View user's profile Send private message
Master One
l33t
l33t


Joined: 25 Aug 2003
Posts: 754
Location: Austria

PostPosted: Tue Mar 01, 2005 4:10 pm    Post subject: Re: Patience is a virtue Reply with quote

unixpenguin2004 wrote:
I know Gentoo is all about being cutting-edge and all, but give it a few days before you go head first into a brick wall trying to get things that don't work yet working.

It would be no problem for me, to wait, if others encounter the same problems like me, so if it would be a known bug, but since there is noone else reporting anything concerning this matter, it would not make sense to sit back and wait for something, that's not going to happen by itself...
_________________
Las torturas mentales de la CIA
Back to top
View user's profile Send private message
MasterX
Veteran
Veteran


Joined: 26 Jun 2003
Posts: 1165

PostPosted: Wed Mar 02, 2005 1:42 am    Post subject: Reply with quote

Master One wrote:

I am still in the hope, to find the solution for this problem, to be able to continue the emerging. Since the error output does not show, what the problem could be (at least I can not see anything familiar in it), it would be pretty hard to file a bug.

I think that the problems are related to the gcc. Take a look at this bug report http://bugs.kde.org/show_bug.cgi?id=80143
I searched the KDE bug database for gcc and all the reports that I found are related to gcc 3.4.*

The sad thing is that I want to emerge gcc 3.4.3 :x
Back to top
View user's profile Send private message
Trejkaz
Guru
Guru


Joined: 14 Nov 2002
Posts: 479
Location: Sydney, Australia

PostPosted: Wed Mar 02, 2005 2:16 am    Post subject: Reply with quote

There are still a few RC1 ebuilds completely missing from Portage (kde-base/kode is the one I've been waiting on the past 24 hours.)

While this is the case, I wouldn't put very high hopes on all the myriad of other ebuilds compiling cleanly.
Back to top
View user's profile Send private message
llsardonicll
Tux's lil' helper
Tux's lil' helper


Joined: 07 Oct 2004
Posts: 110

PostPosted: Wed Mar 02, 2005 5:39 am    Post subject: Reply with quote

I'm unable to emerge kdegraphics, kdemultimedia and kdeaddons. My kdepim, however, installed just fine. Same errors as you get, no clue as to what the problem is. Going to switch GCC versions later and see if that helps.

*switching GCC didn't help.
Back to top
View user's profile Send private message
younker
Apprentice
Apprentice


Joined: 18 Feb 2004
Posts: 273
Location: China

PostPosted: Wed Mar 02, 2005 7:28 am    Post subject: Re: Can't emerge certain KDE3.4.0_rc1 apps Reply with quote

Master One wrote:
Everything else worked out flawlessly, but some packages do not want to compile here, with similar errors.
Please have a look at the following three packages:

1. kde-base/kdemultimedia-kfile-plugins-3.4.0_rc1:[code]/bin/sh ../../libtool --silent --mode=link --tag=CXX i686-pc-linux-gnu-g++ -Wnon-virtual-dtor -Wno-long-long -Wundef -ansi -D_XOPEN_SOURCE=500 -D_BSD_SOURCE -Wcast-align -Wconversion -Wchar-subscripts -Wall -W -Wpointer-arith -Wwrite-strings -DNDEBUG -DNO_DEBUG -O2 -O3 -fweb -frename-registers -march=pentium-m -pipe -mtune=pentium-m -fforce-addr -momit-leaf-frame-pointer -fomit-frame-pointer -ftracer -funroll-loops -falign-functions -fmerge-all-constants -mfpmath=sse -maccumulate-outgoing-args -fprefetch-loop-arrays -fvisibility-inlines-hidden -fvisibility=hidden -Wformat-security -Wmissing-format-attribute -fno-exceptions -fno-check-new -fno-common -DQT_CLEAN_NAMESPACE -DQT_NO_ASCII_CAST -DQT_NO_STL -DQT_NO_COMPAT -DQT_NO_TRANSLATION -Wl,-O1 -o kfile_mp3.la -rpath /usr/kde/3.4/lib/kde3 -L/usr/kde/3.4/lib -L/usr/qt/3/lib -L/usr/lib -L/usr/lib -ltag -module -avoid-version -module -no-undefined -Wl,--no-undefined -Wl,--allow-shlib-undefined -R /usr/kde/3.4/lib -R /usr/kde/3.4/lib -R /usr/qt/3/lib -R /usr/lib kfile_mp3.lo -lkio

The problem is you use -fvisibility-inlines-hidden -fvisibility=hidden options to built these packages.
some packages in kde 3.4 rc1, can't be built with these options, anyway you can built arts, kdelibs, kdebase with these options.
Back to top
View user's profile Send private message
Master One
l33t
l33t


Joined: 25 Aug 2003
Posts: 754
Location: Austria

PostPosted: Wed Mar 02, 2005 10:11 am    Post subject: Reply with quote

MasterX wrote:
Master One wrote:

I am still in the hope, to find the solution for this problem, to be able to continue the emerging. Since the error output does not show, what the problem could be (at least I can not see anything familiar in it), it would be pretty hard to file a bug.

I think that the problems are related to the gcc. Take a look at this bug report http://bugs.kde.org/show_bug.cgi?id=80143
I searched the KDE bug database for gcc and all the reports that I found are related to gcc 3.4.* The sad thing is that I want to emerge gcc 3.4.3 :x

That came also to my mind, but I am not quite sure, how I can test, if it is gcc-3.4.3, that's causing those troubles with about 18 KDE3.4.0_rc1 packages (I am already through with compiling, I just used "emerge --resume --skipfirst" on every failure, so it's about 18 packages remaining, that I can not compile either due to compile-failure, or because the next package was depending on the previously failed one).

I really need gcc-3.4.3, because it's an IBM ThinkPad T42p with Pentium-M processor, and I really don't want to miss the possibility to use the "-march=pentium-m" flag.

Because gcc gets installed slotted, I am just upgrading 3.3.4 to 3.3.5-r1, and then I'll try to switch from 3.4.3 to 3.3.5 and restart the emerge of the missing packages (at least, that's the only thing that's left to try, I think).
_________________
Las torturas mentales de la CIA
Back to top
View user's profile Send private message
Master One
l33t
l33t


Joined: 25 Aug 2003
Posts: 754
Location: Austria

PostPosted: Wed Mar 02, 2005 10:13 am    Post subject: Reply with quote

Trejkaz wrote:
There are still a few RC1 ebuilds completely missing from Portage (kde-base/kode is the one I've been waiting on the past 24 hours.) While this is the case, I wouldn't put very high hopes on all the myriad of other ebuilds compiling cleanly.

I really do not think, that the mentioned problems are related to missing packages. Either version (beta2 / rc_1) simply has to compile, I also don't think, that it's about missing libs, so there is no reason to stick with that theory. In this case, waiting will not solve the problem.
_________________
Las torturas mentales de la CIA
Back to top
View user's profile Send private message
Master One
l33t
l33t


Joined: 25 Aug 2003
Posts: 754
Location: Austria

PostPosted: Wed Mar 02, 2005 10:14 am    Post subject: Reply with quote

llsardonicll wrote:
I'm unable to emerge kdegraphics, kdemultimedia and kdeaddons. My kdepim, however, installed just fine. Same errors as you get, no clue as to what the problem is. Going to switch GCC versions later and see if that helps. *switching GCC didn't help.

What versions of gcc did you switch, and which versions do you have installed?
_________________
Las torturas mentales de la CIA
Back to top
View user's profile Send private message
Master One
l33t
l33t


Joined: 25 Aug 2003
Posts: 754
Location: Austria

PostPosted: Wed Mar 02, 2005 10:25 am    Post subject: Re: Can't emerge certain KDE3.4.0_rc1 apps Reply with quote

younker wrote:
The problem is you use -fvisibility-inlines-hidden -fvisibility=hidden options to built these packages. some packages in kde 3.4 rc1, can't be built with these options, anyway you can built arts, kdelibs, kdebase with these options.

As already mentioned in my initial post, it's not a matter of flags. Of course I also tried those failing packages with a minimal and save stack of flags, but it lead to the exact same error.

BTW It's not only arts, kdelibs, kdebase, which deal well with "-fvisibility-inlines-hidden -fvisibility=hidden". None of the packages had problems with "fvisibility-inlines-hidden" at all, and only very few didn't like "-fvisibility=hidden".
_________________
Las torturas mentales de la CIA
Back to top
View user's profile Send private message
kimchi_sg
Advocate
Advocate


Joined: 26 Nov 2004
Posts: 2915
Location: Singapore

PostPosted: Wed Mar 02, 2005 3:46 pm    Post subject: Reply with quote

Have you tried re-compiling the toolchain with saner flags, then compiling KDE with the "saner" toolchain?

This is because of comments you wrote in the NPTL stage 1-on-3 support thread.
_________________
Murphy's Law of Gentoo installation: If a compile can fail, it will.

MacGillicuddy's Corollary: At the most inopportune time.

Please search and read the FAQs before posting.
Back to top
View user's profile Send private message
Master One
l33t
l33t


Joined: 25 Aug 2003
Posts: 754
Location: Austria

PostPosted: Wed Mar 02, 2005 4:45 pm    Post subject: Reply with quote

kimchi_sg wrote:
Have you tried re-compiling the toolchain with saner flags, then compiling KDE with the "saner" toolchain? This is because of comments you wrote in the NPTL stage 1-on-3 support thread.

No, didn't get that far. I already thought about the used "bleeding edge" flags, but it's really quite strange, because everthing else on that machine compiled just fine, except those ~ 18 KDE3.4.0_rc1 packages, which all are sort of "media" related.

What about your installation? Didn't you also use the full set of stacked flags for your installation? Did you already try to emerge KDE3.4.0_rc1?

I really like the used flags-selection, so I really would like to keep it, if possible.

For trying some "saner" flags on the KDE packages: Do you really think, it is necessary to recompile the whole toolkit? I mean, shouldn't it be enough, to just recompile gcc? Because recompiling the whole toolkit would not speek for the easy switching-possibility of the gcc-version to use with gcc-config.
_________________
Las torturas mentales de la CIA
Back to top
View user's profile Send private message
nightfrost
Apprentice
Apprentice


Joined: 07 Dec 2004
Posts: 293
Location: Sweden

PostPosted: Wed Mar 02, 2005 8:03 pm    Post subject: Reply with quote

Hey, I just have to jump into this thread as well; I have the same problem. I have also compiled my base system rather "edgy" (i.e. with the additional C#-flags)...
Back to top
View user's profile Send private message
Master One
l33t
l33t


Joined: 25 Aug 2003
Posts: 754
Location: Austria

PostPosted: Wed Mar 02, 2005 9:26 pm    Post subject: Reply with quote

nightfrost wrote:
Hey, I just have to jump into this thread as well; I have the same problem. I have also compiled my base system rather "edgy" (i.e. with the additional C#-flags)...

I'm still searching for more info on that issue. Until now, noone could confirm, that it's not possible to compile KDE3.4.0_rc1 with gcc-3.4.3-20050110, so I am still unsure, if it is my compile-flags-selection, or simply gcc-3.4.3-20050110 itself.

If it's 3.4.3-20050110 itself, causing those troubles (or the other way: if it's KDE3.4.0_rc1 causing those troubles with gcc-3.4.3-20050110), shouldn't it be possible, to switch to 3.3.5-r1 or 3.3.4 (just using gcc-config, to whatever version else is installed on your system), and to compile the remaining ~18 packages with that compiler-version?
_________________
Las torturas mentales de la CIA
Back to top
View user's profile Send private message
nightfrost
Apprentice
Apprentice


Joined: 07 Dec 2004
Posts: 293
Location: Sweden

PostPosted: Wed Mar 02, 2005 9:47 pm    Post subject: Reply with quote

I just recompiled the toolchain with really plain flags, and am now emerging kdemultimedia. I'll post back when that's done. Have you tried fix_libtool_files.sh? When I ran that after the re-emerge, I came to think that I might have missed out on that last time...

Quote:
If it's 3.4.3-20050110 itself, causing those troubles (or the other way: if it's KDE3.4.0_rc1 causing those troubles with gcc-3.4.3-20050110), shouldn't it be possible, to switch to 3.3.5-r1 or 3.3.4 (just using gcc-config, to whatever version else is installed on your system), and to compile the remaining ~18 packages with that compiler-version?


Sounds like this would be very possible, but it doesn't feel koscher at all...
Back to top
View user's profile Send private message
nightfrost
Apprentice
Apprentice


Joined: 07 Dec 2004
Posts: 293
Location: Sweden

PostPosted: Wed Mar 02, 2005 9:58 pm    Post subject: Reply with quote

Recompiled with my normal flags. Failed again, but this time with a slightly different error, I think (can't really compare since I couldn't save the old error-message). Anyway, I'm compiling again with easy flags... I'll get back...
Back to top
View user's profile Send private message
_hephaistos_
Advocate
Advocate


Joined: 07 Apr 2004
Posts: 2694
Location: salzburg, austria

PostPosted: Wed Mar 02, 2005 10:09 pm    Post subject: Reply with quote

hey,

could you please post emerge info.
just to make sure...

donk-da!
Back to top
View user's profile Send private message
nightfrost
Apprentice
Apprentice


Joined: 07 Dec 2004
Posts: 293
Location: Sweden

PostPosted: Wed Mar 02, 2005 10:37 pm    Post subject: Reply with quote

hephaistos6 wrote:
hey,

could you please post emerge info.
just to make sure...

donk-da!


ah, sorry... don't have it anymore... but I'm compiling kdemultimedia again, this time with really plain use-flags. It's been going on for a while now, so it might be going all the way. If it fails, I'll make sure to post the emerge info... (I emerged in console, so I couldn't easily copy&paste)...


Hey! It just finnished and it compiled fine! (To bad there are no optimizations though...)
How is it going for you other guys?
Back to top
View user's profile Send private message
Master One
l33t
l33t


Joined: 25 Aug 2003
Posts: 754
Location: Austria

PostPosted: Wed Mar 02, 2005 11:13 pm    Post subject: Reply with quote

nightfrost wrote:
but I'm compiling kdemultimedia again, this time with really plain use-flags. Hey! It just finnished and it compiled fine! (To bad there are no optimizations though...)

Really plain USE-flags? Sorry, but I don't understand, what do USE-flags have to do with compile problems?

And the last time I tried, it made really no difference at all which CFLAGS/CXXFLAGS/LDFLAGS I used for compiling the trouble-makeing-KDE-package, what's why I thought, it can only be a problem with gcc itself, or the compile-flags gcc got compiled with.
_________________
Las torturas mentales de la CIA
Back to top
View user's profile Send private message
firephoto
Veteran
Veteran


Joined: 29 Oct 2003
Posts: 1610
Location: +48° 5' 23.40", -119° 48' 30.00"

PostPosted: Wed Mar 02, 2005 11:15 pm    Post subject: Reply with quote

Master One, post your "emerge info -v"
Back to top
View user's profile Send private message
Display posts from previous:   
Reply to topic    Gentoo Forums Forum Index Desktop Environments All times are GMT
Goto page 1, 2  Next
Page 1 of 2

 
Jump to:  
You cannot post new topics in this forum
You cannot reply to topics in this forum
You cannot edit your posts in this forum
You cannot delete your posts in this forum
You cannot vote in polls in this forum