Gentoo Forums
Gentoo Forums
Gentoo Forums
Quick Search: in
kde-base/rocs-4.11.5 fails at 100% help??
View unanswered posts
View posts from last 24 hours

 
Reply to topic    Gentoo Forums Forum Index Desktop Environments
View previous topic :: View next topic  
Author Message
papapenguin
l33t
l33t


Joined: 20 Sep 2005
Posts: 694
Location: Bellevue

PostPosted: Fri Feb 28, 2014 6:26 pm    Post subject: kde-base/rocs-4.11.5 fails at 100% help?? Reply with quote

I'm not sure what is causing this error...I hope someone can help...I have been having some real problems with my system recently...

Code:
Save/Plugins/gmlFileFormat/GmlGrammar.cpp
/usr/bin/cmake -E cmake_progress_report /var/tmp/portage/kde-base/rocs-4.11.5/work/rocs-4.11.5_build/CMakeFiles 50
[100%] Building CXX object RocsCore/LoadSave/Plugins/gmlFileFormat/CMakeFiles/rocs_gmlfileformat.dir/GmlGraphParsingHelper.cpp.o                                                               
cd /var/tmp/portage/kde-base/rocs-4.11.5/work/rocs-4.11.5_build/RocsCore/LoadSave/Plugins/gmlFileFormat && /usr/bin/x86_64-pc-linux-gnu-g++  -DMAKE_ROCS_GMLFILEFORMAT_LIB -DQT_STL -D_BSD_SOURCE  -DQT_NO_DEBUG -DNDEBUG -march=native -msse3 -O2 -pipe  -Wnon-virtual-dtor -Wno-long-long -Wundef -Wcast-align -Wchar-subscripts -Wall -W -Wpointer-arith -Wformat-security -fno-exceptions -DQT_NO_EXCEPTIONS -fno-check-new -fno-common -Woverloaded-virtual -fno-threadsafe-statics -fvisibility=hidden -fvisibility-inlines-hidden -fexceptions -UQT_NO_EXCEPTIONS -fPIC -I/var/tmp/portage/kde-base/rocs-4.11.5/work/rocs-4.11.5_build/RocsCore/LoadSave/Plugins/gmlFileFormat -I/var/tmp/portage/kde-base/rocs-4.11.5/work/rocs-4.11.5/RocsCore/LoadSave/Plugins/gmlFileFormat -I/var/tmp/portage/kde-base/rocs-4.11.5/work/rocs-4.11.5/RocsCore -I/var/tmp/portage/kde-base/rocs-4.11.5/work/rocs-4.11.5/RocsCore/LoadSave -I/usr/include/KDE -I/usr/include/qt4/QtXmlPatterns -I/usr/include/qt4/QtXml -I/usr/include/qt4/QtWebKit -I/usr/include/qt4/QtUiTools -I/usr/include/qt4/QtTest -I/usr/include/qt4/QtSvg -I/usr/include/qt4/QtSql -I/usr/include/qt4/QtScriptTools -I/usr/include/qt4/QtScript -I/usr/include/qt4/QtOpenGL -I/usr/include/qt4/QtNetwork -I/usr/include/qt4/QtMultimedia -I/usr/include/qt4/QtDesigner -I/usr/include/qt4/QtDeclarative -I/usr/include/qt4/QtDBus -I/usr/include/qt4/Qt3Support -I/usr/include/qt4/QtGui -I/usr/include/qt4/QtCore -I/usr/include/qt4/Qt -I/usr/share/qt4/mkspecs/default -I/usr/include/qt4    -o CMakeFiles/rocs_gmlfileformat.dir/GmlGraphParsingHelper.cpp.o -c /var/tmp/portage/kde-base/rocs-4.11.5/work/rocs-4.11.5/RocsCore/LoadSave/Plugins/gmlFileFormat/GmlGraphParsingHelper.cpp
In file included from /usr/include/boost/spirit/home/classic/core.hpp:17:0,
                 from /usr/include/boost/spirit/include/classic_core.hpp:11,
                 from /var/tmp/portage/kde-base/rocs-4.11.5/work/rocs-4.11.5/RocsCore/LoadSave/Plugins/gmlFileFormat/GmlGraphParsingHelper.cpp:27:
/usr/include/boost/spirit/home/classic/debug.hpp:149:59: fatal error: boost/spirit/home/classic/debug/minimal.hpp: No such file or directory
     #include <boost/spirit/home/classic/debug/minimal.hpp>
                                                           ^
compilation terminated.
RocsCore/LoadSave/Plugins/gmlFileFormat/CMakeFiles/rocs_gmlfileformat.dir/build.make:126: recipe for target 'RocsCore/LoadSave/Plugins/gmlFileFormat/CMakeFiles/rocs_gmlfileformat.dir/GmlGraphParsingHelper.cpp.o' failed
make[2]: *** [RocsCore/LoadSave/Plugins/gmlFileFormat/CMakeFiles/rocs_gmlfileformat.dir/GmlGraphParsingHelper.cpp.o] Error 1
make[2]: *** Waiting for unfinished jobs....
make[2]: Leaving directory '/var/tmp/portage/kde-base/rocs-4.11.5/work/rocs-4.11.5_build'
CMakeFiles/Makefile2:851: recipe for target 'RocsCore/LoadSave/Plugins/gmlFileFormat/CMakeFiles/rocs_gmlfileformat.dir/all' failed
make[1]: *** [RocsCore/LoadSave/Plugins/gmlFileFormat/CMakeFiles/rocs_gmlfileformat.dir/all] Error 2
make[1]: Leaving directory '/var/tmp/portage/kde-base/rocs-4.11.5/work/rocs-4.11.5_build'
Makefile:126: recipe for target 'all' failed
make: *** [all] Error 2
 * ERROR: kde-base/rocs-4.11.5::gentoo failed (compile phase):
 *   emake failed
 *
 * If you need support, post the output of `emerge --info '=kde-base/rocs-4.11.5::gentoo'`,
 * the complete build log and the output of `emerge -pqv '=kde-base/rocs-4.11.5::gentoo'`.
 * The complete build log is located at '/var/tmp/portage/kde-base/rocs-4.11.5/temp/build.log'.
 * The ebuild environment file is located at '/var/tmp/portage/kde-base/rocs-4.11.5/temp/environment'.
 * Working directory: '/var/tmp/portage/kde-base/rocs-4.11.5/work/rocs-4.11.5_build'
 * S: '/var/tmp/portage/kde-base/rocs-4.11.5/work/rocs-4.11.5'

>>> Failed to emerge kde-base/rocs-4.11.5, Log file:

>>>  '/var/tmp/portage/kde-base/rocs-4.11.5/temp/build.log'

 * Messages for package kde-base/konqueror-4.11.5:

 * If you want to use konqueror as a filemanager, install the dolphin kpart:
 * kde-base/dolphin:4/4.11

 * Messages for package kde-base/rocs-4.11.5:

 * ERROR: kde-base/rocs-4.11.5::gentoo failed (compile phase):
 *   emake failed
 *
 * If you need support, post the output of `emerge --info '=kde-base/rocs-4.11.5::gentoo'`,
 * the complete build log and the output of `emerge -pqv '=kde-base/rocs-4.11.5::gentoo'`.
 * The complete build log is located at '/var/tmp/portage/kde-base/rocs-4.11.5/temp/build.log'.
 * The ebuild environment file is located at '/var/tmp/portage/kde-base/rocs-4.11.5/temp/environment'.
 * Working directory: '/var/tmp/portage/kde-base/rocs-4.11.5/work/rocs-4.11.5_build'
 * S: '/var/tmp/portage/kde-base/rocs-4.11.5/work/rocs-4.11.5'

 * GNU info directory index is up-to-date.
 * After world updates, it is important to remove obsolete packages with
 * emerge --depclean. Refer to `man emerge` for more information.

Code:
papapenguin ~ # emerge --info
Portage 2.2.8-r1 (default/linux/amd64/13.0/desktop/kde, gcc-4.8.1, glibc-2.18-r1, 3.10.17-gentoo x86_64)
=================================================================
System uname: Linux-3.10.17-gentoo-x86_64-AMD_Turion-tm-_64_X2_Mobile_Technology_TL-50-with-gentoo-2.2
KiB Mem:     3977684 total,   1435628 free
KiB Swap:    1919760 total,   1719568 free
Timestamp of tree: Mon, 24 Feb 2014 00:45:01 +0000
ld GNU ld (GNU Binutils) 2.24
app-shells/bash:          4.2_p45-r1
dev-java/java-config:     2.2.0
dev-lang/python:          2.7.5-r3, 3.2.5-r3, 3.3.3
dev-util/cmake:           2.8.12.2
dev-util/pkgconfig:       0.28
sys-apps/baselayout:      2.2
sys-apps/openrc:          0.12.4
sys-apps/sandbox:         2.6-r1
sys-devel/autoconf:       2.13, 2.69
sys-devel/automake:       1.11.6, 1.12.6, 1.14.1
sys-devel/binutils:       2.24-r2
sys-devel/gcc:            4.8.1-r1
sys-devel/gcc-config:     1.8
sys-devel/libtool:        2.4.2
sys-devel/make:           4.0-r1
sys-kernel/linux-headers: 3.13 (virtual/os-headers)
sys-libs/glibc:           2.18-r1
Repositories: gentoo proaudio
ACCEPT_KEYWORDS="amd64 ~amd64"
ACCEPT_LICENSE="* -@EULA skype-4.0.0.7-copyright skype-eula dlj-1.1 AdobeFlash-11.x Google-TOS Oracle-BCLA-JavaSE"
CBUILD="x86_64-pc-linux-gnu"
CFLAGS="-march=native -msse3 -O2 -pipe"
CHOST="x86_64-pc-linux-gnu"
CONFIG_PROTECT="/etc /usr/share/config /usr/share/gnupg/qualified.txt /var/lib/hsqldb"
CONFIG_PROTECT_MASK="/etc/ca-certificates.conf /etc/env.d /etc/fonts/fonts.conf /etc/gconf /etc/gentoo-release /etc/php/apache2-php5.5/ext-active/ /etc/php/cgi-php5.5/ext-active/ /etc/php/cli-php5.5/ext-active/ /etc/revdep-rebuild /etc/sandbox.d /etc/terminfo /etc/texmf/language.dat.d /etc/texmf/language.def.d /etc/texmf/updmap.d /etc/texmf/web2c"
CXXFLAGS="-march=native -msse3 -O2 -pipe"
DISTDIR="/usr/portage/distfiles"
EMERGE_DEFAULT_OPTS="--autounmask=n"
FCFLAGS="-O2 -pipe"
FEATURES="assume-digests binpkg-logs config-protect-if-modified distlocks ebuild-locks fixlafiles merge-sync news parallel-fetch preserve-libs protect-owned sandbox sfperms splitdebug strict unknown-features-warn unmerge-logs unmerge-orphans userfetch userpriv usersandbox usersync"
FFLAGS="-O2 -pipe"
GENTOO_MIRRORS="http://distfiles.gentoo.org"
LDFLAGS="-Wl,-O1 -Wl,--as-needed"
MAKEOPTS="-j2"
PKGDIR="/usr/portage/packages"
PORTAGE_CONFIGROOT="/"
PORTAGE_RSYNC_OPTS="--recursive --links --safe-links --perms --times --omit-dir-times --compress --force --whole-file --delete --stats --human-readable --timeout=180 --exclude=/distfiles --exclude=/local --exclude=/packages"
PORTAGE_TMPDIR="/var/tmp"
PORTDIR="/usr/portage"
PORTDIR_OVERLAY="/var/lib/layman/pro-audio"
USE="X a52 aac accessibility acl acpi aim alsa amd64 apache2 apng berkdb bluetooth branding bzip2 cairo caps cdb cdda cddb cdinstall cdparanoia cdr cgi cgid cli consolekit cracklib crypt css cups curl cxx dbus declarative device-mapper dri dts dv dvb dvd dvdr eigen emboss enca encode exif extras fam farstream ffmpeg firefox flac fontconfig fortran fpm freetype ftp gcj gd gdbm gif glib gmp gnutls gpm gsf gstreamer gtk gudev handbook hwdb iconv icu imap ipod ipv6 jabber jack jadetex java javascript jingle jpeg kdcraw kde kdepim kipi kontact kpathsea ladspa laptop lcms ldap libnotify mad matroska melt minizip mmx mng modules mp3 mp4 mpeg mplayer msn mso mssql multilib mysql mysqli ncurses nls nptl nsplugin nvidia objc ogg okular openexr opengl openmp openxr oscar pam pango pcmcia pcre pda pdf pdo perl phonon php plasma png policykit ppds python qt-static qt3support qt4 quicktime raw readline reports rss ruby scanner script sdl secure-delete semantic-desktop session skype snmp source sox speex spell splitdebug sql sse sse2 ssl startup-notification svg syslog tcpd theora threads tidy tiff timidity tools truetype udev udisks unicode upower usb v4l v4l2 vcd video vorbis webkit webpresence wifi win32codecs wv2 wxwidgets x264 xcb xcomposite xetex xine xinerama xml xmlwriter xscreensaver xslt xv xvid yahoo zip zlib" ABI_X86="64" ALSA_CARDS="ali5451 als4000 atiixp atiixp-modem bt87x ca0106 cmipci emu10k1x ens1370 ens1371 es1938 es1968 fm801 hda-intel intel8x0 intel8x0m maestro3 trident usb-audio via82xx via82xx-modem ymfpci" APACHE2_MODULES="authn_core authz_core socache_shmcb unixd actions alias auth_basic authn_alias authn_anon authn_dbm authn_default authn_file authz_dbm authz_default authz_groupfile authz_host authz_owner authz_user autoindex cache cgi cgid dav dav_fs dav_lock deflate dir disk_cache env expires ext_filter file_cache filter headers include info log_config logio mem_cache mime mime_magic negotiation rewrite setenvif speling status unique_id userdir usertrack vhost_alias" CALLIGRA_FEATURES="kexi words flow plan sheets stage tables krita karbon braindump author" CAMERAS="ptp2" COLLECTD_PLUGINS="df interface irq load memory rrdtool swap syslog" ELIBC="glibc" GPSD_PROTOCOLS="ashtech aivdm earthmate evermore fv18 garmin garmintxt gpsclock itrax mtk3301 nmea ntrip navcom oceanserver oldstyle oncore rtcm104v2 rtcm104v3 sirf superstar2 timing tsip tripmate tnt ublox ubx" INPUT_DEVICES="keyboard mouse synaptics evdev" KERNEL="linux" LCD_DEVICES="bayrad cfontz cfontz633 glk hd44780 lb216 lcdm001 mtxorb ncurses text" LIBREOFFICE_EXTENSIONS="presenter-console presenter-minimizer" OFFICE_IMPLEMENTATION="libreoffice" PHP_TARGETS="php5-5" PYTHON_SINGLE_TARGET="python2_7" PYTHON_TARGETS="python2_7 python3_3" RUBY_TARGETS="ruby19 ruby18 ruby21" USERLAND="GNU" VIDEO_CARDS="nvidia v4l" XTABLES_ADDONS="quota2 psd pknock lscan length2 ipv4options ipset ipp2p iface geoip fuzzy condition tee tarpit sysrq steal rawnat logmark ipmark dhcpmac delude chaos account"
Unset:  CPPFLAGS, CTARGET, INSTALL_MASK, LANG, LC_ALL, PORTAGE_BUNZIP2_COMMAND, PORTAGE_COMPRESS, PORTAGE_COMPRESS_FLAGS, PORTAGE_RSYNC_EXTRA_OPTS, SYNC, USE_PYTHON

papapenguin ~ #

_________________
--------------
Compaq Presario V6120US
AMD Turion 64X2
------------------------
Back to top
View user's profile Send private message
papapenguin
l33t
l33t


Joined: 20 Sep 2005
Posts: 694
Location: Bellevue

PostPosted: Sat Mar 01, 2014 5:25 pm    Post subject: Reply with quote

the problem seems to be a
Code:
[RocsCore/LoadSave/Plugins/gmlFileFormat/CMakeFiles/rocs_gmlfileformat.dir/GmlGraphParsingHelper.cpp.o] Error 1

does anyone know what would cause this?

Should I post more system info?
_________________
--------------
Compaq Presario V6120US
AMD Turion 64X2
------------------------
Back to top
View user's profile Send private message
sebB
Apprentice
Apprentice


Joined: 02 Mar 2011
Posts: 245
Location: S.O. France

PostPosted: Mon Mar 03, 2014 9:46 pm    Post subject: Reply with quote

Try re-emerging boost first
Back to top
View user's profile Send private message
papapenguin
l33t
l33t


Joined: 20 Sep 2005
Posts: 694
Location: Bellevue

PostPosted: Tue Mar 04, 2014 6:28 am    Post subject: Reply with quote

dang...just tried that and get:
Code:
    "x86_64-pc-linux-gnu-g++"    -o "bin.v2/libs/wave/build/gcc-4.8/gentoorelease/pch-off/threading-multi/libboost_wave.so.1.52.0" -Wl,-h -Wl,libboost_wave.so.1.52.0 -shared -Wl,--start-group "bin.v2/libs/wave/build/gcc-4.8/gentoorelease/pch-off/threading-multi/instantiate_cpp_exprgrammar.o" "bin.v2/libs/wave/build/gcc-4.8/gentoorelease/pch-off/threading-multi/instantiate_cpp_grammar.o" "bin.v2/libs/wave/build/gcc-4.8/gentoorelease/pch-off/threading-multi/instantiate_cpp_literalgrs.o" "bin.v2/libs/wave/build/gcc-4.8/gentoorelease/pch-off/threading-multi/instantiate_defined_grammar.o" "bin.v2/libs/wave/build/gcc-4.8/gentoorelease/pch-off/threading-multi/instantiate_predef_macros.o" "bin.v2/libs/wave/build/gcc-4.8/gentoorelease/pch-off/threading-multi/instantiate_re2c_lexer.o" "bin.v2/libs/wave/build/gcc-4.8/gentoorelease/pch-off/threading-multi/instantiate_re2c_lexer_str.o" "bin.v2/libs/wave/build/gcc-4.8/gentoorelease/pch-off/threading-multi/token_ids.o" "bin.v2/libs/wave/build/gcc-4.8/gentoorelease/pch-off/threading-multi/wave_config_constant.o" "bin.v2/libs/wave/build/gcc-4.8/gentoorelease/pch-off/threading-multi/cpplexer/re2clex/aq.o" "bin.v2/libs/wave/build/gcc-4.8/gentoorelease/pch-off/threading-multi/cpplexer/re2clex/cpp_re.o" "bin.v2/libs/chrono/build/gcc-4.8/gentoorelease/pch-off/threading-multi/libboost_chrono.so.1.52.0" "bin.v2/libs/date_time/build/gcc-4.8/gentoorelease/pch-off/threading-multi/libboost_date_time.so.1.52.0" "bin.v2/libs/thread/build/gcc-4.8/gentoorelease/pch-off/threading-multi/libboost_thread.so.1.52.0" "bin.v2/libs/filesystem/build/gcc-4.8/gentoorelease/pch-off/threading-multi/libboost_filesystem.so.1.52.0" "bin.v2/libs/system/build/gcc-4.8/gentoorelease/pch-off/threading-multi/libboost_system.so.1.52.0"  -Wl,-Bstatic  -Wl,-Bdynamic -lrt -Wl,--end-group -Wl,-O1 -Wl,--as-needed -pthread

common.copy stage/lib/libboost_wave.so.1.52.0

    cp "bin.v2/libs/wave/build/gcc-4.8/gentoorelease/pch-off/threading-multi/libboost_wave.so.1.52.0"  "stage/lib/libboost_wave.so.1.52.0"

ln-UNIX stage/lib/libboost_wave.so

    ln -f -s 'libboost_wave.so.1.52.0' 'stage/lib/libboost_wave.so'

...failed updating 1 target...
 * ERROR: dev-libs/boost-1.52.0-r6::gentoo failed (compile phase):
 *   Building of Boost libraries failed
 *
 * Call stack:
 *     ebuild.sh, line   93:  Called src_compile
 *   environment, line 3481:  Called python_foreach_impl 'building'
 *   environment, line 3001:  Called multibuild_foreach_variant '_python_multibuild_wrapper' 'building'
 *   environment, line 2316:  Called _multibuild_run '_python_multibuild_wrapper' 'building'
 *   environment, line 2314:  Called _python_multibuild_wrapper 'building'
 *   environment, line  590:  Called building
 *   environment, line 3451:  Called die
 * The specific snippet of code:
 *           ejam ${OPTIONS} $(use python && echo --python-buildid=${EPYTHON#python}) || die "Building of Boost libraries failed";
 *
 * If you need support, post the output of `emerge --info '=dev-libs/boost-1.52.0-r6::gentoo'`,
 * the complete build log and the output of `emerge -pqv '=dev-libs/boost-1.52.0-r6::gentoo'`.
 * The complete build log is located at '/var/tmp/portage/dev-libs/boost-1.52.0-r6/temp/build.log'.
 * The ebuild environment file is located at '/var/tmp/portage/dev-libs/boost-1.52.0-r6/temp/environment'.
 * Working directory: '/var/tmp/portage/dev-libs/boost-1.52.0-r6/work/boost_1_52_0'
 * S: '/var/tmp/portage/dev-libs/boost-1.52.0-r6/work/boost_1_52_0'

>>> Failed to emerge dev-libs/boost-1.52.0-r6, Log file:

>>>  '/var/tmp/portage/dev-libs/boost-1.52.0-r6/temp/build.log'

 * Messages for package dev-libs/boost-1.52.0-r6:

 * ERROR: dev-libs/boost-1.52.0-r6::gentoo failed (compile phase):
 *   Building of Boost libraries failed
 *
 * Call stack:
 *     ebuild.sh, line   93:  Called src_compile
 *   environment, line 3481:  Called python_foreach_impl 'building'
 *   environment, line 3001:  Called multibuild_foreach_variant '_python_multibuild_wrapper' 'building'
 *   environment, line 2316:  Called _multibuild_run '_python_multibuild_wrapper' 'building'
 *   environment, line 2314:  Called _python_multibuild_wrapper 'building'
 *   environment, line  590:  Called building
 *   environment, line 3451:  Called die
 * The specific snippet of code:
 *           ejam ${OPTIONS} $(use python && echo --python-buildid=${EPYTHON#python}) || die "Building of Boost libraries failed";
 *
 * If you need support, post the output of `emerge --info '=dev-libs/boost-1.52.0-r6::gentoo'`,
 * the complete build log and the output of `emerge -pqv '=dev-libs/boost-1.52.0-r6::gentoo'`.
 * The complete build log is located at '/var/tmp/portage/dev-libs/boost-1.52.0-r6/temp/build.log'.
 * The ebuild environment file is located at '/var/tmp/portage/dev-libs/boost-1.52.0-r6/temp/environment'.
 * Working directory: '/var/tmp/portage/dev-libs/boost-1.52.0-r6/work/boost_1_52_0'
 * S: '/var/tmp/portage/dev-libs/boost-1.52.0-r6/work/boost_1_52_0'
papapenguin ~ #

_________________
--------------
Compaq Presario V6120US
AMD Turion 64X2
------------------------
Back to top
View user's profile Send private message
sebB
Apprentice
Apprentice


Joined: 02 Mar 2011
Posts: 245
Location: S.O. France

PostPosted: Tue Mar 04, 2014 8:18 pm    Post subject: Reply with quote

Is your system up to date, because you are mixing a lot stable/unstable ebuilds?
Back to top
View user's profile Send private message
Anon-E-moose
Advocate
Advocate


Joined: 23 May 2008
Posts: 2327
Location: Dallas area

PostPosted: Tue Mar 04, 2014 8:28 pm    Post subject: Reply with quote

papapenguin wrote:
the problem seems to be a
Code:
[RocsCore/LoadSave/Plugins/gmlFileFormat/CMakeFiles/rocs_gmlfileformat.dir/GmlGraphParsingHelper.cpp.o] Error 1

does anyone know what would cause this?

Should I post more system info?

fatal error: boost/spirit/home/classic/debug/minimal.hpp: No such file or directory

#include <boost/spirit/home/classic/debug/minimal.hpp>


Does the file /usr/include/boost/spirit/home/classic/debug/minimal.hpp exist?
_________________
Asus m5a99fx, FX 8320 - amd64-multilib, 3.15.9-zen, glibc-2.17, gcc-4.7.3-r1, eudev
xorg-server-1.16, openbox w/lxpanel, nouveau, oss4
Back to top
View user's profile Send private message
Anon-E-moose
Advocate
Advocate


Joined: 23 May 2008
Posts: 2327
Location: Dallas area

PostPosted: Tue Mar 04, 2014 8:33 pm    Post subject: Reply with quote

papapenguin wrote:
dang...just tried that and get:
Code:
...failed updating 1 target...
 * ERROR: dev-libs/boost-1.52.0-r6::gentoo failed (compile phase):
 *   Building of Boost libraries failed
 *
 * Call stack:
 *     ebuild.sh, line   93:  Called src_compile
 *   environment, line 3481:  Called python_foreach_impl 'building'
 *   environment, line 3001:  Called multibuild_foreach_variant '_python_multibuild_wrapper' 'building'
 *   environment, line 2316:  Called _multibuild_run '_python_multibuild_wrapper' 'building'
 *   environment, line 2314:  Called _python_multibuild_wrapper 'building'
 *   environment, line  590:  Called building
 *   environment, line 3451:  Called die
 * The specific snippet of code:
 *           ejam ${OPTIONS} $(use python && echo --python-buildid=${EPYTHON#python}) || die "Building of Boost libraries failed";
 *


What version of python are you using? what does "eselect python list" return?
_________________
Asus m5a99fx, FX 8320 - amd64-multilib, 3.15.9-zen, glibc-2.17, gcc-4.7.3-r1, eudev
xorg-server-1.16, openbox w/lxpanel, nouveau, oss4
Back to top
View user's profile Send private message
papapenguin
l33t
l33t


Joined: 20 Sep 2005
Posts: 694
Location: Bellevue

PostPosted: Tue Mar 04, 2014 9:11 pm    Post subject: Reply with quote

sebB, I am mixing branches and trying to get back to stable (more or less)...but it is up to date, except for:
Code:
papapenguin ~ # emerge -avuDN world

These are the packages that would be merged, in order:

Calculating dependencies... done!
[ebuild     U  ] kde-base/rocs-4.11.5:4/4.11 [4.11.3:4/4] USE="handbook (-aqua) -debug" 0 kB
[ebuild     UD ] media-libs/mlt-0.8.2 [0.9.0] USE="dv ffmpeg gtk jack kde melt mmx python qt4 quicktime ruby sdl sse sse2 vorbis xine xml -compressed-lumas -debug -frei0r -libsamplerate -lua -rtaudio -swfdec -vdpau (-kdenlive%)" 0 kB
[ebuild  NS    ] dev-java/tomcat-servlet-api-6.0.39:2.5 [4.1.36:2.3] USE="source" 0 kB
[ebuild     U  ] dev-util/dialog-1.2.20140219 [1.2.20140112] USE="nls unicode -examples -minimal -static-libs" 0 kB
[ebuild  NS    ] java-virtuals/servlet-api-2.5-r1:2.5 [2.3:2.3] 0 kB
[ebuild     U  ] dev-db/hsqldb-1.8.1.3-r1 [1.8.1.2-r1] USE="source -doc {-test}" 0 kB
[ebuild     U  ] dev-java/jaxme-0.5.2-r1 [0.5.2] USE="source -doc" 0 kB
[ebuild     U  ] kde-base/kdeedu-meta-4.11.5:4 [4.11.3:4] USE="(-aqua)" 0 kB

Total: 8 packages (5 upgrades, 1 downgrade, 2 in new slots), Size of downloads: 0 kB

WARNING: One or more updates have been skipped due to a dependency conflict:

net-wireless/bluez:0

  (net-wireless/bluez-5.15::gentoo, ebuild scheduled for merge) conflicts with
    <net-wireless/bluez-5 required by (net-libs/libbluedevil-1.9.4::gentoo, installed)


Would you like to merge these packages? [Yes/No] n

Quitting.

papapenguin ~ #

_________________
--------------
Compaq Presario V6120US
AMD Turion 64X2
------------------------
Back to top
View user's profile Send private message
papapenguin
l33t
l33t


Joined: 20 Sep 2005
Posts: 694
Location: Bellevue

PostPosted: Tue Mar 04, 2014 9:15 pm    Post subject: Reply with quote

Anon-E-moose...I don't have that file, and I did just run python-updater
Code:
papapenguin ~ # cat /usr/include/boost/spirit/home/classic/debug/minimal.hpp
cat: /usr/include/boost/spirit/home/classic/debug/minimal.hpp: No such file or directory
papapenguin ~ #

Code:
papapenguin ~ # eselect python list
Available Python interpreters:
  [1]   python2.7
  [2]   python3.2
  [3]   python3.3 *
papapenguin ~ #

_________________
--------------
Compaq Presario V6120US
AMD Turion 64X2
------------------------
Back to top
View user's profile Send private message
Anon-E-moose
Advocate
Advocate


Joined: 23 May 2008
Posts: 2327
Location: Dallas area

PostPosted: Tue Mar 04, 2014 9:26 pm    Post subject: Reply with quote

What does "ls /usr/lib/libboost_python*" return?

What are your useflags for boost "equery u boost"?
_________________
Asus m5a99fx, FX 8320 - amd64-multilib, 3.15.9-zen, glibc-2.17, gcc-4.7.3-r1, eudev
xorg-server-1.16, openbox w/lxpanel, nouveau, oss4
Back to top
View user's profile Send private message
sebB
Apprentice
Apprentice


Joined: 02 Mar 2011
Posts: 245
Location: S.O. France

PostPosted: Tue Mar 04, 2014 9:46 pm    Post subject: Reply with quote

What does emerge @preserved-rebuild say?
Back to top
View user's profile Send private message
papapenguin
l33t
l33t


Joined: 20 Sep 2005
Posts: 694
Location: Bellevue

PostPosted: Tue Mar 04, 2014 10:45 pm    Post subject: Reply with quote

Code:
papapenguin ~ # ls /usr/lib/libboost_python*
/usr/lib/libboost_python-2.7-mt.so      /usr/lib/libboost_python-3.3-mt.so
/usr/lib/libboost_python-2.7.so         /usr/lib/libboost_python-3.3.so
/usr/lib/libboost_python-2.7.so.1.52.0  /usr/lib/libboost_python-3.3.so.1.52.0
papapenguin ~ #

Code:
papapenguin ~ # equery u boost
[ Legend : U - final flag setting for installation]
[        : I - package is installed with flag     ]
[ Colors : set, unset                             ]
 * Found these USE flags for dev-libs/boost-1.52.0-r6:
 U I
 - - debug                    : (Restricted to <dev-libs/boost-1.50.0-r3)
                                Build and install debug versions of the Boost libraries. These
                                libraries are not used by default, and should not be used
                                unless you're developing against Boost.
 - - doc                      : Install the full API documentation documentation. This takes
                                over 200MB of extra disk space.
 + + icu                      : Enable ICU (Internationalization Components for Unicode)
                                support, using dev-libs/icu
 - - mpi                      : Add MPI (Message Passing Interface) layer to the apps that
                                support it
 + + nls                      : Build libboost_locale. This library requires compatible C
                                library interfaces, which might not be provided by uClibc or
                                other embedded libraries.
 + + python                   : Add optional support/bindings for the Python language
 - - python_targets_python2_6 : Build with Python 2.6
 + + python_targets_python2_7 : Build with Python 2.7
 - - python_targets_python3_2 : Build with Python 3.2
 + + python_targets_python3_3 : Build with Python 3.3
 - - static-libs              : Build static versions of dynamic libraries as well
 + + threads                  : Build multi-thread-compatible libraries instead of
                                single-threaded only.
 + + tools                    : Build and install the boost tools (bcp, quickbook, inspect,
                                wave)
papapenguin ~ #

Code:
papapenguin ~ # emerge @preserved-rebuild
Calculating dependencies... done!
>>> Auto-cleaning packages...

>>> No outdated packages were found on your system.
papapenguin ~ #

_________________
--------------
Compaq Presario V6120US
AMD Turion 64X2
------------------------
Back to top
View user's profile Send private message
Anon-E-moose
Advocate
Advocate


Joined: 23 May 2008
Posts: 2327
Location: Dallas area

PostPosted: Tue Mar 04, 2014 11:27 pm    Post subject: Reply with quote

You might try selecting python 2.7 for building boost. "eselect python set 1" and then setting python back to 3.3 after a successful emerge.

Other than that, I don't know. Everything really looks fine.
_________________
Asus m5a99fx, FX 8320 - amd64-multilib, 3.15.9-zen, glibc-2.17, gcc-4.7.3-r1, eudev
xorg-server-1.16, openbox w/lxpanel, nouveau, oss4
Back to top
View user's profile Send private message
papapenguin
l33t
l33t


Joined: 20 Sep 2005
Posts: 694
Location: Bellevue

PostPosted: Wed Mar 05, 2014 9:03 pm    Post subject: Reply with quote

unfortunately that didn't work
_________________
--------------
Compaq Presario V6120US
AMD Turion 64X2
------------------------
Back to top
View user's profile Send private message
sebB
Apprentice
Apprentice


Joined: 02 Mar 2011
Posts: 245
Location: S.O. France

PostPosted: Thu Mar 06, 2014 7:38 pm    Post subject: Reply with quote

Try building boost without the "tools" USE
Back to top
View user's profile Send private message
Display posts from previous:   
Reply to topic    Gentoo Forums Forum Index Desktop Environments All times are GMT
Page 1 of 1

 
Jump to:  
You cannot post new topics in this forum
You cannot reply to topics in this forum
You cannot edit your posts in this forum
You cannot delete your posts in this forum
You cannot vote in polls in this forum