Gentoo Forums
Gentoo Forums
Gentoo Forums
Quick Search: in
error building LightZone from betagarden overlay
View unanswered posts
View posts from last 24 hours

 
Reply to topic    Gentoo Forums Forum Index Unsupported Software
View previous topic :: View next topic  
Author Message
josedb
Apprentice
Apprentice


Joined: 03 Nov 2006
Posts: 167

PostPosted: Mon Jan 20, 2014 6:47 pm    Post subject: error building LightZone from betagarden overlay Reply with quote

This is the error:

Code:
BUILD FAILED
/tmp/portage/media-gfx/LightZone-3.9.1_p20130106-r2/work/LightZone-3.9.1_p20130106/linux/build.xml:20: The following error occurred while executing this line:
/tmp/portage/media-gfx/LightZone-3.9.1_p20130106-r2/work/LightZone-3.9.1_p20130106/lightcrafts/build.xml:60: Execute failed: java.io.IOException: Cannot run program "svn" (in directory "/tmp/portage/media-gfx/LightZone-3.9.1_p20130106-r2/work/LightZone-3.9.1_p20130106/lightcrafts"): java.io.IOException: error=2, No such file or directory
   at java.lang.ProcessBuilder.start(ProcessBuilder.java:470)
   at java.lang.Runtime.exec(Runtime.java:593)
   at org.apache.tools.ant.taskdefs.launcher.Java13CommandLauncher.exec(Java13CommandLauncher.java:41)
   at org.apache.tools.ant.taskdefs.Execute.launch(Execute.java:428)
   at org.apache.tools.ant.taskdefs.Execute.execute(Execute.java:442)
   at org.apache.tools.ant.taskdefs.ExecTask.runExecute(ExecTask.java:628)
   at org.apache.tools.ant.taskdefs.ExecTask.runExec(ExecTask.java:669)
   at org.apache.tools.ant.taskdefs.ExecTask.execute(ExecTask.java:495)
   at org.apache.tools.ant.UnknownElement.execute(UnknownElement.java:292)
   at sun.reflect.GeneratedMethodAccessor4.invoke(Unknown Source)
   at sun.reflect.DelegatingMethodAccessorImpl.invoke(DelegatingMethodAccessorImpl.java:25)
   at java.lang.reflect.Method.invoke(Method.java:597)
   at org.apache.tools.ant.dispatch.DispatchUtils.execute(DispatchUtils.java:106)
   at org.apache.tools.ant.Task.perform(Task.java:348)
   at org.apache.tools.ant.Target.execute(Target.java:435)
   at org.apache.tools.ant.Target.performTasks(Target.java:456)
   at org.apache.tools.ant.Project.executeSortedTargets(Project.java:1393)
   at org.apache.tools.ant.helper.SingleCheckExecutor.executeTargets(SingleCheckExecutor.java:38)
   at org.apache.tools.ant.Project.executeTargets(Project.java:1248)
   at org.apache.tools.ant.taskdefs.Ant.execute(Ant.java:440)
   at org.apache.tools.ant.UnknownElement.execute(UnknownElement.java:292)
   at sun.reflect.NativeMethodAccessorImpl.invoke0(Native Method)
   at sun.reflect.NativeMethodAccessorImpl.invoke(NativeMethodAccessorImpl.java:39)
   at sun.reflect.DelegatingMethodAccessorImpl.invoke(DelegatingMethodAccessorImpl.java:25)
   at java.lang.reflect.Method.invoke(Method.java:597)
   at org.apache.tools.ant.dispatch.DispatchUtils.execute(DispatchUtils.java:106)
   at org.apache.tools.ant.Task.perform(Task.java:348)
   at org.apache.tools.ant.Target.execute(Target.java:435)
   at org.apache.tools.ant.Target.performTasks(Target.java:456)
   at org.apache.tools.ant.Project.executeSortedTargets(Project.java:1393)
   at org.apache.tools.ant.Project.executeTarget(Project.java:1364)
   at org.apache.tools.ant.helper.DefaultExecutor.executeTargets(DefaultExecutor.java:41)
   at org.apache.tools.ant.Project.executeTargets(Project.java:1248)
   at org.apache.tools.ant.Main.runBuild(Main.java:851)
   at org.apache.tools.ant.Main.startAnt(Main.java:235)
   at org.apache.tools.ant.launch.Launcher.run(Launcher.java:280)
   at org.apache.tools.ant.launch.Launcher.main(Launcher.java:109)
Caused by: java.io.IOException: java.io.IOException: error=2, No such file or directory
   at java.lang.UNIXProcess.<init>(UNIXProcess.java:148)
   at java.lang.ProcessImpl.start(ProcessImpl.java:65)
   at java.lang.ProcessBuilder.start(ProcessBuilder.java:452)
   ... 36 more

Total time: 36 seconds
 * ERROR: media-gfx/LightZone-3.9.1_p20130106-r2::betagarden failed (compile phase):
 *   eant failed
 *
 * Call stack:
 *     ebuild.sh, line   93:  Called src_compile
 *   environment, line 3806:  Called eant
 *   environment, line  577:  Called die
 * The specific snippet of code:
 *       ant ${antflags} "${@}" || die "eant failed"
 *
 * If you need support, post the output of `emerge --info '=media-gfx/LightZone-3.9.1_p20130106-r2::betagarden'`,
 * the complete build log and the output of `emerge -pqv '=media-gfx/LightZone-3.9.1_p20130106-r2::betagarden'`.
!!! When you file a bug report, please include the following information:
GENTOO_VM=sun-jdk-1.6  CLASSPATH="" JAVA_HOME="/opt/sun-jdk-1.6.0.45"
JAVACFLAGS="-source 1.6 -target 1.6" COMPILER="javac"
and of course, the output of emerge --info =LightZone-3.9.1_p20130106
 * The complete build log is located at '/tmp/portage/media-gfx/LightZone-3.9.1_p20130106-r2/temp/build.log'.
 * The ebuild environment file is located at '/tmp/portage/media-gfx/LightZone-3.9.1_p20130106-r2/temp/environment'.
 * Working directory: '/tmp/portage/media-gfx/LightZone-3.9.1_p20130106-r2/work/LightZone-3.9.1_p20130106/linux'
 * S: '/tmp/portage/media-gfx/LightZone-3.9.1_p20130106-r2/work/LightZone-3.9.1_p20130106'



emerge --info

Code:
Portage 2.2.7 (default/linux/amd64/13.0/desktop/gnome/systemd, gcc-4.7.3, glibc-2.17, 3.10.25-gentoo x86_64)
=================================================================
System uname: Linux-3.10.25-gentoo-x86_64-Intel-R-_Core-TM-_i5_CPU_M_520_@_2.40GHz-with-gentoo-2.2
KiB Mem:     3840772 total,   2323376 free
KiB Swap:     524284 total,    524284 free
Timestamp of tree: Thu, 16 Jan 2014 17:45:01 +0000
ld GNU ld (GNU Binutils) 2.23.2
app-shells/bash:          4.2_p45
dev-java/java-config:     2.1.12-r1
dev-lang/python:          2.7.5-r3, 3.3.2-r2
dev-util/cmake:           2.8.11.2
dev-util/pkgconfig:       0.28
sys-apps/baselayout:      2.2
sys-apps/openrc:          0.12.4
sys-apps/sandbox:         2.6-r1
sys-devel/autoconf:       2.13, 2.69
sys-devel/automake:       1.11.6, 1.13.4
sys-devel/binutils:       2.23.2
sys-devel/gcc:            4.7.3-r1
sys-devel/gcc-config:     1.7.3
sys-devel/libtool:        2.4.2
sys-devel/make:           3.82-r4
sys-kernel/linux-headers: 3.9 (virtual/os-headers)
sys-libs/glibc:           2.17
Repositories: gentoo steam-overlay betagarden
ACCEPT_KEYWORDS="amd64"
ACCEPT_LICENSE="* -@EULA"
CBUILD="x86_64-pc-linux-gnu"
CFLAGS="-march=native -O2 -pipe"
CHOST="x86_64-pc-linux-gnu"
CONFIG_PROTECT="/etc /usr/share/gnupg/qualified.txt /var/lib/hsqldb"
CONFIG_PROTECT_MASK="/etc/ca-certificates.conf /etc/dconf /etc/env.d /etc/fonts/fonts.conf /etc/gconf /etc/gentoo-release /etc/sandbox.d /etc/terminfo /etc/texmf/language.dat.d /etc/texmf/language.def.d /etc/texmf/updmap.d /etc/texmf/web2c"
CXXFLAGS="-march=native -O2 -pipe"
DISTDIR="/usr/portage/distfiles"
FCFLAGS="-O2 -pipe"
FEATURES="assume-digests binpkg-logs config-protect-if-modified distlocks ebuild-locks fixlafiles merge-sync news parallel-fetch preserve-libs protect-owned sandbox sfperms strict unknown-features-warn unmerge-logs unmerge-orphans userfetch userpriv usersandbox usersync"
FFLAGS="-O2 -pipe"
GENTOO_MIRRORS="http://gentoo.localhost.net.ar/"
LANG="es_ES.utf8"
LDFLAGS="-Wl,-O1 -Wl,--as-needed"
MAKEOPTS="-j5"
PKGDIR="/usr/portage/packages"
PORTAGE_CONFIGROOT="/"
PORTAGE_RSYNC_OPTS="--recursive --links --safe-links --perms --times --omit-dir-times --compress --force --whole-file --delete --stats --human-readable --timeout=180 --exclude=/distfiles --exclude=/local --exclude=/packages"
PORTAGE_TMPDIR="/tmp"
PORTDIR="/usr/portage"
PORTDIR_OVERLAY="/var/lib/layman/steam /var/lib/layman/betagarden"
SYNC="rsync://rsync3.us.gentoo.org/gentoo-portage"
USE="X a52 aac acl acpi alsa amd64 berkdb bindist bluetooth branding bzip2 cairo cdda cdr cli colord cracklib crypt cups cxx dbus dri dts dvd dvdr eds emboss encode evo exif fam firefox flac fortran fuse gdbm gif gnome gnome-keyring gnome-online-accounts gpm gstreamer gtk gtk3 iconv introspection ipv6 jpeg lcms ldap libnotify libsecret lua mad mmx mng modules mp3 mp4 mpeg mudflap multilib nautilus ncurses nls nptl ogg opengl openmp pam pango pcre pdf png policykit ppds pulseaudio qt3support qt4 readline samba sdl session socialweb spell sse sse2 sse3 sse4 ssl startup-notification svg systemd tcpd thinkpad thunderbird tiff truetype udev udisks unicode upower usb vorbis wxwidgets x264 xcb xml xv xvid zlib" ABI_X86="64" ALSA_CARDS="ali5451 als4000 atiixp atiixp-modem bt87x ca0106 cmipci emu10k1x ens1370 ens1371 es1938 es1968 fm801 hda-intel intel8x0 intel8x0m maestro3 trident usb-audio via82xx via82xx-modem ymfpci" APACHE2_MODULES="authn_core authz_core socache_shmcb unixd actions alias auth_basic authn_alias authn_anon authn_dbm authn_default authn_file authz_dbm authz_default authz_groupfile authz_host authz_owner authz_user autoindex cache cgi cgid dav dav_fs dav_lock deflate dir disk_cache env expires ext_filter file_cache filter headers include info log_config logio mem_cache mime mime_magic negotiation rewrite setenvif speling status unique_id userdir usertrack vhost_alias" CALLIGRA_FEATURES="kexi words flow plan sheets stage tables krita karbon braindump author" CAMERAS="ptp2" COLLECTD_PLUGINS="df interface irq load memory rrdtool swap syslog" ELIBC="glibc" GPSD_PROTOCOLS="ashtech aivdm earthmate evermore fv18 garmin garmintxt gpsclock itrax mtk3301 nmea ntrip navcom oceanserver oldstyle oncore rtcm104v2 rtcm104v3 sirf superstar2 timing tsip tripmate tnt ublox ubx" INPUT_DEVICES="synaptics evdev" KERNEL="linux" LCD_DEVICES="bayrad cfontz cfontz633 glk hd44780 lb216 lcdm001 mtxorb ncurses text" LIBREOFFICE_EXTENSIONS="presenter-console presenter-minimizer" LINGUAS="ar es es_AR es_LA" OFFICE_IMPLEMENTATION="libreoffice" PHP_TARGETS="php5-5" PYTHON_SINGLE_TARGET="python2_7" PYTHON_TARGETS="python2_7 python3_3" RUBY_TARGETS="ruby19 ruby18" USERLAND="GNU" VIDEO_CARDS="fbdev glint intel mach64 mga nouveau nv r128 radeon savage sis tdfx trident vesa via vmware dummy v4l" XTABLES_ADDONS="quota2 psd pknock lscan length2 ipv4options ipset ipp2p iface geoip fuzzy condition tee tarpit sysrq steal rawnat logmark ipmark dhcpmac delude chaos account"
Unset:  CPPFLAGS, CTARGET, EMERGE_DEFAULT_OPTS, INSTALL_MASK, LC_ALL, PORTAGE_BUNZIP2_COMMAND, PORTAGE_COMPRESS, PORTAGE_COMPRESS_FLAGS, PORTAGE_RSYNC_EXTRA_OPTS, USE_PYTHON
Back to top
View user's profile Send private message
josedb
Apprentice
Apprentice


Joined: 03 Nov 2006
Posts: 167

PostPosted: Mon Jan 20, 2014 7:03 pm    Post subject: Reply with quote

when installing java i choose 64bits, because my system is. Could this be the problem?
Back to top
View user's profile Send private message
Display posts from previous:   
Reply to topic    Gentoo Forums Forum Index Unsupported Software All times are GMT
Page 1 of 1

 
Jump to:  
You cannot post new topics in this forum
You cannot reply to topics in this forum
You cannot edit your posts in this forum
You cannot delete your posts in this forum
You cannot vote in polls in this forum